jackrabbit-dev mailing list archives

Site index · List index
Message view « Date » · « Thread »
Top « Date » · « Thread »
From Apache Hudson Server <hud...@hudson.zones.apache.org>
Subject Build failed in Hudson: Jackrabbit-trunk-java14 #174
Date Mon, 27 Apr 2009 14:05:20 GMT
See http://hudson.zones.apache.org/hudson/job/Jackrabbit-trunk-java14/174/changes

Changes:

[thomasm] JCR-2067 FileDataStore: only open a stream when really necessary (javadoc)

[thomasm] JCR-2067 FileDataStore: only open a stream when really necessary

------------------------------------------
[...truncated 543 lines...]
Tests run: 4, Failures: 0, Errors: 0, Skipped: 0, Time elapsed: 0.013 sec

Results :

Tests run: 19, Failures: 0, Errors: 0, Skipped: 0

[INFO] [jar:jar]
[INFO] Building jar: http://hudson.zones.apache.org/hudson/job/Jackrabbit-trunk-java14/ws/trunk/jackrabbit-text-extractors/target/jackrabbit-text-extractors-1.6-SNAPSHOT.jar

[INFO] Preparing source:jar
[WARNING] Removing: jar from forked lifecycle, to prevent recursive invocation.
[INFO] No goals needed for project - skipping
[INFO] [source:jar {execution: attach-sources}]
[INFO] Building jar: http://hudson.zones.apache.org/hudson/job/Jackrabbit-trunk-java14/ws/trunk/jackrabbit-text-extractors/target/jackrabbit-text-extractors-1.6-SNAPSHOT-sources.jar

[INFO] [install:install]
[INFO] Installing http://hudson.zones.apache.org/hudson/job/Jackrabbit-trunk-java14/ws/trunk/jackrabbit-text-extractors/target/jackrabbit-text-extractors-1.6-SNAPSHOT.jar
 to /home/hudson/.m2/repository/org/apache/jackrabbit/jackrabbit-text-extractors/1.6-SNAPSHOT/jackrabbit-text-extractors-1.6-SNAPSHOT.jar
[INFO] Installing http://hudson.zones.apache.org/hudson/job/Jackrabbit-trunk-java14/ws/trunk/jackrabbit-text-extractors/target/jackrabbit-text-extractors-1.6-SNAPSHOT-sources.jar
 to /home/hudson/.m2/repository/org/apache/jackrabbit/jackrabbit-text-extractors/1.6-SNAPSHOT/jackrabbit-text-extractors-1.6-SNAPSHOT-sources.jar
[INFO] [maven-one-plugin:install-maven-one-repository {execution: default}]
[INFO] Installing http://hudson.zones.apache.org/hudson/job/Jackrabbit-trunk-java14/ws/trunk/jackrabbit-text-extractors/target/jackrabbit-text-extractors-1.6-SNAPSHOT.jar
 to /home/hudson/.maven/repository/org.apache.jackrabbit/jars/jackrabbit-text-extractors-1.6-SNAPSHOT.jar
[INFO] Installing http://hudson.zones.apache.org/hudson/job/Jackrabbit-trunk-java14/ws/trunk/jackrabbit-text-extractors/target/jackrabbit-text-extractors-1.6-SNAPSHOT-sources.jar
 to /home/hudson/.maven/repository/org.apache.jackrabbit/java-sources/jackrabbit-text-extractors-1.6-SNAPSHOT-sources.jar
[INFO] ------------------------------------------------------------------------
[INFO] Building Jackrabbit Core
[INFO]    task-segment: [clean, install]
[INFO] ------------------------------------------------------------------------
[INFO] [clean:clean]
[INFO] Deleting file set: http://hudson.zones.apache.org/hudson/job/Jackrabbit-trunk-java14/ws/trunk/jackrabbit-core/target
 (included: [**], excluded: [])
[INFO] [resources:resources]
[WARNING] File encoding has not been set, using platform encoding UTF-8, i.e. build is platform
dependent!
[WARNING] Using platform encoding (UTF-8 actually) to copy filtered resources, i.e. build
is platform dependent!
[INFO] Copying 54 resources
[INFO] Copying 1 resource
[INFO] [compiler:compile]
[INFO] Compiling 659 source files to http://hudson.zones.apache.org/hudson/job/Jackrabbit-trunk-java14/ws/trunk/jackrabbit-core/target/classes

[INFO] [resources:testResources]
[WARNING] Using platform encoding (UTF-8 actually) to copy filtered resources, i.e. build
is platform dependent!
[INFO] Copying 11 resources
[INFO] [antrun:run {execution: process-test-resources}]
[INFO] Executing tasks
     [copy] Copying 35 files to http://hudson.zones.apache.org/hudson/job/Jackrabbit-trunk-java14/ws/trunk/jackrabbit-core/target/repository

[INFO] Executed tasks
[INFO] [compiler:testCompile]
[INFO] Compiling 299 source files to http://hudson.zones.apache.org/hudson/job/Jackrabbit-trunk-java14/ws/trunk/jackrabbit-core/target/test-classes

[INFO] [surefire:test]
[INFO] Surefire report directory: http://hudson.zones.apache.org/hudson/job/Jackrabbit-trunk-java14/ws/trunk/jackrabbit-core/target/surefire-reports


-------------------------------------------------------
 T E S T S
-------------------------------------------------------
Running org.apache.jackrabbit.core.version.TestAll
Tests run: 5, Failures: 0, Errors: 0, Skipped: 0, Time elapsed: 6.194 sec
Running org.apache.jackrabbit.core.security.authorization.principalbased.TestAll
Tests run: 77, Failures: 0, Errors: 0, Skipped: 0, Time elapsed: 0.199 sec
Running org.apache.jackrabbit.api.jsr283.TestAll
Tests run: 10, Failures: 0, Errors: 0, Skipped: 0, Time elapsed: 0.371 sec
Running org.apache.jackrabbit.core.security.authorization.acl.TestAll
Tests run: 72, Failures: 0, Errors: 0, Skipped: 0, Time elapsed: 0.137 sec
Running org.apache.jackrabbit.core.config.TestAll
Tests run: 10, Failures: 0, Errors: 0, Skipped: 0, Time elapsed: 0.114 sec
Running org.apache.jackrabbit.core.query.lucene.directory.TestAll
Tests run: 6, Failures: 0, Errors: 0, Skipped: 0, Time elapsed: 0.014 sec
Running org.apache.jackrabbit.core.security.authentication.TestAll
Tests run: 2, Failures: 0, Errors: 0, Skipped: 0, Time elapsed: 0.008 sec
Running org.apache.jackrabbit.core.security.user.TestAll
Tests run: 94, Failures: 0, Errors: 0, Skipped: 0, Time elapsed: 0.464 sec
Running org.apache.jackrabbit.api.jsr283.retention.TestAll
Tests run: 50, Failures: 0, Errors: 0, Skipped: 0, Time elapsed: 1.049 sec
Running org.apache.jackrabbit.core.journal.TestAll
Tests run: 3, Failures: 0, Errors: 0, Skipped: 0, Time elapsed: 0.025 sec
Running org.apache.jackrabbit.api.jsr283.query.qom.TestAll
Tests run: 174, Failures: 0, Errors: 0, Skipped: 0, Time elapsed: 1.983 sec
Running org.apache.jackrabbit.api.security.principal.TestAll
Tests run: 16, Failures: 0, Errors: 0, Skipped: 0, Time elapsed: 0.018 sec
Running org.apache.jackrabbit.core.state.TestAll
Tests run: 15, Failures: 0, Errors: 0, Skipped: 0, Time elapsed: 3.224 sec
Running org.apache.jackrabbit.core.lock.TestAll
Tests run: 1, Failures: 0, Errors: 0, Skipped: 0, Time elapsed: 0.249 sec
Running org.apache.jackrabbit.core.security.TestAll
Tests run: 12, Failures: 0, Errors: 0, Skipped: 0, Time elapsed: 0.021 sec
Running org.apache.jackrabbit.api.jsr283.lock.TestAll
Tests run: 76, Failures: 0, Errors: 0, Skipped: 0, Time elapsed: 1.765 sec
Running org.apache.jackrabbit.core.security.principal.TestAll
Tests run: 2, Failures: 0, Errors: 0, Skipped: 0, Time elapsed: 0.004 sec
Running org.apache.jackrabbit.core.util.TestAll
Tests run: 3, Failures: 0, Errors: 0, Skipped: 0, Time elapsed: 0.362 sec
Running org.apache.jackrabbit.api.jsr283.observation.TestAll
Tests run: 30, Failures: 0, Errors: 0, Skipped: 0, Time elapsed: 11.044 sec
Running org.apache.jackrabbit.api.security.user.TestAll
Tests run: 81, Failures: 0, Errors: 0, Skipped: 0, Time elapsed: 0.105 sec
Running org.apache.jackrabbit.core.cluster.TestAll
Tests run: 9, Failures: 0, Errors: 0, Skipped: 0, Time elapsed: 0.021 sec
Running org.apache.jackrabbit.core.nodetype.xml.TestAll
Tests run: 34, Failures: 0, Errors: 0, Skipped: 0, Time elapsed: 0.233 sec
Running org.apache.jackrabbit.core.TestAll
Tests run: 102, Failures: 0, Errors: 0, Skipped: 0, Time elapsed: 5.357 sec
Running org.apache.jackrabbit.core.security.authorization.combined.TestAll
Tests run: 28, Failures: 0, Errors: 0, Skipped: 0, Time elapsed: 0.039 sec
Running org.apache.jackrabbit.core.xml.TestAll
Tests run: 2, Failures: 0, Errors: 0, Skipped: 0, Time elapsed: 0.015 sec
Running org.apache.jackrabbit.core.observation.TestAll
Tests run: 14, Failures: 0, Errors: 0, Skipped: 0, Time elapsed: 0.356 sec
Running org.apache.jackrabbit.core.retention.TestAll
Tests run: 5, Failures: 0, Errors: 0, Skipped: 0, Time elapsed: 0.018 sec
Running org.apache.jackrabbit.api.jsr283.security.TestAll
Tests run: 78, Failures: 0, Errors: 0, Skipped: 0, Time elapsed: 0.567 sec
Running org.apache.jackrabbit.core.nodetype.TestAll
Tests run: 1, Failures: 0, Errors: 0, Skipped: 0, Time elapsed: 0.173 sec
Running org.apache.jackrabbit.core.nodetype.compact.TestAll
Tests run: 2, Failures: 0, Errors: 0, Skipped: 0, Time elapsed: 0.006 sec
Running org.apache.jackrabbit.core.query.lucene.TestAll
Tests run: 2, Failures: 0, Errors: 0, Skipped: 0, Time elapsed: 8.758 sec
Running org.apache.jackrabbit.core.query.TestAll
Tests run: 146, Failures: 0, Errors: 0, Skipped: 0, Time elapsed: 12.38 sec
Running org.apache.jackrabbit.core.security.authorization.TestAll
Tests run: 24, Failures: 0, Errors: 0, Skipped: 0, Time elapsed: 0.066 sec
Running org.apache.jackrabbit.core.data.TestAll
javax.jcr.RepositoryException: file backing binary value not found: /tmp/bin6375955454170197152.tmp
(Too many open files): /tmp/bin6375955454170197152.tmp (Too many open files)
	at org.apache.jackrabbit.core.value.BLOBInTempFile.getStream(BLOBInTempFile.java:146)
	at org.apache.jackrabbit.core.value.BinaryValueImpl.<init>(BinaryValueImpl.java:37)
	at org.apache.jackrabbit.core.value.InternalValue.toJCRValue(InternalValue.java:380)
	at org.apache.jackrabbit.core.PropertyImpl.getValue(PropertyImpl.java:473)
	at org.apache.jackrabbit.core.data.OpenFilesTest.testStreams(OpenFilesTest.java:42)
	at sun.reflect.NativeMethodAccessorImpl.invoke0(Native Method)
	at sun.reflect.NativeMethodAccessorImpl.invoke(NativeMethodAccessorImpl.java:39)
	at sun.reflect.DelegatingMethodAccessorImpl.invoke(DelegatingMethodAccessorImpl.java:25)
	at java.lang.reflect.Method.invoke(Method.java:324)
	at junit.framework.TestCase.runTest(TestCase.java:154)
	at junit.framework.TestCase.runBare(TestCase.java:127)
	at junit.framework.TestResult$1.protect(TestResult.java:106)
	at junit.framework.TestResult.runProtected(TestResult.java:124)
	at junit.framework.TestResult.run(TestResult.java:109)
	at junit.framework.TestCase.run(TestCase.java:118)
	at org.apache.jackrabbit.test.AbstractJCRTest.run(AbstractJCRTest.java:425)
	at junit.framework.TestSuite.runTest(TestSuite.java:208)
	at junit.framework.TestSuite.run(TestSuite.java:203)
	at junit.framework.TestSuite.runTest(TestSuite.java:208)
	at junit.framework.TestSuite.run(TestSuite.java:203)
	at sun.reflect.GeneratedMethodAccessor7.invoke(Unknown Source)
	at sun.reflect.DelegatingMethodAccessorImpl.invoke(DelegatingMethodAccessorImpl.java:25)
	at java.lang.reflect.Method.invoke(Method.java:324)
	at org.apache.maven.surefire.junit.JUnitTestSet.execute(JUnitTestSet.java:213)
	at org.apache.maven.surefire.suite.AbstractDirectoryTestSuite.executeTestSet(AbstractDirectoryTestSuite.java:140)
	at org.apache.maven.surefire.suite.AbstractDirectoryTestSuite.execute(AbstractDirectoryTestSuite.java:127)
	at org.apache.maven.surefire.Surefire.run(Surefire.java:177)
	at sun.reflect.NativeMethodAccessorImpl.invoke0(Native Method)
	at sun.reflect.NativeMethodAccessorImpl.invoke(NativeMethodAccessorImpl.java:39)
	at sun.reflect.DelegatingMethodAccessorImpl.invoke(DelegatingMethodAccessorImpl.java:25)
	at java.lang.reflect.Method.invoke(Method.java:324)
	at org.apache.maven.surefire.booter.SurefireBooter.runSuitesInProcess(SurefireBooter.java:345)
	at org.apache.maven.surefire.booter.SurefireBooter.main(SurefireBooter.java:1009)
Caused by: java.io.FileNotFoundException: /tmp/bin6375955454170197152.tmp (Too many open files)
	at java.io.FileInputStream.open(Native Method)
	at java.io.FileInputStream.<init>(FileInputStream.java:106)
	at org.apache.jackrabbit.core.value.BLOBInTempFile.getStream(BLOBInTempFile.java:144)
	... 32 more
java.io.FileNotFoundException: /tmp/bin6375955454170197152.tmp (Too many open files)
	at java.io.FileInputStream.open(Native Method)
	at java.io.FileInputStream.<init>(FileInputStream.java:106)
	at org.apache.jackrabbit.core.value.BLOBInTempFile.getStream(BLOBInTempFile.java:144)
	at org.apache.jackrabbit.core.value.BinaryValueImpl.<init>(BinaryValueImpl.java:37)
	at org.apache.jackrabbit.core.value.InternalValue.toJCRValue(InternalValue.java:380)
	at org.apache.jackrabbit.core.PropertyImpl.getValue(PropertyImpl.java:473)
	at org.apache.jackrabbit.core.data.OpenFilesTest.testStreams(OpenFilesTest.java:42)
	at sun.reflect.NativeMethodAccessorImpl.invoke0(Native Method)
	at sun.reflect.NativeMethodAccessorImpl.invoke(NativeMethodAccessorImpl.java:39)
	at sun.reflect.DelegatingMethodAccessorImpl.invoke(DelegatingMethodAccessorImpl.java:25)
	at java.lang.reflect.Method.invoke(Method.java:324)
	at junit.framework.TestCase.runTest(TestCase.java:154)
	at junit.framework.TestCase.runBare(TestCase.java:127)
	at junit.framework.TestResult$1.protect(TestResult.java:106)
	at junit.framework.TestResult.runProtected(TestResult.java:124)
	at junit.framework.TestResult.run(TestResult.java:109)
	at junit.framework.TestCase.run(TestCase.java:118)
	at org.apache.jackrabbit.test.AbstractJCRTest.run(AbstractJCRTest.java:425)
	at junit.framework.TestSuite.runTest(TestSuite.java:208)
	at junit.framework.TestSuite.run(TestSuite.java:203)
	at junit.framework.TestSuite.runTest(TestSuite.java:208)
	at junit.framework.TestSuite.run(TestSuite.java:203)
	at sun.reflect.GeneratedMethodAccessor7.invoke(Unknown Source)
	at sun.reflect.DelegatingMethodAccessorImpl.invoke(DelegatingMethodAccessorImpl.java:25)
	at java.lang.reflect.Method.invoke(Method.java:324)
	at org.apache.maven.surefire.junit.JUnitTestSet.execute(JUnitTestSet.java:213)
	at org.apache.maven.surefire.suite.AbstractDirectoryTestSuite.executeTestSet(AbstractDirectoryTestSuite.java:140)
	at org.apache.maven.surefire.suite.AbstractDirectoryTestSuite.execute(AbstractDirectoryTestSuite.java:127)
	at org.apache.maven.surefire.Surefire.run(Surefire.java:177)
	at sun.reflect.NativeMethodAccessorImpl.invoke0(Native Method)
	at sun.reflect.NativeMethodAccessorImpl.invoke(NativeMethodAccessorImpl.java:39)
	at sun.reflect.DelegatingMethodAccessorImpl.invoke(DelegatingMethodAccessorImpl.java:25)
	at java.lang.reflect.Method.invoke(Method.java:324)
	at org.apache.maven.surefire.booter.SurefireBooter.runSuitesInProcess(SurefireBooter.java:345)
	at org.apache.maven.surefire.booter.SurefireBooter.main(SurefireBooter.java:1009)
java.lang.NoClassDefFoundError: org/apache/jackrabbit/core/data/FileDataStore
	at org.apache.jackrabbit.core.data.DataStoreTest.test(DataStoreTest.java:93)
	at sun.reflect.NativeMethodAccessorImpl.invoke0(Native Method)
	at sun.reflect.NativeMethodAccessorImpl.invoke(NativeMethodAccessorImpl.java:39)
	at sun.reflect.DelegatingMethodAccessorImpl.invoke(DelegatingMethodAccessorImpl.java:25)
	at java.lang.reflect.Method.invoke(Method.java:324)
	at junit.framework.TestCase.runTest(TestCase.java:154)
	at junit.framework.TestCase.runBare(TestCase.java:127)
	at junit.framework.TestResult$1.protect(TestResult.java:106)
	at junit.framework.TestResult.runProtected(TestResult.java:124)
	at junit.framework.TestResult.run(TestResult.java:109)
	at junit.framework.TestCase.run(TestCase.java:118)
	at junit.framework.TestSuite.runTest(TestSuite.java:208)
	at junit.framework.TestSuite.run(TestSuite.java:203)
	at junit.framework.TestSuite.runTest(TestSuite.java:208)
	at junit.framework.TestSuite.run(TestSuite.java:203)
	at sun.reflect.GeneratedMethodAccessor7.invoke(Unknown Source)
	at sun.reflect.DelegatingMethodAccessorImpl.invoke(DelegatingMethodAccessorImpl.java:25)
	at java.lang.reflect.Method.invoke(Method.java:324)
	at org.apache.maven.surefire.junit.JUnitTestSet.execute(JUnitTestSet.java:213)
	at org.apache.maven.surefire.suite.AbstractDirectoryTestSuite.executeTestSet(AbstractDirectoryTestSuite.java:140)
	at org.apache.maven.surefire.suite.AbstractDirectoryTestSuite.execute(AbstractDirectoryTestSuite.java:127)
	at org.apache.maven.surefire.Surefire.run(Surefire.java:177)
	at sun.reflect.NativeMethodAccessorImpl.invoke0(Native Method)
	at sun.reflect.NativeMethodAccessorImpl.invoke(NativeMethodAccessorImpl.java:39)
	at sun.reflect.DelegatingMethodAccessorImpl.invoke(DelegatingMethodAccessorImpl.java:25)
	at java.lang.reflect.Method.invoke(Method.java:324)
	at org.apache.maven.surefire.booter.SurefireBooter.runSuitesInProcess(SurefireBooter.java:345)
	at org.apache.maven.surefire.booter.SurefireBooter.main(SurefireBooter.java:1009)
Tests run: 18, Failures: 1, Errors: 2, Skipped: 0, Time elapsed: 13.652 sec <<< FAILURE!
Running org.apache.jackrabbit.api.jsr283.version.simple.TestAll
Tests run: 19, Failures: 0, Errors: 0, Skipped: 0, Time elapsed: 0.708 sec

Results :

Failed tests: 
  testStreams(org.apache.jackrabbit.core.data.OpenFilesTest)

Tests in error: 
  test(org.apache.jackrabbit.core.data.DataStoreTest)
  testNodeTypesWithBinaryDefaultValue(org.apache.jackrabbit.core.data.NodeTypeTest)

Tests run: 1223, Failures: 1, Errors: 2, Skipped: 0

[INFO] ------------------------------------------------------------------------
[ERROR] BUILD FAILURE
[INFO] ------------------------------------------------------------------------
[INFO] There are test failures.

Please refer to http://hudson.zones.apache.org/hudson/job/Jackrabbit-trunk-java14/ws/trunk/jackrabbit-core/target/surefire-reports
 for the individual test results.
[INFO] ------------------------------------------------------------------------
[INFO] For more information, run Maven with the -e switch
[INFO] ------------------------------------------------------------------------
[INFO] Total time: 1 minute 53 seconds
[INFO] Finished at: Mon Apr 27 06:23:34 GMT-08:00 2009
[INFO] Final Memory: 38M/89M
[INFO] ------------------------------------------------------------------------
[locks-and-latches] Releasing all the locks
[locks-and-latches] All the locks released
Recording test results


Mime
View raw message