jackrabbit-dev mailing list archives

Site index · List index
Message view « Date » · « Thread »
Top « Date » · « Thread »
From Apache Hudson Server <hud...@hudson.zones.apache.org>
Subject Build failed in Hudson: Jackrabbit-1.5-Java14 #26
Date Sun, 22 Feb 2009 01:33:54 GMT
See http://hudson.zones.apache.org/hudson/job/Jackrabbit-1.5-Java14/26/changes

Changes:

[jukka] 1.5: Merged revision 746609 (JCR-1952)

------------------------------------------
[...truncated 400 lines...]
[INFO] Building jar: http://hudson.zones.apache.org/hudson/job/Jackrabbit-1.5-Java14/ws/jackrabbit-1.5/jackrabbit-spi-commons/target/jackrabbit-spi-commons-1.5.0-sources.jar

[INFO] [surefire:test {execution: do_init}]
[INFO] Surefire report directory: http://hudson.zones.apache.org/hudson/job/Jackrabbit-1.5-Java14/ws/jackrabbit-1.5/jackrabbit-spi-commons/target/surefire-reports


-------------------------------------------------------
 T E S T S
-------------------------------------------------------
There are no tests to run.

Results :

Tests run: 0, Failures: 0, Errors: 0, Skipped: 0

[INFO] [surefire:test {execution: do_test}]
[INFO] Surefire report directory: http://hudson.zones.apache.org/hudson/job/Jackrabbit-1.5-Java14/ws/jackrabbit-1.5/jackrabbit-spi-commons/target/surefire-reports


-------------------------------------------------------
 T E S T S
-------------------------------------------------------
There are no tests to run.

Results :

Tests run: 0, Failures: 0, Errors: 0, Skipped: 0

[INFO] [install:install]
[INFO] Installing http://hudson.zones.apache.org/hudson/job/Jackrabbit-1.5-Java14/ws/jackrabbit-1.5/jackrabbit-spi-commons/target/jackrabbit-spi-commons-1.5.0.jar
 to /home/hudson/.m2/repository/org/apache/jackrabbit/jackrabbit-spi-commons/1.5.0/jackrabbit-spi-commons-1.5.0.jar
[INFO] Installing http://hudson.zones.apache.org/hudson/job/Jackrabbit-1.5-Java14/ws/jackrabbit-1.5/jackrabbit-spi-commons/target/jackrabbit-spi-commons-1.5.0-sources.jar
 to /home/hudson/.m2/repository/org/apache/jackrabbit/jackrabbit-spi-commons/1.5.0/jackrabbit-spi-commons-1.5.0-sources.jar
[INFO] [maven-one-plugin:install-maven-one-repository {execution: default}]
[INFO] Installing http://hudson.zones.apache.org/hudson/job/Jackrabbit-1.5-Java14/ws/jackrabbit-1.5/jackrabbit-spi-commons/target/jackrabbit-spi-commons-1.5.0.jar
 to /home/hudson/.maven/repository/org.apache.jackrabbit/jars/jackrabbit-spi-commons-1.5.0.jar
[INFO] Installing http://hudson.zones.apache.org/hudson/job/Jackrabbit-1.5-Java14/ws/jackrabbit-1.5/jackrabbit-spi-commons/target/jackrabbit-spi-commons-1.5.0-sources.jar
 to /home/hudson/.maven/repository/org.apache.jackrabbit/java-sources/jackrabbit-spi-commons-1.5.0-sources.jar
[INFO] ------------------------------------------------------------------------
[INFO] Building Jackrabbit Text Extractors
[INFO]    task-segment: [clean, install]
[INFO] ------------------------------------------------------------------------
[INFO] [clean:clean]
[INFO] Deleting directory http://hudson.zones.apache.org/hudson/job/Jackrabbit-1.5-Java14/ws/jackrabbit-1.5/jackrabbit-text-extractors/target

[INFO] [resources:resources]
[INFO] Using default encoding to copy filtered resources.
[INFO] [compiler:compile]
[INFO] Compiling 19 source files to http://hudson.zones.apache.org/hudson/job/Jackrabbit-1.5-Java14/ws/jackrabbit-1.5/jackrabbit-text-extractors/target/classes

[INFO] [resources:testResources]
[INFO] Using default encoding to copy filtered resources.
[INFO] [compiler:testCompile]
[INFO] Compiling 7 source files to http://hudson.zones.apache.org/hudson/job/Jackrabbit-1.5-Java14/ws/jackrabbit-1.5/jackrabbit-text-extractors/target/test-classes

[INFO] [surefire:test]
[INFO] Surefire report directory: http://hudson.zones.apache.org/hudson/job/Jackrabbit-1.5-Java14/ws/jackrabbit-1.5/jackrabbit-text-extractors/target/surefire-reports


-------------------------------------------------------
 T E S T S
-------------------------------------------------------
Running org.apache.jackrabbit.extractor.RTFTextExtractorTest
Tests run: 1, Failures: 0, Errors: 0, Skipped: 0, Time elapsed: 0.05 sec
Running org.apache.jackrabbit.extractor.EmptyTextExtractorTest
Tests run: 2, Failures: 0, Errors: 0, Skipped: 0, Time elapsed: 0.007 sec
Running org.apache.jackrabbit.extractor.CompositeTextExtractorTest
Tests run: 4, Failures: 0, Errors: 0, Skipped: 0, Time elapsed: 0.086 sec
Running org.apache.jackrabbit.extractor.PngTextExtractorTest
Tests run: 3, Failures: 0, Errors: 0, Skipped: 0, Time elapsed: 0.005 sec
Running org.apache.jackrabbit.extractor.XMLTextExtractorTest
Tests run: 5, Failures: 0, Errors: 0, Skipped: 0, Time elapsed: 0.155 sec
Running org.apache.jackrabbit.extractor.PlainTextExtractorTest
Tests run: 4, Failures: 0, Errors: 0, Skipped: 0, Time elapsed: 0.009 sec

Results :

Tests run: 19, Failures: 0, Errors: 0, Skipped: 0

[INFO] [jar:jar]
[INFO] Building jar: http://hudson.zones.apache.org/hudson/job/Jackrabbit-1.5-Java14/ws/jackrabbit-1.5/jackrabbit-text-extractors/target/jackrabbit-text-extractors-1.5.0.jar

[INFO] Preparing source:jar
[WARNING] Removing: jar from forked lifecycle, to prevent recursive invocation.
[INFO] No goals needed for project - skipping
[INFO] [source:jar {execution: attach-sources}]
[INFO] Building jar: http://hudson.zones.apache.org/hudson/job/Jackrabbit-1.5-Java14/ws/jackrabbit-1.5/jackrabbit-text-extractors/target/jackrabbit-text-extractors-1.5.0-sources.jar

[INFO] [install:install]
[INFO] Installing http://hudson.zones.apache.org/hudson/job/Jackrabbit-1.5-Java14/ws/jackrabbit-1.5/jackrabbit-text-extractors/target/jackrabbit-text-extractors-1.5.0.jar
 to /home/hudson/.m2/repository/org/apache/jackrabbit/jackrabbit-text-extractors/1.5.0/jackrabbit-text-extractors-1.5.0.jar
[INFO] Installing http://hudson.zones.apache.org/hudson/job/Jackrabbit-1.5-Java14/ws/jackrabbit-1.5/jackrabbit-text-extractors/target/jackrabbit-text-extractors-1.5.0-sources.jar
 to /home/hudson/.m2/repository/org/apache/jackrabbit/jackrabbit-text-extractors/1.5.0/jackrabbit-text-extractors-1.5.0-sources.jar
[INFO] [maven-one-plugin:install-maven-one-repository {execution: default}]
[INFO] Installing http://hudson.zones.apache.org/hudson/job/Jackrabbit-1.5-Java14/ws/jackrabbit-1.5/jackrabbit-text-extractors/target/jackrabbit-text-extractors-1.5.0.jar
 to /home/hudson/.maven/repository/org.apache.jackrabbit/jars/jackrabbit-text-extractors-1.5.0.jar
[INFO] Installing http://hudson.zones.apache.org/hudson/job/Jackrabbit-1.5-Java14/ws/jackrabbit-1.5/jackrabbit-text-extractors/target/jackrabbit-text-extractors-1.5.0-sources.jar
 to /home/hudson/.maven/repository/org.apache.jackrabbit/java-sources/jackrabbit-text-extractors-1.5.0-sources.jar
[INFO] ------------------------------------------------------------------------
[INFO] Building Jackrabbit Core
[INFO]    task-segment: [clean, install]
[INFO] ------------------------------------------------------------------------
[INFO] [clean:clean]
[INFO] Deleting directory http://hudson.zones.apache.org/hudson/job/Jackrabbit-1.5-Java14/ws/jackrabbit-1.5/jackrabbit-core/target

[INFO] [javacc:jjtree-javacc {execution: fulltext}]
Java Compiler Compiler Version 4.0 (Tree Builder)
(type "jjtree" with no arguments for help)
Reading from file http://hudson.zones.apache.org/hudson/job/Jackrabbit-1.5-Java14/ws/jackrabbit-1.5/jackrabbit-core/src/main/javacc/fulltext/QueryParser.jjt
 . . .
File "http://hudson.zones.apache.org/hudson/job/Jackrabbit-1.5-Java14/ws/jackrabbit-1.5/jackrabbit-core/target/generated-sources/jjtree/org/apache/jackrabbit/core/query/lucene/fulltext/Node.java"
 does not exist.  Will create one.
File "http://hudson.zones.apache.org/hudson/job/Jackrabbit-1.5-Java14/ws/jackrabbit-1.5/jackrabbit-core/target/generated-sources/jjtree/org/apache/jackrabbit/core/query/lucene/fulltext/SimpleNode.java"
 does not exist.  Will create one.
Annotated grammar generated successfully in http://hudson.zones.apache.org/hudson/job/Jackrabbit-1.5-Java14/ws/jackrabbit-1.5/jackrabbit-core/target/generated-sources/jjtree/org/apache/jackrabbit/core/query/lucene/fulltext/QueryParser.jj

Java Compiler Compiler Version 4.0 (Parser Generator)
(type "javacc" with no arguments for help)
Reading from file http://hudson.zones.apache.org/hudson/job/Jackrabbit-1.5-Java14/ws/jackrabbit-1.5/jackrabbit-core/target/generated-sources/jjtree/org/apache/jackrabbit/core/query/lucene/fulltext/QueryParser.jj
 . . .
File "TokenMgrError.java" does not exist.  Will create one.
File "ParseException.java" does not exist.  Will create one.
File "Token.java" does not exist.  Will create one.
File "CharStream.java" does not exist.  Will create one.
Parser generated successfully.
[INFO] Processed 1 grammar
[INFO] [resources:resources]
[INFO] Using default encoding to copy filtered resources.
[INFO] [compiler:compile]
[INFO] Compiling 600 source files to http://hudson.zones.apache.org/hudson/job/Jackrabbit-1.5-Java14/ws/jackrabbit-1.5/jackrabbit-core/target/classes

[INFO] [resources:testResources]
[INFO] Using default encoding to copy filtered resources.
[INFO] [antrun:run {execution: process-test-resources}]
[INFO] Executing tasks
     [copy] Copying 35 files to http://hudson.zones.apache.org/hudson/job/Jackrabbit-1.5-Java14/ws/jackrabbit-1.5/jackrabbit-core/target/repository

[INFO] Executed tasks
[INFO] [compiler:testCompile]
[INFO] Compiling 220 source files to http://hudson.zones.apache.org/hudson/job/Jackrabbit-1.5-Java14/ws/jackrabbit-1.5/jackrabbit-core/target/test-classes

[INFO] [surefire:test]
[INFO] Surefire report directory: http://hudson.zones.apache.org/hudson/job/Jackrabbit-1.5-Java14/ws/jackrabbit-1.5/jackrabbit-core/target/surefire-reports


-------------------------------------------------------
 T E S T S
-------------------------------------------------------
Running org.apache.jackrabbit.core.version.TestAll
Tests run: 5, Failures: 0, Errors: 0, Skipped: 0, Time elapsed: 6.366 sec
Running org.apache.jackrabbit.core.query.qom.TestAll
Tests run: 157, Failures: 0, Errors: 0, Skipped: 0, Time elapsed: 1.504 sec
Running org.apache.jackrabbit.core.security.authorization.principalbased.TestAll
Tests run: 47, Failures: 0, Errors: 0, Skipped: 0, Time elapsed: 0.09 sec
Running org.apache.jackrabbit.core.config.TestAll
Tests run: 10, Failures: 0, Errors: 0, Skipped: 0, Time elapsed: 0.163 sec
Running org.apache.jackrabbit.core.security.authorization.acl.TestAll
Tests run: 48, Failures: 0, Errors: 0, Skipped: 0, Time elapsed: 0.075 sec
Running org.apache.jackrabbit.core.security.user.TestAll
Tests run: 90, Failures: 0, Errors: 0, Skipped: 0, Time elapsed: 0.357 sec
Running org.apache.jackrabbit.core.security.authentication.TestAll
Tests run: 2, Failures: 0, Errors: 0, Skipped: 0, Time elapsed: 0.01 sec
Running org.apache.jackrabbit.core.journal.TestAll
Tests run: 3, Failures: 0, Errors: 0, Skipped: 0, Time elapsed: 0.032 sec
Running org.apache.jackrabbit.api.security.principal.TestAll
Tests run: 16, Failures: 0, Errors: 0, Skipped: 0, Time elapsed: 0.026 sec
Running org.apache.jackrabbit.core.state.TestAll
Tests run: 11, Failures: 0, Errors: 0, Skipped: 0, Time elapsed: 2.429 sec
Running org.apache.jackrabbit.core.security.TestAll
Tests run: 12, Failures: 0, Errors: 0, Skipped: 0, Time elapsed: 0.031 sec
Running org.apache.jackrabbit.core.security.principal.TestAll
Tests run: 2, Failures: 0, Errors: 0, Skipped: 0, Time elapsed: 0.008 sec
Running org.apache.jackrabbit.core.util.TestAll
Tests run: 3, Failures: 0, Errors: 0, Skipped: 0, Time elapsed: 89.245 sec
Running org.apache.jackrabbit.api.security.user.TestAll
Tests run: 79, Failures: 0, Errors: 0, Skipped: 0, Time elapsed: 0.107 sec
Running org.apache.jackrabbit.core.nodetype.xml.TestAll
Tests run: 34, Failures: 0, Errors: 0, Skipped: 0, Time elapsed: 0.301 sec
Running org.apache.jackrabbit.core.cluster.TestAll
Tests run: 9, Failures: 0, Errors: 0, Skipped: 0, Time elapsed: 0.032 sec
Running org.apache.jackrabbit.core.TestAll
Tests run: 87, Failures: 0, Errors: 0, Skipped: 0, Time elapsed: 3.867 sec
Running org.apache.jackrabbit.core.security.authorization.combined.TestAll
Tests run: 24, Failures: 0, Errors: 0, Skipped: 0, Time elapsed: 0.033 sec
Running org.apache.jackrabbit.core.xml.TestAll
Tests run: 2, Failures: 0, Errors: 0, Skipped: 0, Time elapsed: 0.019 sec
Running org.apache.jackrabbit.core.observation.TestAll
Tests run: 11, Failures: 0, Errors: 0, Skipped: 0, Time elapsed: 0.281 sec
Running org.apache.jackrabbit.api.jsr283.security.TestAll
Tests run: 66, Failures: 0, Errors: 0, Skipped: 0, Time elapsed: 0.272 sec
Running org.apache.jackrabbit.core.nodetype.compact.TestAll
Tests run: 2, Failures: 0, Errors: 0, Skipped: 0, Time elapsed: 0.014 sec
Running org.apache.jackrabbit.core.query.lucene.TestAll
Tests run: 1, Failures: 0, Errors: 0, Skipped: 0, Time elapsed: 1.425 sec
Running org.apache.jackrabbit.core.query.TestAll
Tests run: 133, Failures: 0, Errors: 0, Skipped: 0, Time elapsed: 13.065 sec
Running org.apache.jackrabbit.core.security.authorization.TestAll
Tests run: 20, Failures: 0, Errors: 0, Skipped: 0, Time elapsed: 0.045 sec
Running org.apache.jackrabbit.core.data.TestAll
Tests run: 15, Failures: 0, Errors: 0, Skipped: 0, Time elapsed: 11.385 sec

Results :

Tests run: 889, Failures: 0, Errors: 0, Skipped: 0

[INFO] [jar:jar]
[INFO] Building jar: http://hudson.zones.apache.org/hudson/job/Jackrabbit-1.5-Java14/ws/jackrabbit-1.5/jackrabbit-core/target/jackrabbit-core-1.5.3-SNAPSHOT.jar

[INFO] Preparing source:jar
[WARNING] Removing: jar from forked lifecycle, to prevent recursive invocation.
[INFO] [javacc:jjtree-javacc {execution: fulltext}]
[INFO] Skipping - all parsers are up to date
[INFO] [source:jar {execution: attach-sources}]
[INFO] Building jar: http://hudson.zones.apache.org/hudson/job/Jackrabbit-1.5-Java14/ws/jackrabbit-1.5/jackrabbit-core/target/jackrabbit-core-1.5.3-SNAPSHOT-sources.jar

[INFO] [surefire:test {execution: do_init}]
[INFO] Surefire report directory: http://hudson.zones.apache.org/hudson/job/Jackrabbit-1.5-Java14/ws/jackrabbit-1.5/jackrabbit-core/target/surefire-reports


-------------------------------------------------------
 T E S T S
-------------------------------------------------------
Running org.apache.jackrabbit.core.integration.PrepareTestRepository
Tests run: 1, Failures: 0, Errors: 0, Skipped: 0, Time elapsed: 4.451 sec

Results :

Tests run: 1, Failures: 0, Errors: 0, Skipped: 0

[INFO] [surefire:test {execution: do_test}]
[INFO] Surefire report directory: http://hudson.zones.apache.org/hudson/job/Jackrabbit-1.5-Java14/ws/jackrabbit-1.5/jackrabbit-core/target/surefire-reports


-------------------------------------------------------
 T E S T S
-------------------------------------------------------
Running org.apache.jackrabbit.core.integration.MassiveWildcardTest
Tests run: 1, Failures: 0, Errors: 0, Skipped: 0, Time elapsed: 93.753 sec
Running org.apache.jackrabbit.core.integration.GQLTest
Tests run: 15, Failures: 0, Errors: 0, Skipped: 0, Time elapsed: 0.338 sec
Running org.apache.jackrabbit.core.integration.NodeImplTest
Tests run: 2, Failures: 0, Errors: 0, Skipped: 0, Time elapsed: 0.088 sec
Running org.apache.jackrabbit.core.integration.MassiveRangeTest
Tests run: 1, Failures: 0, Errors: 0, Skipped: 0, Time elapsed: 4.08 sec
Running org.apache.jackrabbit.core.integration.JCRAPITest
Tests run: 1038, Failures: 0, Errors: 4, Skipped: 0, Time elapsed: 21.378 sec <<<
FAILURE!
Running org.apache.jackrabbit.core.integration.VersioningTest
Tests run: 1, Failures: 0, Errors: 0, Skipped: 0, Time elapsed: 0.139 sec
Running org.apache.jackrabbit.core.integration.ConcurrentQueryTest
Tests run: 2, Failures: 0, Errors: 0, Skipped: 0, Time elapsed: 3.751 sec
Running org.apache.jackrabbit.core.integration.AxisQueryTest
Tests run: 1, Failures: 0, Errors: 0, Skipped: 0, Time elapsed: 10.378 sec
Running org.apache.jackrabbit.core.integration.SessionImplTest
Tests run: 1, Failures: 0, Errors: 0, Skipped: 0, Time elapsed: 0.002 sec

Results :

Tests in error: 
  testExportSysView_stream_session_skipBinary_recurse(org.apache.jackrabbit.test.api.ExportSysViewTest)
  testExportSysView_stream_session_skipBinary_noRecurse(org.apache.jackrabbit.test.api.ExportSysViewTest)
  testExportSysView_stream_session_saveBinary_noRecurse(org.apache.jackrabbit.test.api.ExportSysViewTest)
  testExportSysView_stream_session_saveBinary_recurse(org.apache.jackrabbit.test.api.ExportSysViewTest)

Tests run: 1062, Failures: 0, Errors: 4, Skipped: 0

[INFO] ------------------------------------------------------------------------
[ERROR] BUILD FAILURE
[INFO] ------------------------------------------------------------------------
[INFO] There are test failures.

Please refer to http://hudson.zones.apache.org/hudson/job/Jackrabbit-1.5-Java14/ws/jackrabbit-1.5/jackrabbit-core/target/surefire-reports
 for the individual test results.
[INFO] ------------------------------------------------------------------------
[INFO] For more information, run Maven with the -e switch
[INFO] ------------------------------------------------------------------------
[INFO] Total time: 7 minutes 59 seconds
[INFO] Finished at: Sat Feb 21 17:43:33 GMT-08:00 2009
[INFO] Final Memory: 25M/63M
[INFO] ------------------------------------------------------------------------
[locks-and-latches] Releasing all the locks
[locks-and-latches] All the locks released


Mime
View raw message