jackrabbit-dev mailing list archives

Site index · List index
Message view « Date » · « Thread »
Top « Date » · « Thread »
From Apache Hudson Server <hud...@hudson.zones.apache.org>
Subject Build failed in Hudson: Jackrabbit-trunk-java14 #90
Date Sun, 22 Feb 2009 02:35:00 GMT
See http://hudson.zones.apache.org/hudson/job/Jackrabbit-trunk-java14/90/changes

Changes:

[jukka] JCR-1952: DOMException: NAMESPACE_ERR thrown when exporting document view

Need to keep emitting explicit xmlns attributes for the ContentHandler exports. The TCK (and
possibly other clients also) depends on that at least on Sun's Java 1.4.

------------------------------------------
[...truncated 377 lines...]
Running org.apache.jackrabbit.spi.commons.name.PatternTest
Tests run: 13, Failures: 0, Errors: 0, Skipped: 0, Time elapsed: 0.029 sec

Results :

Tests run: 208, Failures: 0, Errors: 0, Skipped: 0

[INFO] [jar:jar]
[INFO] Building jar: /zonestorage/hudson/home/hudson/hudson/jobs/Jackrabbit-trunk-java14/workspace/trunk/jackrabbit-spi-commons/target/jackrabbit-spi-commons-1.6-SNAPSHOT.jar
[INFO] Preparing source:jar
[WARNING] Removing: jar from forked lifecycle, to prevent recursive invocation.
[INFO] [javacc:jjtree-javacc {execution: sql}]
[INFO] Skipping - all parsers are up to date
[INFO] [javacc:jjtree-javacc {execution: xpath}]
[INFO] Skipping - all parsers are up to date
[INFO] [source:jar {execution: attach-sources}]
[INFO] Building jar: /zonestorage/hudson/home/hudson/hudson/jobs/Jackrabbit-trunk-java14/workspace/trunk/jackrabbit-spi-commons/target/jackrabbit-spi-commons-1.6-SNAPSHOT-sources.jar
[INFO] [install:install]
[INFO] Installing /zonestorage/hudson/home/hudson/hudson/jobs/Jackrabbit-trunk-java14/workspace/trunk/jackrabbit-spi-commons/target/jackrabbit-spi-commons-1.6-SNAPSHOT.jar
to /export/home/hudson/.m2/repository/org/apache/jackrabbit/jackrabbit-spi-commons/1.6-SNAPSHOT/jackrabbit-spi-commons-1.6-SNAPSHOT.jar
[INFO] Installing /zonestorage/hudson/home/hudson/hudson/jobs/Jackrabbit-trunk-java14/workspace/trunk/jackrabbit-spi-commons/target/jackrabbit-spi-commons-1.6-SNAPSHOT-sources.jar
to /export/home/hudson/.m2/repository/org/apache/jackrabbit/jackrabbit-spi-commons/1.6-SNAPSHOT/jackrabbit-spi-commons-1.6-SNAPSHOT-sources.jar
[INFO] [maven-one-plugin:install-maven-one-repository {execution: default}]
[INFO] Installing /zonestorage/hudson/home/hudson/hudson/jobs/Jackrabbit-trunk-java14/workspace/trunk/jackrabbit-spi-commons/target/jackrabbit-spi-commons-1.6-SNAPSHOT.jar
to /export/home/hudson/.maven/repository/org.apache.jackrabbit/jars/jackrabbit-spi-commons-1.6-SNAPSHOT.jar
[INFO] Installing /zonestorage/hudson/home/hudson/hudson/jobs/Jackrabbit-trunk-java14/workspace/trunk/jackrabbit-spi-commons/target/jackrabbit-spi-commons-1.6-SNAPSHOT-sources.jar
to /export/home/hudson/.maven/repository/org.apache.jackrabbit/java-sources/jackrabbit-spi-commons-1.6-SNAPSHOT-sources.jar
[INFO] ------------------------------------------------------------------------
[INFO] Building Jackrabbit Text Extractors
[INFO]    task-segment: [clean, install]
[INFO] ------------------------------------------------------------------------
[INFO] [clean:clean]
[INFO] Deleting file set: /zonestorage/hudson/home/hudson/hudson/jobs/Jackrabbit-trunk-java14/workspace/trunk/jackrabbit-text-extractors/target
(included: [**], excluded: [])
[INFO] [resources:resources]
[WARNING] Using platform encoding (ISO646-US actually) to copy filtered resources, i.e. build
is platform dependent!
[INFO] Copying 2 resources
[INFO] [compiler:compile]
[INFO] Compiling 19 source files to /zonestorage/hudson/home/hudson/hudson/jobs/Jackrabbit-trunk-java14/workspace/trunk/jackrabbit-text-extractors/target/classes
[INFO] [resources:testResources]
[WARNING] Using platform encoding (ISO646-US actually) to copy filtered resources, i.e. build
is platform dependent!
[INFO] Copying 2 resources
[INFO] [compiler:testCompile]
[INFO] Compiling 7 source files to /zonestorage/hudson/home/hudson/hudson/jobs/Jackrabbit-trunk-java14/workspace/trunk/jackrabbit-text-extractors/target/test-classes
[INFO] [surefire:test]
[INFO] Surefire report directory: /zonestorage/hudson/home/hudson/hudson/jobs/Jackrabbit-trunk-java14/workspace/trunk/jackrabbit-text-extractors/target/surefire-reports

-------------------------------------------------------
 T E S T S
-------------------------------------------------------
Running org.apache.jackrabbit.extractor.RTFTextExtractorTest
Tests run: 1, Failures: 0, Errors: 0, Skipped: 0, Time elapsed: 1.38 sec
Running org.apache.jackrabbit.extractor.EmptyTextExtractorTest
Tests run: 2, Failures: 0, Errors: 0, Skipped: 0, Time elapsed: 0.009 sec
Running org.apache.jackrabbit.extractor.CompositeTextExtractorTest
Tests run: 4, Failures: 0, Errors: 0, Skipped: 0, Time elapsed: 0.114 sec
Running org.apache.jackrabbit.extractor.PngTextExtractorTest
Tests run: 3, Failures: 0, Errors: 0, Skipped: 0, Time elapsed: 0.008 sec
Running org.apache.jackrabbit.extractor.XMLTextExtractorTest
Tests run: 5, Failures: 0, Errors: 0, Skipped: 0, Time elapsed: 0.195 sec
Running org.apache.jackrabbit.extractor.PlainTextExtractorTest
Tests run: 4, Failures: 0, Errors: 0, Skipped: 0, Time elapsed: 0.01 sec

Results :

Tests run: 19, Failures: 0, Errors: 0, Skipped: 0

[INFO] [jar:jar]
[INFO] Building jar: /zonestorage/hudson/home/hudson/hudson/jobs/Jackrabbit-trunk-java14/workspace/trunk/jackrabbit-text-extractors/target/jackrabbit-text-extractors-1.6-SNAPSHOT.jar
[INFO] Preparing source:jar
[WARNING] Removing: jar from forked lifecycle, to prevent recursive invocation.
[INFO] No goals needed for project - skipping
[INFO] [source:jar {execution: attach-sources}]
[INFO] Building jar: /zonestorage/hudson/home/hudson/hudson/jobs/Jackrabbit-trunk-java14/workspace/trunk/jackrabbit-text-extractors/target/jackrabbit-text-extractors-1.6-SNAPSHOT-sources.jar
[INFO] [install:install]
[INFO] Installing /zonestorage/hudson/home/hudson/hudson/jobs/Jackrabbit-trunk-java14/workspace/trunk/jackrabbit-text-extractors/target/jackrabbit-text-extractors-1.6-SNAPSHOT.jar
to /export/home/hudson/.m2/repository/org/apache/jackrabbit/jackrabbit-text-extractors/1.6-SNAPSHOT/jackrabbit-text-extractors-1.6-SNAPSHOT.jar
[INFO] Installing /zonestorage/hudson/home/hudson/hudson/jobs/Jackrabbit-trunk-java14/workspace/trunk/jackrabbit-text-extractors/target/jackrabbit-text-extractors-1.6-SNAPSHOT-sources.jar
to /export/home/hudson/.m2/repository/org/apache/jackrabbit/jackrabbit-text-extractors/1.6-SNAPSHOT/jackrabbit-text-extractors-1.6-SNAPSHOT-sources.jar
[INFO] [maven-one-plugin:install-maven-one-repository {execution: default}]
[INFO] Installing /zonestorage/hudson/home/hudson/hudson/jobs/Jackrabbit-trunk-java14/workspace/trunk/jackrabbit-text-extractors/target/jackrabbit-text-extractors-1.6-SNAPSHOT.jar
to /export/home/hudson/.maven/repository/org.apache.jackrabbit/jars/jackrabbit-text-extractors-1.6-SNAPSHOT.jar
[INFO] Installing /zonestorage/hudson/home/hudson/hudson/jobs/Jackrabbit-trunk-java14/workspace/trunk/jackrabbit-text-extractors/target/jackrabbit-text-extractors-1.6-SNAPSHOT-sources.jar
to /export/home/hudson/.maven/repository/org.apache.jackrabbit/java-sources/jackrabbit-text-extractors-1.6-SNAPSHOT-sources.jar
[INFO] ------------------------------------------------------------------------
[INFO] Building Jackrabbit Core
[INFO]    task-segment: [clean, install]
[INFO] ------------------------------------------------------------------------
[INFO] [clean:clean]
[INFO] Deleting file set: /zonestorage/hudson/home/hudson/hudson/jobs/Jackrabbit-trunk-java14/workspace/trunk/jackrabbit-core/target
(included: [**], excluded: [])
[INFO] [resources:resources]
[WARNING] File encoding has not been set, using platform encoding ISO646-US, i.e. build is
platform dependent!
[WARNING] Using platform encoding (ISO646-US actually) to copy filtered resources, i.e. build
is platform dependent!
[INFO] Copying 52 resources
[INFO] Copying 1 resource
[INFO] [compiler:compile]
[INFO] Compiling 605 source files to /zonestorage/hudson/home/hudson/hudson/jobs/Jackrabbit-trunk-java14/workspace/trunk/jackrabbit-core/target/classes
[INFO] [resources:testResources]
[WARNING] Using platform encoding (ISO646-US actually) to copy filtered resources, i.e. build
is platform dependent!
[INFO] Copying 12 resources
[INFO] [antrun:run {execution: process-test-resources}]
[INFO] Executing tasks
     [copy] Copying 35 files to /zonestorage/hudson/home/hudson/hudson/jobs/Jackrabbit-trunk-java14/workspace/trunk/jackrabbit-core/target/repository
[INFO] Executed tasks
[INFO] [compiler:testCompile]
[INFO] Compiling 268 source files to /zonestorage/hudson/home/hudson/hudson/jobs/Jackrabbit-trunk-java14/workspace/trunk/jackrabbit-core/target/test-classes
[INFO] [surefire:test]
[INFO] Surefire report directory: /zonestorage/hudson/home/hudson/hudson/jobs/Jackrabbit-trunk-java14/workspace/trunk/jackrabbit-core/target/surefire-reports

-------------------------------------------------------
 T E S T S
-------------------------------------------------------
Running org.apache.jackrabbit.core.query.qom.TestAll
Tests run: 157, Failures: 0, Errors: 0, Skipped: 0, Time elapsed: 11.537 sec
Running org.apache.jackrabbit.core.version.TestAll
Tests run: 5, Failures: 0, Errors: 0, Skipped: 0, Time elapsed: 2.079 sec
Running org.apache.jackrabbit.core.security.authorization.principalbased.TestAll
Tests run: 74, Failures: 0, Errors: 0, Skipped: 0, Time elapsed: 0.2 sec
Running org.apache.jackrabbit.api.jsr283.TestAll
Tests run: 7, Failures: 0, Errors: 0, Skipped: 0, Time elapsed: 0.144 sec
Running org.apache.jackrabbit.core.config.TestAll
Tests run: 10, Failures: 0, Errors: 0, Skipped: 0, Time elapsed: 0.237 sec
Running org.apache.jackrabbit.core.security.authorization.acl.TestAll
Tests run: 71, Failures: 0, Errors: 0, Skipped: 0, Time elapsed: 0.176 sec
Running org.apache.jackrabbit.core.query.lucene.directory.TestAll
Tests run: 6, Failures: 0, Errors: 0, Skipped: 0, Time elapsed: 0.018 sec
Running org.apache.jackrabbit.core.security.authentication.TestAll
Tests run: 2, Failures: 0, Errors: 0, Skipped: 0, Time elapsed: 0.012 sec
Running org.apache.jackrabbit.core.security.user.TestAll
Tests run: 92, Failures: 0, Errors: 0, Skipped: 0, Time elapsed: 0.386 sec
Running org.apache.jackrabbit.api.jsr283.retention.TestAll
Tests run: 50, Failures: 0, Errors: 0, Skipped: 0, Time elapsed: 0.666 sec
Running org.apache.jackrabbit.core.journal.TestAll
Tests run: 3, Failures: 0, Errors: 0, Skipped: 0, Time elapsed: 0.185 sec
Running org.apache.jackrabbit.api.security.principal.TestAll
Tests run: 16, Failures: 0, Errors: 0, Skipped: 0, Time elapsed: 0.024 sec
Running org.apache.jackrabbit.core.state.TestAll
Tests run: 13, Failures: 0, Errors: 0, Skipped: 0, Time elapsed: 3.545 sec
Running org.apache.jackrabbit.core.lock.TestAll
Tests run: 1, Failures: 0, Errors: 0, Skipped: 0, Time elapsed: 0.016 sec
Running org.apache.jackrabbit.core.security.TestAll
Tests run: 12, Failures: 0, Errors: 0, Skipped: 0, Time elapsed: 0.031 sec
Running org.apache.jackrabbit.api.jsr283.lock.TestAll
Tests run: 69, Failures: 0, Errors: 0, Skipped: 0, Time elapsed: 1.221 sec
Running org.apache.jackrabbit.core.security.principal.TestAll
Tests run: 2, Failures: 0, Errors: 0, Skipped: 0, Time elapsed: 0.006 sec
Running org.apache.jackrabbit.core.util.TestAll
Tests run: 3, Failures: 0, Errors: 0, Skipped: 0, Time elapsed: 0.009 sec
Running org.apache.jackrabbit.api.security.user.TestAll
Tests run: 81, Failures: 0, Errors: 0, Skipped: 0, Time elapsed: 0.187 sec
Running org.apache.jackrabbit.core.cluster.TestAll
Tests run: 9, Failures: 0, Errors: 0, Skipped: 0, Time elapsed: 0.035 sec
Running org.apache.jackrabbit.core.nodetype.xml.TestAll
Tests run: 34, Failures: 0, Errors: 0, Skipped: 0, Time elapsed: 0.368 sec
Running org.apache.jackrabbit.core.TestAll
Tests run: 100, Failures: 0, Errors: 0, Skipped: 0, Time elapsed: 5.378 sec
Running org.apache.jackrabbit.core.security.authorization.combined.TestAll
Tests run: 27, Failures: 0, Errors: 0, Skipped: 0, Time elapsed: 0.066 sec
Running org.apache.jackrabbit.core.xml.TestAll
Tests run: 2, Failures: 0, Errors: 0, Skipped: 0, Time elapsed: 0.024 sec
Running org.apache.jackrabbit.core.observation.TestAll
Tests run: 25, Failures: 0, Errors: 0, Skipped: 0, Time elapsed: 0.939 sec
Running org.apache.jackrabbit.core.retention.TestAll
Tests run: 5, Failures: 0, Errors: 0, Skipped: 0, Time elapsed: 0.018 sec
Running org.apache.jackrabbit.api.jsr283.security.TestAll
Tests run: 75, Failures: 0, Errors: 0, Skipped: 0, Time elapsed: 0.808 sec
Running org.apache.jackrabbit.core.nodetype.TestAll
Tests run: 1, Failures: 0, Errors: 0, Skipped: 0, Time elapsed: 0.307 sec
Running org.apache.jackrabbit.core.nodetype.compact.TestAll
Tests run: 2, Failures: 0, Errors: 0, Skipped: 0, Time elapsed: 0.014 sec
Running org.apache.jackrabbit.core.query.lucene.TestAll
Tests run: 1, Failures: 0, Errors: 0, Skipped: 0, Time elapsed: 1.878 sec
Running org.apache.jackrabbit.core.query.TestAll
Tests run: 143, Failures: 0, Errors: 0, Skipped: 0, Time elapsed: 16.075 sec
Running org.apache.jackrabbit.core.security.authorization.TestAll
Tests run: 22, Failures: 0, Errors: 0, Skipped: 0, Time elapsed: 0.092 sec
Running org.apache.jackrabbit.core.data.TestAll
Tests run: 16, Failures: 0, Errors: 0, Skipped: 0, Time elapsed: 24.398 sec

Results :

Tests run: 1136, Failures: 0, Errors: 0, Skipped: 0

[INFO] [jar:jar]
[INFO] Building jar: /zonestorage/hudson/home/hudson/hudson/jobs/Jackrabbit-trunk-java14/workspace/trunk/jackrabbit-core/target/jackrabbit-core-1.6-SNAPSHOT.jar
[INFO] Preparing source:jar
[WARNING] Removing: jar from forked lifecycle, to prevent recursive invocation.
[INFO] No goals needed for project - skipping
[INFO] [source:jar {execution: attach-sources}]
[INFO] Building jar: /zonestorage/hudson/home/hudson/hudson/jobs/Jackrabbit-trunk-java14/workspace/trunk/jackrabbit-core/target/jackrabbit-core-1.6-SNAPSHOT-sources.jar
[INFO] [surefire:test {execution: do_init}]
[INFO] Surefire report directory: /zonestorage/hudson/home/hudson/hudson/jobs/Jackrabbit-trunk-java14/workspace/trunk/jackrabbit-core/target/surefire-reports

-------------------------------------------------------
 T E S T S
-------------------------------------------------------
Running org.apache.jackrabbit.core.integration.PrepareTestRepository
Tests run: 1, Failures: 0, Errors: 0, Skipped: 0, Time elapsed: 6.722 sec

Results :

Tests run: 1, Failures: 0, Errors: 0, Skipped: 0

[INFO] [surefire:test {execution: do_test}]
[INFO] Surefire report directory: /zonestorage/hudson/home/hudson/hudson/jobs/Jackrabbit-trunk-java14/workspace/trunk/jackrabbit-core/target/surefire-reports

-------------------------------------------------------
 T E S T S
-------------------------------------------------------
Running org.apache.jackrabbit.core.integration.MassiveWildcardTest
Tests run: 1, Failures: 0, Errors: 0, Skipped: 0, Time elapsed: 17.843 sec
Running org.apache.jackrabbit.core.integration.RestoreSameNameSiblingTest
Tests run: 1, Failures: 0, Errors: 0, Skipped: 0, Time elapsed: 0.147 sec
Running org.apache.jackrabbit.core.integration.GQLTest
Tests run: 17, Failures: 0, Errors: 0, Skipped: 0, Time elapsed: 0.625 sec
Running org.apache.jackrabbit.core.integration.NodeImplTest
Tests run: 2, Failures: 0, Errors: 0, Skipped: 0, Time elapsed: 0.041 sec
Running org.apache.jackrabbit.core.integration.MassiveRangeTest
Tests run: 1, Failures: 0, Errors: 0, Skipped: 0, Time elapsed: 5.366 sec
Running org.apache.jackrabbit.core.integration.JCRAPITest
Tests run: 1038, Failures: 0, Errors: 4, Skipped: 0, Time elapsed: 32.09 sec <<<
FAILURE!
Running org.apache.jackrabbit.core.integration.VersioningTest
Tests run: 1, Failures: 0, Errors: 0, Skipped: 0, Time elapsed: 0.577 sec
Running org.apache.jackrabbit.core.integration.RepositoryFactoryImplTest
Tests run: 6, Failures: 0, Errors: 0, Skipped: 0, Time elapsed: 19.184 sec
Running org.apache.jackrabbit.core.integration.ConcurrentQueryTest
Tests run: 2, Failures: 0, Errors: 0, Skipped: 0, Time elapsed: 5.788 sec
Running org.apache.jackrabbit.core.integration.AxisQueryTest
Tests run: 1, Failures: 0, Errors: 0, Skipped: 0, Time elapsed: 11.042 sec
Running org.apache.jackrabbit.core.integration.SessionImplTest
Tests run: 2, Failures: 0, Errors: 0, Skipped: 0, Time elapsed: 0.006 sec

Results :

Tests in error: 
  testExportSysView_stream_session_skipBinary_recurse(org.apache.jackrabbit.test.api.ExportSysViewTest)
  testExportSysView_stream_session_skipBinary_noRecurse(org.apache.jackrabbit.test.api.ExportSysViewTest)
  testExportSysView_stream_session_saveBinary_noRecurse(org.apache.jackrabbit.test.api.ExportSysViewTest)
  testExportSysView_stream_session_saveBinary_recurse(org.apache.jackrabbit.test.api.ExportSysViewTest)

Tests run: 1072, Failures: 0, Errors: 4, Skipped: 0

[INFO] ------------------------------------------------------------------------
[ERROR] BUILD FAILURE
[INFO] ------------------------------------------------------------------------
[INFO] There are test failures.

Please refer to /zonestorage/hudson/home/hudson/hudson/jobs/Jackrabbit-trunk-java14/workspace/trunk/jackrabbit-core/target/surefire-reports
for the individual test results.
[INFO] ------------------------------------------------------------------------
[INFO] For more information, run Maven with the -e switch
[INFO] ------------------------------------------------------------------------
[INFO] Total time: 5 minutes 17 seconds
[INFO] Finished at: Sun Feb 22 02:33:15 UTC 2009
[INFO] Final Memory: 36M/88M
[INFO] ------------------------------------------------------------------------
[locks-and-latches] Releasing all the locks
[locks-and-latches] All the locks released
Recording test results


Mime
View raw message