jackrabbit-dev mailing list archives

Site index · List index
Message view « Date » · « Thread »
Top « Date » · « Thread »
From Apache Hudson Server <hud...@hudson.zones.apache.org>
Subject Build failed in Hudson: Jackrabbit-1.5-Java14 #25
Date Sun, 22 Feb 2009 01:21:16 GMT
See http://hudson.zones.apache.org/hudson/job/Jackrabbit-1.5-Java14/25/changes

Changes:

[jukka] 1.5: Upgrade jcr-commons version to 1.5.3-SNAPSHOT

[jukka] 1.5: Merged revisions 746602 and 746603 (JCR-1952). Ignored other revisions.

------------------------------------------
[...truncated 416 lines...]

Results :

Tests run: 0, Failures: 0, Errors: 0, Skipped: 0

[INFO] [surefire:test {execution: do_test}]
[INFO] Surefire report directory: http://hudson.zones.apache.org/hudson/job/Jackrabbit-1.5-Java14/ws/jackrabbit-1.5/jackrabbit-spi-commons/target/surefire-reports


-------------------------------------------------------
 T E S T S
-------------------------------------------------------
There are no tests to run.

Results :

Tests run: 0, Failures: 0, Errors: 0, Skipped: 0

[INFO] [install:install]
[INFO] Installing http://hudson.zones.apache.org/hudson/job/Jackrabbit-1.5-Java14/ws/jackrabbit-1.5/jackrabbit-spi-commons/target/jackrabbit-spi-commons-1.5.0.jar
 to /home/hudson/.m2/repository/org/apache/jackrabbit/jackrabbit-spi-commons/1.5.0/jackrabbit-spi-commons-1.5.0.jar
[INFO] Installing http://hudson.zones.apache.org/hudson/job/Jackrabbit-1.5-Java14/ws/jackrabbit-1.5/jackrabbit-spi-commons/target/jackrabbit-spi-commons-1.5.0-sources.jar
 to /home/hudson/.m2/repository/org/apache/jackrabbit/jackrabbit-spi-commons/1.5.0/jackrabbit-spi-commons-1.5.0-sources.jar
[INFO] [maven-one-plugin:install-maven-one-repository {execution: default}]
[INFO] Installing http://hudson.zones.apache.org/hudson/job/Jackrabbit-1.5-Java14/ws/jackrabbit-1.5/jackrabbit-spi-commons/target/jackrabbit-spi-commons-1.5.0.jar
 to /home/hudson/.maven/repository/org.apache.jackrabbit/jars/jackrabbit-spi-commons-1.5.0.jar
[INFO] Installing http://hudson.zones.apache.org/hudson/job/Jackrabbit-1.5-Java14/ws/jackrabbit-1.5/jackrabbit-spi-commons/target/jackrabbit-spi-commons-1.5.0-sources.jar
 to /home/hudson/.maven/repository/org.apache.jackrabbit/java-sources/jackrabbit-spi-commons-1.5.0-sources.jar
[INFO] ------------------------------------------------------------------------
[INFO] Building Jackrabbit Text Extractors
[INFO]    task-segment: [clean, install]
[INFO] ------------------------------------------------------------------------
[INFO] [clean:clean]
[INFO] Deleting directory http://hudson.zones.apache.org/hudson/job/Jackrabbit-1.5-Java14/ws/jackrabbit-1.5/jackrabbit-text-extractors/target

[INFO] [resources:resources]
[INFO] Using default encoding to copy filtered resources.
[INFO] [compiler:compile]
[INFO] Compiling 19 source files to http://hudson.zones.apache.org/hudson/job/Jackrabbit-1.5-Java14/ws/jackrabbit-1.5/jackrabbit-text-extractors/target/classes

[INFO] [resources:testResources]
[INFO] Using default encoding to copy filtered resources.
[INFO] [compiler:testCompile]
[INFO] Compiling 7 source files to http://hudson.zones.apache.org/hudson/job/Jackrabbit-1.5-Java14/ws/jackrabbit-1.5/jackrabbit-text-extractors/target/test-classes

[INFO] [surefire:test]
[INFO] Surefire report directory: http://hudson.zones.apache.org/hudson/job/Jackrabbit-1.5-Java14/ws/jackrabbit-1.5/jackrabbit-text-extractors/target/surefire-reports


-------------------------------------------------------
 T E S T S
-------------------------------------------------------
Running org.apache.jackrabbit.extractor.RTFTextExtractorTest
Tests run: 1, Failures: 0, Errors: 0, Skipped: 0, Time elapsed: 0.215 sec
Running org.apache.jackrabbit.extractor.EmptyTextExtractorTest
Tests run: 2, Failures: 0, Errors: 0, Skipped: 0, Time elapsed: 0.006 sec
Running org.apache.jackrabbit.extractor.CompositeTextExtractorTest
Tests run: 4, Failures: 0, Errors: 0, Skipped: 0, Time elapsed: 0.084 sec
Running org.apache.jackrabbit.extractor.PngTextExtractorTest
Tests run: 3, Failures: 0, Errors: 0, Skipped: 0, Time elapsed: 0.005 sec
Running org.apache.jackrabbit.extractor.XMLTextExtractorTest
Tests run: 5, Failures: 0, Errors: 0, Skipped: 0, Time elapsed: 0.151 sec
Running org.apache.jackrabbit.extractor.PlainTextExtractorTest
Tests run: 4, Failures: 0, Errors: 0, Skipped: 0, Time elapsed: 0.009 sec

Results :

Tests run: 19, Failures: 0, Errors: 0, Skipped: 0

[INFO] [jar:jar]
[INFO] Building jar: http://hudson.zones.apache.org/hudson/job/Jackrabbit-1.5-Java14/ws/jackrabbit-1.5/jackrabbit-text-extractors/target/jackrabbit-text-extractors-1.5.0.jar

[INFO] Preparing source:jar
[WARNING] Removing: jar from forked lifecycle, to prevent recursive invocation.
[INFO] No goals needed for project - skipping
[INFO] [source:jar {execution: attach-sources}]
[INFO] Building jar: http://hudson.zones.apache.org/hudson/job/Jackrabbit-1.5-Java14/ws/jackrabbit-1.5/jackrabbit-text-extractors/target/jackrabbit-text-extractors-1.5.0-sources.jar

[INFO] [install:install]
[INFO] Installing http://hudson.zones.apache.org/hudson/job/Jackrabbit-1.5-Java14/ws/jackrabbit-1.5/jackrabbit-text-extractors/target/jackrabbit-text-extractors-1.5.0.jar
 to /home/hudson/.m2/repository/org/apache/jackrabbit/jackrabbit-text-extractors/1.5.0/jackrabbit-text-extractors-1.5.0.jar
[INFO] Installing http://hudson.zones.apache.org/hudson/job/Jackrabbit-1.5-Java14/ws/jackrabbit-1.5/jackrabbit-text-extractors/target/jackrabbit-text-extractors-1.5.0-sources.jar
 to /home/hudson/.m2/repository/org/apache/jackrabbit/jackrabbit-text-extractors/1.5.0/jackrabbit-text-extractors-1.5.0-sources.jar
[INFO] [maven-one-plugin:install-maven-one-repository {execution: default}]
[INFO] Installing http://hudson.zones.apache.org/hudson/job/Jackrabbit-1.5-Java14/ws/jackrabbit-1.5/jackrabbit-text-extractors/target/jackrabbit-text-extractors-1.5.0.jar
 to /home/hudson/.maven/repository/org.apache.jackrabbit/jars/jackrabbit-text-extractors-1.5.0.jar
[INFO] Installing http://hudson.zones.apache.org/hudson/job/Jackrabbit-1.5-Java14/ws/jackrabbit-1.5/jackrabbit-text-extractors/target/jackrabbit-text-extractors-1.5.0-sources.jar
 to /home/hudson/.maven/repository/org.apache.jackrabbit/java-sources/jackrabbit-text-extractors-1.5.0-sources.jar
[INFO] ------------------------------------------------------------------------
[INFO] Building Jackrabbit Core
[INFO]    task-segment: [clean, install]
[INFO] ------------------------------------------------------------------------
[INFO] [clean:clean]
[INFO] Deleting directory http://hudson.zones.apache.org/hudson/job/Jackrabbit-1.5-Java14/ws/jackrabbit-1.5/jackrabbit-core/target

[INFO] [javacc:jjtree-javacc {execution: fulltext}]
Java Compiler Compiler Version 4.0 (Tree Builder)
(type "jjtree" with no arguments for help)
Reading from file http://hudson.zones.apache.org/hudson/job/Jackrabbit-1.5-Java14/ws/jackrabbit-1.5/jackrabbit-core/src/main/javacc/fulltext/QueryParser.jjt
 . . .
File "http://hudson.zones.apache.org/hudson/job/Jackrabbit-1.5-Java14/ws/jackrabbit-1.5/jackrabbit-core/target/generated-sources/jjtree/org/apache/jackrabbit/core/query/lucene/fulltext/Node.java"
 does not exist.  Will create one.
File "http://hudson.zones.apache.org/hudson/job/Jackrabbit-1.5-Java14/ws/jackrabbit-1.5/jackrabbit-core/target/generated-sources/jjtree/org/apache/jackrabbit/core/query/lucene/fulltext/SimpleNode.java"
 does not exist.  Will create one.
Annotated grammar generated successfully in http://hudson.zones.apache.org/hudson/job/Jackrabbit-1.5-Java14/ws/jackrabbit-1.5/jackrabbit-core/target/generated-sources/jjtree/org/apache/jackrabbit/core/query/lucene/fulltext/QueryParser.jj

Java Compiler Compiler Version 4.0 (Parser Generator)
(type "javacc" with no arguments for help)
Reading from file http://hudson.zones.apache.org/hudson/job/Jackrabbit-1.5-Java14/ws/jackrabbit-1.5/jackrabbit-core/target/generated-sources/jjtree/org/apache/jackrabbit/core/query/lucene/fulltext/QueryParser.jj
 . . .
File "TokenMgrError.java" does not exist.  Will create one.
File "ParseException.java" does not exist.  Will create one.
File "Token.java" does not exist.  Will create one.
File "CharStream.java" does not exist.  Will create one.
Parser generated successfully.
[INFO] Processed 1 grammar
[INFO] [resources:resources]
[INFO] Using default encoding to copy filtered resources.
[INFO] [compiler:compile]
[INFO] Compiling 600 source files to http://hudson.zones.apache.org/hudson/job/Jackrabbit-1.5-Java14/ws/jackrabbit-1.5/jackrabbit-core/target/classes

[INFO] [resources:testResources]
[INFO] Using default encoding to copy filtered resources.
[INFO] [antrun:run {execution: process-test-resources}]
[INFO] Executing tasks
     [copy] Copying 35 files to http://hudson.zones.apache.org/hudson/job/Jackrabbit-1.5-Java14/ws/jackrabbit-1.5/jackrabbit-core/target/repository

[INFO] Executed tasks
[INFO] [compiler:testCompile]
[INFO] Compiling 220 source files to http://hudson.zones.apache.org/hudson/job/Jackrabbit-1.5-Java14/ws/jackrabbit-1.5/jackrabbit-core/target/test-classes

[INFO] [surefire:test]
[INFO] Surefire report directory: http://hudson.zones.apache.org/hudson/job/Jackrabbit-1.5-Java14/ws/jackrabbit-1.5/jackrabbit-core/target/surefire-reports


-------------------------------------------------------
 T E S T S
-------------------------------------------------------
Running org.apache.jackrabbit.core.version.TestAll
Tests run: 5, Failures: 0, Errors: 0, Skipped: 0, Time elapsed: 5.253 sec
Running org.apache.jackrabbit.core.query.qom.TestAll
Tests run: 157, Failures: 0, Errors: 0, Skipped: 0, Time elapsed: 1.513 sec
Running org.apache.jackrabbit.core.security.authorization.principalbased.TestAll
Tests run: 47, Failures: 0, Errors: 0, Skipped: 0, Time elapsed: 0.091 sec
Running org.apache.jackrabbit.core.config.TestAll
Tests run: 10, Failures: 0, Errors: 0, Skipped: 0, Time elapsed: 0.164 sec
Running org.apache.jackrabbit.core.security.authorization.acl.TestAll
Tests run: 48, Failures: 0, Errors: 0, Skipped: 0, Time elapsed: 0.074 sec
Running org.apache.jackrabbit.core.security.user.TestAll
Tests run: 90, Failures: 0, Errors: 0, Skipped: 0, Time elapsed: 0.357 sec
Running org.apache.jackrabbit.core.security.authentication.TestAll
Tests run: 2, Failures: 0, Errors: 0, Skipped: 0, Time elapsed: 0.009 sec
Running org.apache.jackrabbit.core.journal.TestAll
Tests run: 3, Failures: 0, Errors: 0, Skipped: 0, Time elapsed: 0.034 sec
Running org.apache.jackrabbit.api.security.principal.TestAll
Tests run: 16, Failures: 0, Errors: 0, Skipped: 0, Time elapsed: 0.021 sec
Running org.apache.jackrabbit.core.state.TestAll
Tests run: 11, Failures: 0, Errors: 0, Skipped: 0, Time elapsed: 2.43 sec
Running org.apache.jackrabbit.core.security.TestAll
Tests run: 12, Failures: 0, Errors: 0, Skipped: 0, Time elapsed: 0.036 sec
Running org.apache.jackrabbit.core.security.principal.TestAll
Tests run: 2, Failures: 0, Errors: 0, Skipped: 0, Time elapsed: 0.007 sec
Running org.apache.jackrabbit.core.util.TestAll
Tests run: 3, Failures: 0, Errors: 0, Skipped: 0, Time elapsed: 0.057 sec
Running org.apache.jackrabbit.api.security.user.TestAll
Tests run: 79, Failures: 0, Errors: 0, Skipped: 0, Time elapsed: 0.105 sec
Running org.apache.jackrabbit.core.nodetype.xml.TestAll
Tests run: 34, Failures: 0, Errors: 0, Skipped: 0, Time elapsed: 0.266 sec
Running org.apache.jackrabbit.core.cluster.TestAll
Tests run: 9, Failures: 0, Errors: 0, Skipped: 0, Time elapsed: 0.031 sec
Running org.apache.jackrabbit.core.TestAll
Tests run: 87, Failures: 0, Errors: 0, Skipped: 0, Time elapsed: 3.807 sec
Running org.apache.jackrabbit.core.security.authorization.combined.TestAll
Tests run: 24, Failures: 0, Errors: 0, Skipped: 0, Time elapsed: 0.035 sec
Running org.apache.jackrabbit.core.xml.TestAll
Tests run: 2, Failures: 0, Errors: 0, Skipped: 0, Time elapsed: 0.024 sec
Running org.apache.jackrabbit.core.observation.TestAll
Tests run: 11, Failures: 0, Errors: 0, Skipped: 0, Time elapsed: 0.283 sec
Running org.apache.jackrabbit.api.jsr283.security.TestAll
Tests run: 66, Failures: 0, Errors: 0, Skipped: 0, Time elapsed: 0.274 sec
Running org.apache.jackrabbit.core.nodetype.compact.TestAll
Tests run: 2, Failures: 0, Errors: 0, Skipped: 0, Time elapsed: 0.018 sec
Running org.apache.jackrabbit.core.query.lucene.TestAll
Tests run: 1, Failures: 0, Errors: 0, Skipped: 0, Time elapsed: 1.442 sec
Running org.apache.jackrabbit.core.query.TestAll
Tests run: 133, Failures: 0, Errors: 0, Skipped: 0, Time elapsed: 13.55 sec
Running org.apache.jackrabbit.core.security.authorization.TestAll
Tests run: 20, Failures: 0, Errors: 0, Skipped: 0, Time elapsed: 0.046 sec
Running org.apache.jackrabbit.core.data.TestAll
Tests run: 15, Failures: 0, Errors: 0, Skipped: 0, Time elapsed: 11.128 sec

Results :

Tests run: 889, Failures: 0, Errors: 0, Skipped: 0

[INFO] [jar:jar]
[INFO] Building jar: http://hudson.zones.apache.org/hudson/job/Jackrabbit-1.5-Java14/ws/jackrabbit-1.5/jackrabbit-core/target/jackrabbit-core-1.5.3-SNAPSHOT.jar

[INFO] Preparing source:jar
[WARNING] Removing: jar from forked lifecycle, to prevent recursive invocation.
[INFO] [javacc:jjtree-javacc {execution: fulltext}]
[INFO] Skipping - all parsers are up to date
[INFO] [source:jar {execution: attach-sources}]
[INFO] Building jar: http://hudson.zones.apache.org/hudson/job/Jackrabbit-1.5-Java14/ws/jackrabbit-1.5/jackrabbit-core/target/jackrabbit-core-1.5.3-SNAPSHOT-sources.jar

[INFO] [surefire:test {execution: do_init}]
[INFO] Surefire report directory: http://hudson.zones.apache.org/hudson/job/Jackrabbit-1.5-Java14/ws/jackrabbit-1.5/jackrabbit-core/target/surefire-reports


-------------------------------------------------------
 T E S T S
-------------------------------------------------------
Running org.apache.jackrabbit.core.integration.PrepareTestRepository
Tests run: 1, Failures: 0, Errors: 0, Skipped: 0, Time elapsed: 3.436 sec

Results :

Tests run: 1, Failures: 0, Errors: 0, Skipped: 0

[INFO] [surefire:test {execution: do_test}]
[INFO] Surefire report directory: http://hudson.zones.apache.org/hudson/job/Jackrabbit-1.5-Java14/ws/jackrabbit-1.5/jackrabbit-core/target/surefire-reports


-------------------------------------------------------
 T E S T S
-------------------------------------------------------
Running org.apache.jackrabbit.core.integration.MassiveWildcardTest
Tests run: 1, Failures: 0, Errors: 0, Skipped: 0, Time elapsed: 101.513 sec
Running org.apache.jackrabbit.core.integration.GQLTest
Tests run: 15, Failures: 0, Errors: 0, Skipped: 0, Time elapsed: 0.421 sec
Running org.apache.jackrabbit.core.integration.NodeImplTest
Tests run: 2, Failures: 0, Errors: 0, Skipped: 0, Time elapsed: 0.077 sec
Running org.apache.jackrabbit.core.integration.MassiveRangeTest
Tests run: 1, Failures: 0, Errors: 0, Skipped: 0, Time elapsed: 4.159 sec
Running org.apache.jackrabbit.core.integration.JCRAPITest
[Fatal Error] :2:46: The prefix "jcr" for attribute "jcr:primaryType" associated with an element
type "testdata" is not bound.
[Fatal Error] :2:45: The prefix "jcr" for attribute "jcr:primaryType" associated with an element
type "testdata" is not bound.
[Fatal Error] :2:46: The prefix "jcr" for attribute "jcr:primaryType" associated with an element
type "testdata" is not bound.
[Fatal Error] :2:45: The prefix "jcr" for attribute "jcr:primaryType" associated with an element
type "testdata" is not bound.
Tests run: 1038, Failures: 0, Errors: 8, Skipped: 0, Time elapsed: 21.186 sec <<<
FAILURE!
Running org.apache.jackrabbit.core.integration.VersioningTest
Tests run: 1, Failures: 0, Errors: 0, Skipped: 0, Time elapsed: 0.134 sec
Running org.apache.jackrabbit.core.integration.ConcurrentQueryTest
Tests run: 2, Failures: 0, Errors: 0, Skipped: 0, Time elapsed: 3.729 sec
Running org.apache.jackrabbit.core.integration.AxisQueryTest
Tests run: 1, Failures: 0, Errors: 0, Skipped: 0, Time elapsed: 10.392 sec
Running org.apache.jackrabbit.core.integration.SessionImplTest
Tests run: 1, Failures: 0, Errors: 0, Skipped: 0, Time elapsed: 0.003 sec

Results :

Tests in error: 
  testExportSysView_stream_session_skipBinary_recurse(org.apache.jackrabbit.test.api.ExportSysViewTest)
  testExportSysView_stream_session_skipBinary_noRecurse(org.apache.jackrabbit.test.api.ExportSysViewTest)
  testExportSysView_stream_session_saveBinary_noRecurse(org.apache.jackrabbit.test.api.ExportSysViewTest)
  testExportSysView_stream_session_saveBinary_recurse(org.apache.jackrabbit.test.api.ExportSysViewTest)
  testExportDocView_handler_session_skipBinary_noRecurse(org.apache.jackrabbit.test.api.ExportDocViewTest)
  testExportDocView_handler_session_skipBinary_recurse(org.apache.jackrabbit.test.api.ExportDocViewTest)
  testExportDocView_handler_session_saveBinary_noRecurse(org.apache.jackrabbit.test.api.ExportDocViewTest)
  testExportDocView_handler_session_saveBinary_recurse(org.apache.jackrabbit.test.api.ExportDocViewTest)

Tests run: 1062, Failures: 0, Errors: 8, Skipped: 0

[INFO] ------------------------------------------------------------------------
[ERROR] BUILD FAILURE
[INFO] ------------------------------------------------------------------------
[INFO] There are test failures.

Please refer to http://hudson.zones.apache.org/hudson/job/Jackrabbit-1.5-Java14/ws/jackrabbit-1.5/jackrabbit-core/target/surefire-reports
 for the individual test results.
[INFO] ------------------------------------------------------------------------
[INFO] For more information, run Maven with the -e switch
[INFO] ------------------------------------------------------------------------
[INFO] Total time: 3 minutes 55 seconds
[INFO] Finished at: Sat Feb 21 17:30:53 GMT-08:00 2009
[INFO] Final Memory: 27M/63M
[INFO] ------------------------------------------------------------------------
[locks-and-latches] Releasing all the locks
[locks-and-latches] All the locks released


Mime
View raw message