jackrabbit-dev mailing list archives

Site index · List index
Message view « Date » · « Thread »
Top « Date » · « Thread »
From Apache Hudson Server <hud...@hudson.zones.apache.org>
Subject Build failed in Hudson: Jackrabbit-1.5-Java14 #3
Date Fri, 28 Nov 2008 13:11:14 GMT
See http://hudson.zones.apache.org/hudson/job/Jackrabbit-1.5-Java14/3/changes

Changes:

[jukka] 1.5: Updated release notes.

[jukka] 1.5: Ignored trunk revisions

[jukka] 1.5: Merged revisions 720940, 721186, 721191, 721194 and 721235 (JCR-1357)

[jukka] 1.5: Merged revisions 720679 and 720687 (JCR-1882)

[jukka] 1.5: Merged revisions 720524 and 720673 (JCR-1357)

[jukka] 1.5: Merged revisions 720455 and 720492 (JCR-1767)

------------------------------------------
[...truncated 1311 lines...]
2517/1644K
2521/1644K
2525/1644K
2529/1644K
2533/1644K
2537/1644K
2541/1644K
2545/1644K
2549/1644K
2553/1644K
2557/1644K
2561/1644K
2565/1644K
2569/1644K
2573/1644K
2577/1644K
2581/1644K
2585/1644K
2589/1644K
2593/1644K
2597/1644K
2601/1644K
2605/1644K
2609/1644K
2613/1644K
2617/1644K
2621/1644K
2625/1644K
2629/1644K
2633/1644K
2637/1644K
2641/1644K
2645/1644K
2649/1644K
2653/1644K
2657/1644K
2661/1644K
2665/1644K
2669/1644K
2673/1644K
2677/1644K
2681/1644K
2685/1644K
2689/1644K
2693/1644K
2697/1644K
2701/1644K
2705/1644K
2709/1644K
2713/1644K
2717/1644K
2721/1644K
2725/1644K
2729/1644K
2733/1644K
2737/1644K
2741/1644K
2745/1644K
2749/1644K
2753/1644K
2757/1644K
2761/1644K
2765/1644K
2769/1644K
2773/1644K
2777/1644K
2781/1644K
2785/1644K
2789/1644K
2793/1644K
2797/1644K
2801/1644K
2805/1644K
2809/1644K
2813/1644K
2817/1644K
2821/1644K
2825/1644K
2829/1644K
2833/1644K
2837/1644K
2841/1644K
2845/1644K
2849/1644K
2853/1644K
2857/1644K
2861/1644K
2865/1644K
2869/1644K
2873/1644K
2877/1644K
2881/1644K
2885/1644K
2889/1644K
2893/1644K
2897/1644K
2901/1644K
2905/1644K
2909/1644K
2913/1644K
2917/1644K
2921/1644K
2925/1644K
2929/1644K
2933/1644K
2937/1644K
2941/1644K
2945/1644K
2949/1644K
2953/1644K
2957/1644K
2961/1644K
2965/1644K
2969/1644K
2973/1644K
2977/1644K
2981/1644K
2985/1644K
2989/1644K
2993/1644K
2997/1644K
3001/1644K
3005/1644K
3009/1644K
3013/1644K
3017/1644K
3021/1644K
3025/1644K
3029/1644K
3033/1644K
3037/1644K
3041/1644K
3045/1644K
3049/1644K
3053/1644K
3057/1644K
3061/1644K
3065/1644K
3069/1644K
3073/1644K
3077/1644K
3081/1644K
3085/1644K
3089/1644K
3093/1644K
3097/1644K
3101/1644K
3105/1644K
3109/1644K
3113/1644K
3117/1644K
3121/1644K
3125/1644K
3129/1644K
3133/1644K
3137/1644K
3141/1644K
3145/1644K
3149/1644K
3153/1644K
3157/1644K
3161/1644K
3165/1644K
3169/1644K
3173/1644K
3177/1644K
3181/1644K
3185/1644K
3189/1644K
3193/1644K
3197/1644K
3201/1644K
3205/1644K
3209/1644K
3213/1644K
3217/1644K
3221/1644K
3225/1644K
3229/1644K
3233/1644K
3237/1644K
3241/1644K
3242/1644K
1644K downloaded
[INFO] [compiler:compile]
[INFO] Compiling 17 source files to /zonestorage/hudson/home/hudson/hudson/jobs/Jackrabbit-1.5-Java14/workspace/jackrabbit-1.5/jackrabbit-jcr-servlet/target/classes
[INFO] [resources:testResources]
[INFO] Using default encoding to copy filtered resources.
[INFO] [compiler:testCompile]
[INFO] No sources to compile
[INFO] [surefire:test]
[INFO] No tests to run.
[INFO] [jar:jar]
[INFO] Building jar: /zonestorage/hudson/home/hudson/hudson/jobs/Jackrabbit-1.5-Java14/workspace/jackrabbit-1.5/jackrabbit-jcr-servlet/target/jackrabbit-jcr-servlet-1.5.0-SNAPSHOT.jar
[INFO] Preparing source:jar
[WARNING] Removing: jar from forked lifecycle, to prevent recursive invocation.
[INFO] No goals needed for project - skipping
[INFO] [source:jar {execution: attach-sources}]
[INFO] Building jar: /zonestorage/hudson/home/hudson/hudson/jobs/Jackrabbit-1.5-Java14/workspace/jackrabbit-1.5/jackrabbit-jcr-servlet/target/jackrabbit-jcr-servlet-1.5.0-SNAPSHOT-sources.jar
[INFO] [install:install]
[INFO] Installing /zonestorage/hudson/home/hudson/hudson/jobs/Jackrabbit-1.5-Java14/workspace/jackrabbit-1.5/jackrabbit-jcr-servlet/target/jackrabbit-jcr-servlet-1.5.0-SNAPSHOT.jar
to /zonestorage/hudson/home/hudson/.m2/repository/org/apache/jackrabbit/jackrabbit-jcr-servlet/1.5.0-SNAPSHOT/jackrabbit-jcr-servlet-1.5.0-SNAPSHOT.jar
[INFO] Installing /zonestorage/hudson/home/hudson/hudson/jobs/Jackrabbit-1.5-Java14/workspace/jackrabbit-1.5/jackrabbit-jcr-servlet/target/jackrabbit-jcr-servlet-1.5.0-SNAPSHOT-sources.jar
to /zonestorage/hudson/home/hudson/.m2/repository/org/apache/jackrabbit/jackrabbit-jcr-servlet/1.5.0-SNAPSHOT/jackrabbit-jcr-servlet-1.5.0-SNAPSHOT-sources.jar
[INFO] [maven-one-plugin:install-maven-one-repository {execution: default}]
[INFO] Installing /zonestorage/hudson/home/hudson/hudson/jobs/Jackrabbit-1.5-Java14/workspace/jackrabbit-1.5/jackrabbit-jcr-servlet/target/jackrabbit-jcr-servlet-1.5.0-SNAPSHOT.jar
to /export/home/hudson/.maven/repository/org.apache.jackrabbit/jars/jackrabbit-jcr-servlet-1.5.0-SNAPSHOT.jar
[INFO] Installing /zonestorage/hudson/home/hudson/hudson/jobs/Jackrabbit-1.5-Java14/workspace/jackrabbit-1.5/jackrabbit-jcr-servlet/target/jackrabbit-jcr-servlet-1.5.0-SNAPSHOT-sources.jar
to /export/home/hudson/.maven/repository/org.apache.jackrabbit/java-sources/jackrabbit-jcr-servlet-1.5.0-SNAPSHOT-sources.jar
[INFO] ------------------------------------------------------------------------
[INFO] Building Jackrabbit WebDAV Library
[INFO]    task-segment: [clean, install]
[INFO] ------------------------------------------------------------------------
[INFO] [clean:clean]
[INFO] [resources:resources]
[INFO] Using default encoding to copy filtered resources.
[INFO] [compiler:compile]
[INFO] Compiling 174 source files to /zonestorage/hudson/home/hudson/hudson/jobs/Jackrabbit-1.5-Java14/workspace/jackrabbit-1.5/jackrabbit-webdav/target/classes
[INFO] [resources:testResources]
[INFO] Using default encoding to copy filtered resources.
[INFO] [compiler:testCompile]
[INFO] Compiling 8 source files to /zonestorage/hudson/home/hudson/hudson/jobs/Jackrabbit-1.5-Java14/workspace/jackrabbit-1.5/jackrabbit-webdav/target/test-classes
[INFO] [surefire:test]
[INFO] Surefire report directory: /zonestorage/hudson/home/hudson/hudson/jobs/Jackrabbit-1.5-Java14/workspace/jackrabbit-1.5/jackrabbit-webdav/target/surefire-reports

-------------------------------------------------------
 T E S T S
-------------------------------------------------------
Running org.apache.jackrabbit.webdav.client.TestAll
Tests run: 2, Failures: 1, Errors: 0, Skipped: 0, Time elapsed: 0.289 sec <<< FAILURE!

Results :

Failed tests: 
  testXmlSerialization(org.apache.jackrabbit.webdav.client.XmlRequestEntityTest)

Tests run: 2, Failures: 1, Errors: 0, Skipped: 0

[INFO] ------------------------------------------------------------------------
[ERROR] BUILD FAILURE
[INFO] ------------------------------------------------------------------------
[INFO] There are test failures.

Please refer to /zonestorage/hudson/home/hudson/hudson/jobs/Jackrabbit-1.5-Java14/workspace/jackrabbit-1.5/jackrabbit-webdav/target/surefire-reports
for the individual test results.
[INFO] ------------------------------------------------------------------------
[INFO] For more information, run Maven with the -e switch
[INFO] ------------------------------------------------------------------------
[INFO] Total time: 5 minutes 12 seconds
[INFO] Finished at: Fri Nov 28 13:11:12 UTC 2008
[INFO] Final Memory: 26M/63M
[INFO] ------------------------------------------------------------------------
[locks-and-latches] Releasing all the locks
[locks-and-latches] All the locks released


Mime
View raw message