jackrabbit-dev mailing list archives

Site index · List index
Message view « Date » · « Thread »
Top « Date » · « Thread »
From Apache Hudson Server <hud...@hudson.zones.apache.org>
Subject Build failed in Hudson: Jackrabbit-ocm » Jackrabbit Object Content Mapping #109
Date Wed, 17 Sep 2008 14:51:21 GMT
See http://hudson.zones.apache.org/hudson/job/Jackrabbit-ocm/org.apache.jackrabbit$jackrabbit-ocm/109/changes

------------------------------------------
[...truncated 83 lines...]
	at junit.extensions.TestSetup$1.protect(TestSetup.java:19)
	at junit.framework.TestResult.runProtected(TestResult.java:124)
	at junit.extensions.TestSetup.run(TestSetup.java:23)
	at sun.reflect.NativeMethodAccessorImpl.invoke0(Native Method)
	at sun.reflect.NativeMethodAccessorImpl.invoke(NativeMethodAccessorImpl.java:39)
	at sun.reflect.DelegatingMethodAccessorImpl.invoke(DelegatingMethodAccessorImpl.java:25)
	at java.lang.reflect.Method.invoke(Method.java:597)
	at org.apache.maven.surefire.junit.JUnitTestSet.execute(JUnitTestSet.java:213)
	at org.apache.maven.surefire.suite.AbstractDirectoryTestSuite.executeTestSet(AbstractDirectoryTestSuite.java:140)
	at org.apache.maven.surefire.suite.AbstractDirectoryTestSuite.execute(AbstractDirectoryTestSuite.java:127)
	at org.apache.maven.surefire.Surefire.run(Surefire.java:177)
	at sun.reflect.NativeMethodAccessorImpl.invoke0(Native Method)
	at sun.reflect.NativeMethodAccessorImpl.invoke(NativeMethodAccessorImpl.java:39)
	at sun.reflect.DelegatingMethodAccessorImpl.invoke(DelegatingMethodAccessorImpl.java:25)
	at java.lang.reflect.Method.invoke(Method.java:597)
	at org.apache.maven.surefire.booter.SurefireBooter.runSuitesInProcess(SurefireBooter.java:334)
	at org.apache.maven.surefire.booter.SurefireBooter.main(SurefireBooter.java:980)
Tests run: 1, Failures: 0, Errors: 0, Skipped: 0, Time elapsed: 0.172 sec
Running org.apache.jackrabbit.ocm.manager.collectionconverter.AnnotationArrayListTest
Tests run: 1, Failures: 0, Errors: 0, Skipped: 0, Time elapsed: 1.902 sec
Running org.apache.jackrabbit.ocm.manager.inheritance.DigesterInheritanceHierarchyTest
Tests run: 2, Failures: 0, Errors: 0, Skipped: 0, Time elapsed: 0.348 sec
Running org.apache.jackrabbit.ocm.manager.atomic.DigesterNullAtomicTest
Tests run: 1, Failures: 0, Errors: 0, Skipped: 0, Time elapsed: 0.349 sec
Running org.apache.jackrabbit.ocm.manager.basic.AnnotationCopyMoveTest
Tests run: 3, Failures: 0, Errors: 0, Skipped: 0, Time elapsed: 2.735 sec
Running org.apache.jackrabbit.ocm.manager.query.AnnotationAtomicQueryTest
getObjects  : 49
getObjects 2 : 5
getObjects  : 14
Tests run: 2, Failures: 0, Errors: 0, Skipped: 0, Time elapsed: 2.532 sec
Running org.apache.jackrabbit.ocm.manager.proxy.AnnotationProxyTest
Tests run: 3, Failures: 0, Errors: 0, Skipped: 0, Time elapsed: 1.595 sec
Running org.apache.jackrabbit.ocm.manager.query.AnnotationSimpleQueryTest
Tests run: 5, Failures: 0, Errors: 0, Skipped: 0, Time elapsed: 4.481 sec
Running org.apache.jackrabbit.ocm.manager.basic.AnnotationSimpleTest
Tests run: 3, Failures: 0, Errors: 0, Skipped: 0, Time elapsed: 1.091 sec
Running org.apache.jackrabbit.ocm.manager.collectionconverter.AnnotationResidualPropertiesCollectionConverterImplTest
Tests run: 1, Failures: 0, Errors: 0, Skipped: 0, Time elapsed: 0.108 sec
Running org.apache.jackrabbit.ocm.mapper.DigesterMapperImplTest
Tests run: 9, Failures: 0, Errors: 0, Skipped: 0, Time elapsed: 0.079 sec
Running org.apache.jackrabbit.ocm.manager.atomic.AnnotationNullAtomicTest
Tests run: 1, Failures: 0, Errors: 0, Skipped: 0, Time elapsed: 0.082 sec
Running org.apache.jackrabbit.ocm.manager.collectionconverter.AnnotationMultiValueCollectionConverterImplTest
Tests run: 1, Failures: 0, Errors: 0, Skipped: 0, Time elapsed: 0.092 sec
Running org.apache.jackrabbit.ocm.manager.jcrnodetype.DigesterJcrPropertyTest
org.apache.jackrabbit.ocm.exception.ObjectContentManagerException: Cannot persist current
session changes.; nested exception is javax.jcr.nodetype.ConstraintViolationException: /test/ocm:requiredWithConstraintsProp:
'invalid value' does not satisfy the constraint 'ghi'
javax.jcr.nodetype.ConstraintViolationException: /test/ocm:requiredWithConstraintsProp: 'invalid
value' does not satisfy the constraint 'ghi'
	at org.apache.jackrabbit.core.ItemImpl.validateTransientItems(ItemImpl.java:505)
	at org.apache.jackrabbit.core.ItemImpl.save(ItemImpl.java:1058)
	at org.apache.jackrabbit.core.SessionImpl.save(SessionImpl.java:846)
	at org.apache.jackrabbit.ocm.manager.impl.ObjectContentManagerImpl.save(ObjectContentManagerImpl.java:1068)
	at org.apache.jackrabbit.ocm.manager.jcrnodetype.DigesterJcrPropertyTest.testRequiredProperty(DigesterJcrPropertyTest.java:136)
	at sun.reflect.NativeMethodAccessorImpl.invoke0(Native Method)
	at sun.reflect.NativeMethodAccessorImpl.invoke(NativeMethodAccessorImpl.java:39)
	at sun.reflect.DelegatingMethodAccessorImpl.invoke(DelegatingMethodAccessorImpl.java:25)
	at java.lang.reflect.Method.invoke(Method.java:597)
	at junit.framework.TestCase.runTest(TestCase.java:154)
	at junit.framework.TestCase.runBare(TestCase.java:127)
	at junit.framework.TestResult$1.protect(TestResult.java:106)
	at junit.framework.TestResult.runProtected(TestResult.java:124)
	at junit.framework.TestResult.run(TestResult.java:109)
	at junit.framework.TestCase.run(TestCase.java:118)
	at junit.framework.TestSuite.runTest(TestSuite.java:208)
	at junit.framework.TestSuite.run(TestSuite.java:203)
	at junit.extensions.TestDecorator.basicRun(TestDecorator.java:22)
	at junit.extensions.TestSetup$1.protect(TestSetup.java:19)
	at junit.framework.TestResult.runProtected(TestResult.java:124)
	at junit.extensions.TestSetup.run(TestSetup.java:23)
	at sun.reflect.GeneratedMethodAccessor98.invoke(Unknown Source)
	at sun.reflect.DelegatingMethodAccessorImpl.invoke(DelegatingMethodAccessorImpl.java:25)
	at java.lang.reflect.Method.invoke(Method.java:597)
	at org.apache.maven.surefire.junit.JUnitTestSet.execute(JUnitTestSet.java:213)
	at org.apache.maven.surefire.suite.AbstractDirectoryTestSuite.executeTestSet(AbstractDirectoryTestSuite.java:140)
	at org.apache.maven.surefire.suite.AbstractDirectoryTestSuite.execute(AbstractDirectoryTestSuite.java:127)
	at org.apache.maven.surefire.Surefire.run(Surefire.java:177)
	at sun.reflect.NativeMethodAccessorImpl.invoke0(Native Method)
	at sun.reflect.NativeMethodAccessorImpl.invoke(NativeMethodAccessorImpl.java:39)
	at sun.reflect.DelegatingMethodAccessorImpl.invoke(DelegatingMethodAccessorImpl.java:25)
	at java.lang.reflect.Method.invoke(Method.java:597)
	at org.apache.maven.surefire.booter.SurefireBooter.runSuitesInProcess(SurefireBooter.java:334)
	at org.apache.maven.surefire.booter.SurefireBooter.main(SurefireBooter.java:980)
Tests run: 1, Failures: 0, Errors: 0, Skipped: 0, Time elapsed: 0.126 sec
Running org.apache.jackrabbit.ocm.manager.interfaces.AnnotationInterfaceHierarchyTest
Tests run: 2, Failures: 0, Errors: 0, Skipped: 0, Time elapsed: 0.207 sec
Running org.apache.jackrabbit.ocm.manager.query.DigesterSimpleQueryTest
Tests run: 6, Failures: 0, Errors: 0, Skipped: 0, Time elapsed: 27.961 sec
Running org.apache.jackrabbit.ocm.manager.collectionconverter.DigesterHashMapTest
Tests run: 1, Failures: 0, Errors: 0, Skipped: 0, Time elapsed: 1.774 sec
Running org.apache.jackrabbit.ocm.manager.lock.AnnotationLockTest
Tests run: 2, Failures: 0, Errors: 0, Skipped: 0, Time elapsed: 1.464 sec
Running org.apache.jackrabbit.ocm.manager.uuid.AnnotationUuidTest
UUID : d914a7ae-1cfb-482a-a409-32ecfa5d17f2
org.apache.jackrabbit.ocm.exception.RepositoryException: Impossible to get the object with
uuid : 1234; nested exception is javax.jcr.RepositoryException: Invalid UUID: 1234: null
UUID : d28becfb-9088-4339-91fd-eafa20a3b6cb
Invalid uuid : org.apache.jackrabbit.ocm.exception.IncorrectAtomicTypeException: Impossible
to convert the value into a reference property :  1245. Check if it is a correct uuid; nested
exception is javax.jcr.ValueFormatException: not a valid UUID format: 1245
UUID : 3f2a932c-ed3c-4261-86f1-7fa0710ad7ee
Invalid uuid value in the collection : org.apache.jackrabbit.ocm.exception.ObjectContentManagerException:
Cannot insert collection field : multiReferences of class org.apache.jackrabbit.ocm.testmodel.uuid.B;
nested exception is javax.jcr.ValueFormatException: not a valid UUID format: 12345
UUID : 713d3fd7-601c-4669-bb11-a4582619d81e
Tests run: 7, Failures: 0, Errors: 0, Skipped: 0, Time elapsed: 1.305 sec
Running org.apache.jackrabbit.ocm.querymanager.AnnotationQueryManagerTest
Tests run: 2, Failures: 0, Errors: 0, Skipped: 0, Time elapsed: 0.039 sec
Running org.apache.jackrabbit.ocm.manager.version.DigesterBasicVersionningTest
Base version : 1.1
Root version : jcr:rootVersion
Tests run: 2, Failures: 0, Errors: 0, Skipped: 0, Time elapsed: 5.864 sec
Running org.apache.jackrabbit.ocm.manager.collectionconverter.AnnotationHashMapTest
Tests run: 1, Failures: 0, Errors: 0, Skipped: 0, Time elapsed: 2.436 sec
Running org.apache.jackrabbit.ocm.manager.beanconverter.DigesterBeanDescriptorTest
Paragraph path : /test/collection-element[3]
Paragraph path : /test/collection-element
Paragraph path : /test/collection-element[2]
Tests run: 4, Failures: 0, Errors: 0, Skipped: 0, Time elapsed: 1.035 sec
Running org.apache.jackrabbit.ocm.manager.collectionconverter.DigesterMultiValueCollectionConverterImplTest
Tests run: 1, Failures: 0, Errors: 0, Skipped: 0, Time elapsed: 0.099 sec
Running org.apache.jackrabbit.ocm.manager.basic.AnnotationRemoveTest
Tests run: 1, Failures: 0, Errors: 0, Skipped: 0, Time elapsed: 0.291 sec
Running org.apache.jackrabbit.ocm.manager.jcrnodetype.DigesterJcrNodeTypeTest
Folder creation date : java.util.GregorianCalendar[time=1221662957369,areFieldsSet=true,areAllFieldsSet=true,lenient=true,zone=sun.util.calendar.ZoneInfo[id="UTC",offset=0,dstSavings=0,useDaylight=false,transitions=0,lastRule=null],firstDayOfWeek=1,minimalDaysInFirstWeek=1,ERA=1,YEAR=2008,MONTH=8,WEEK_OF_YEAR=38,WEEK_OF_MONTH=3,DAY_OF_MONTH=17,DAY_OF_YEAR=261,DAY_OF_WEEK=4,DAY_OF_WEEK_IN_MONTH=3,AM_PM=1,HOUR=2,HOUR_OF_DAY=14,MINUTE=49,SECOND=17,MILLISECOND=369,ZONE_OFFSET=0,DST_OFFSET=0]
File resource calendar: java.util.GregorianCalendar[time=1221662957369,areFieldsSet=true,areAllFieldsSet=true,lenient=true,zone=sun.util.calendar.ZoneInfo[id="UTC",offset=0,dstSavings=0,useDaylight=false,transitions=0,lastRule=null],firstDayOfWeek=1,minimalDaysInFirstWeek=1,ERA=1,YEAR=2008,MONTH=8,WEEK_OF_YEAR=38,WEEK_OF_MONTH=3,DAY_OF_MONTH=17,DAY_OF_YEAR=261,DAY_OF_WEEK=4,DAY_OF_WEEK_IN_MONTH=3,AM_PM=1,HOUR=2,HOUR_OF_DAY=14,MINUTE=49,SECOND=17,MILLISECOND=369,ZONE_OFFSET=0,DST_OFFSET=0]
Tests run: 1, Failures: 0, Errors: 0, Skipped: 0, Time elapsed: 0.144 sec
Running org.apache.jackrabbit.ocm.manager.collectionconverter.DigesterArrayListTest
Tests run: 1, Failures: 0, Errors: 0, Skipped: 0, Time elapsed: 0.94 sec
Running org.apache.jackrabbit.ocm.manager.interfaces.DigesterInterfaceHierarchyTest
Tests run: 2, Failures: 0, Errors: 0, Skipped: 0, Time elapsed: 0.227 sec
Running org.apache.jackrabbit.ocm.manager.interfaces.DigesterConcreteClassTest
Tests run: 3, Failures: 0, Errors: 0, Skipped: 0, Time elapsed: 28.11 sec
Running org.apache.jackrabbit.ocm.manager.collectionconverter.DigesterDefaultCollectionConverterImplTest
Tests run: 3, Failures: 0, Errors: 0, Skipped: 0, Time elapsed: 1.811 sec
Running org.apache.jackrabbit.ocm.manager.uuid.DigesterUuidTest
UUID : 5b9e7125-b960-4f23-8c02-3ae9613a8710
org.apache.jackrabbit.ocm.exception.RepositoryException: Impossible to get the object with
uuid : 1234; nested exception is javax.jcr.RepositoryException: Invalid UUID: 1234: null
UUID : 0e34564a-259c-4af4-96d2-6253d5f14e29
Invalid uuid : org.apache.jackrabbit.ocm.exception.IncorrectAtomicTypeException: Impossible
to convert the value into a reference property :  1245. Check if it is a correct uuid; nested
exception is javax.jcr.ValueFormatException: not a valid UUID format: 1245
UUID : 4a324966-9697-4713-9ba9-9099acf8382e
Invalid uuid value in the collection : org.apache.jackrabbit.ocm.exception.ObjectContentManagerException:
Cannot insert collection field : multiReferences of class org.apache.jackrabbit.ocm.testmodel.uuid.B;
nested exception is javax.jcr.ValueFormatException: not a valid UUID format: 12345
UUID : 0046caeb-bcb6-4661-be80-1869090c937e
Tests run: 6, Failures: 0, Errors: 0, Skipped: 0, Time elapsed: 1.192 sec
Running org.apache.jackrabbit.ocm.manager.query.DigesterScopeQueryTest
Tests run: 1, Failures: 0, Errors: 0, Skipped: 0, Time elapsed: 2.144 sec
Running org.apache.jackrabbit.ocm.repository.NodeUtilTest
Tests run: 2, Failures: 0, Errors: 0, Skipped: 0, Time elapsed: 0.002 sec
Running org.apache.jackrabbit.ocm.manager.jcrnodetype.AnnotationJcrNodeTypeTest
Folder creation date : java.util.GregorianCalendar[time=1221662991930,areFieldsSet=true,areAllFieldsSet=true,lenient=true,zone=sun.util.calendar.ZoneInfo[id="UTC",offset=0,dstSavings=0,useDaylight=false,transitions=0,lastRule=null],firstDayOfWeek=1,minimalDaysInFirstWeek=1,ERA=1,YEAR=2008,MONTH=8,WEEK_OF_YEAR=38,WEEK_OF_MONTH=3,DAY_OF_MONTH=17,DAY_OF_YEAR=261,DAY_OF_WEEK=4,DAY_OF_WEEK_IN_MONTH=3,AM_PM=1,HOUR=2,HOUR_OF_DAY=14,MINUTE=49,SECOND=51,MILLISECOND=930,ZONE_OFFSET=0,DST_OFFSET=0]
File resource calendar: java.util.GregorianCalendar[time=1221662991929,areFieldsSet=true,areAllFieldsSet=true,lenient=true,zone=sun.util.calendar.ZoneInfo[id="UTC",offset=0,dstSavings=0,useDaylight=false,transitions=0,lastRule=null],firstDayOfWeek=1,minimalDaysInFirstWeek=1,ERA=1,YEAR=2008,MONTH=8,WEEK_OF_YEAR=38,WEEK_OF_MONTH=3,DAY_OF_MONTH=17,DAY_OF_YEAR=261,DAY_OF_WEEK=4,DAY_OF_WEEK_IN_MONTH=3,AM_PM=1,HOUR=2,HOUR_OF_DAY=14,MINUTE=49,SECOND=51,MILLISECOND=929,ZONE_OFFSET=0,DST_OFFSET=0]
Tests run: 1, Failures: 0, Errors: 0, Skipped: 0, Time elapsed: 0.054 sec
Running org.apache.jackrabbit.ocm.manager.inheritance.AnnotationInheritanceConcreteClassTest
Tests run: 5, Failures: 0, Errors: 0, Skipped: 0, Time elapsed: 32.904 sec
Running org.apache.jackrabbit.ocm.manager.atomic.AnnotationDefaultValueTest
Tests run: 2, Failures: 0, Errors: 0, Skipped: 0, Time elapsed: 0.229 sec
Running org.apache.jackrabbit.ocm.manager.query.AnnotationIteratorQueryTest
getObject takes : 9
getObject takes : 15
getObject takes : 5
Tests run: 1, Failures: 0, Errors: 0, Skipped: 0, Time elapsed: 2.409 sec
Running org.apache.jackrabbit.ocm.manager.basic.AnnotationSameNameSiblingTest
Tests run: 2, Failures: 0, Errors: 0, Skipped: 0, Time elapsed: 0.624 sec
Running org.apache.jackrabbit.ocm.manager.collectionconverter.DigesterResidualNodesCollectionConverterImplTest
Tests run: 1, Failures: 0, Errors: 0, Skipped: 0, Time elapsed: 1.58 sec
Running org.apache.jackrabbit.ocm.manager.collectionconverter.AnnotationNTCollectionConverterImplTest
Tests run: 1, Failures: 0, Errors: 0, Skipped: 0, Time elapsed: 0.714 sec
Running org.apache.jackrabbit.ocm.manager.basic.DigesterAvoidRecursiveLoopTest
Tests run: 1, Failures: 0, Errors: 0, Skipped: 0, Time elapsed: 0.101 sec
Running org.apache.jackrabbit.ocm.manager.atomic.AnnotationAtomicTest
Tests run: 1, Failures: 0, Errors: 0, Skipped: 0, Time elapsed: 0.059 sec
Running org.apache.jackrabbit.ocm.manager.auto.AnnotationAutoTest
Tests run: 1, Failures: 0, Errors: 0, Skipped: 0, Time elapsed: 0.117 sec
Running org.apache.jackrabbit.ocm.manager.version.AnnotationBasicVersionningTest
Base version : 1.1
Root version : jcr:rootVersion
Base version : 1.1
Root version : jcr:rootVersion
Tests run: 4, Failures: 0, Errors: 0, Skipped: 0, Time elapsed: 5.057 sec
Running org.apache.jackrabbit.ocm.manager.query.DigesterAtomicQueryTest
getObjects  : 17
getObjects 2 : 2
getObjects  : 381
Tests run: 2, Failures: 0, Errors: 0, Skipped: 0, Time elapsed: 2.665 sec
Running org.apache.jackrabbit.ocm.manager.basic.DigesterSimpleTest
Tests run: 3, Failures: 0, Errors: 0, Skipped: 0, Time elapsed: 1.331 sec
Running org.apache.jackrabbit.ocm.manager.basic.DigesterSameNameSiblingTest
Tests run: 2, Failures: 0, Errors: 0, Skipped: 0, Time elapsed: 0.25 sec
Running org.apache.jackrabbit.ocm.manager.atomic.DigesterDefaultValueTest
Tests run: 2, Failures: 0, Errors: 0, Skipped: 0, Time elapsed: 0.125 sec
Running org.apache.jackrabbit.ocm.manager.inheritance.AnnotationInheritanceHierarchyTest
Tests run: 2, Failures: 0, Errors: 0, Skipped: 0, Time elapsed: 0.125 sec
Running org.apache.jackrabbit.ocm.manager.interfaces.AnnotationConcreteClassTest
Tests run: 3, Failures: 0, Errors: 0, Skipped: 0, Time elapsed: 23.482 sec
Running org.apache.jackrabbit.ocm.repository.RelfectionUtilTest
Tests run: 1, Failures: 0, Errors: 0, Skipped: 0, Time elapsed: 0.002 sec
Running org.apache.jackrabbit.ocm.manager.query.AnnotationMultiValueQueryTest
Tests run: 1, Failures: 0, Errors: 0, Skipped: 0, Time elapsed: 0.216 sec
Running org.apache.jackrabbit.ocm.manager.lock.DigesterLockTest
Tests run: 2, Failures: 0, Errors: 0, Skipped: 0, Time elapsed: 1.127 sec
Running org.apache.jackrabbit.ocm.repository.RepositoryUtilTest
Tests run: 4, Failures: 0, Errors: 0, Skipped: 0, Time elapsed: 0.078 sec
Running org.apache.jackrabbit.ocm.testmodel.PropertyTest
Tests run: 0, Failures: 0, Errors: 0, Skipped: 0, Time elapsed: 0.001 sec
Running org.apache.jackrabbit.ocm.manager.basic.AnnotationAvoidRecursiveLoopTest
Tests run: 1, Failures: 0, Errors: 0, Skipped: 0, Time elapsed: 0.088 sec
Running org.apache.jackrabbit.ocm.manager.basic.DigesterCopyMoveTest
Tests run: 3, Failures: 0, Errors: 0, Skipped: 0, Time elapsed: 1.491 sec

Results :

Tests run: 163, Failures: 0, Errors: 0, Skipped: 0

[HUDSON] Recording test results
[INFO] [jar:jar]
[INFO] Building jar: http://hudson.zones.apache.org/hudson/job/Jackrabbit-ocm/org.apache.jackrabbit$jackrabbit-ocm/ws/target/jackrabbit-ocm-1.5-SNAPSHOT.jar

[INFO] Preparing source:jar
[WARNING] Removing: jar from forked lifecycle, to prevent recursive invocation.
[INFO] No goals needed for project - skipping
[INFO] [source:jar {execution: attach-sources}]
[INFO] Building jar: http://hudson.zones.apache.org/hudson/job/Jackrabbit-ocm/org.apache.jackrabbit$jackrabbit-ocm/ws/target/jackrabbit-ocm-1.5-SNAPSHOT-sources.jar

[INFO] [retrotranslator:translate-project {execution: default}]
[INFO] Transforming 109 file(s) from http://hudson.zones.apache.org/hudson/job/Jackrabbit-ocm/org.apache.jackrabbit$jackrabbit-ocm/ws/target/jackrabbit-ocm-1.5-SNAPSHOT.jar
 to http://hudson.zones.apache.org/hudson/job/Jackrabbit-ocm/org.apache.jackrabbit$jackrabbit-ocm/ws/target/jackrabbit-ocm-1.5-SNAPSHOT-jdk14.jar.

[INFO] Transformation of 109 file(s) completed successfully.
[INFO] [install:install]
[INFO] Installing http://hudson.zones.apache.org/hudson/job/Jackrabbit-ocm/org.apache.jackrabbit$jackrabbit-ocm/ws/target/jackrabbit-ocm-1.5-SNAPSHOT.jar
 to /zonestorage/hudson/home/hudson/.m2/repository/org/apache/jackrabbit/jackrabbit-ocm/1.5-SNAPSHOT/jackrabbit-ocm-1.5-SNAPSHOT.jar
[INFO] Installing http://hudson.zones.apache.org/hudson/job/Jackrabbit-ocm/org.apache.jackrabbit$jackrabbit-ocm/ws/target/jackrabbit-ocm-1.5-SNAPSHOT-sources.jar
 to /zonestorage/hudson/home/hudson/.m2/repository/org/apache/jackrabbit/jackrabbit-ocm/1.5-SNAPSHOT/jackrabbit-ocm-1.5-SNAPSHOT-sources.jar
[INFO] Installing http://hudson.zones.apache.org/hudson/job/Jackrabbit-ocm/org.apache.jackrabbit$jackrabbit-ocm/ws/target/jackrabbit-ocm-1.5-SNAPSHOT-jdk14.jar
 to /zonestorage/hudson/home/hudson/.m2/repository/org/apache/jackrabbit/jackrabbit-ocm/1.5-SNAPSHOT/jackrabbit-ocm-1.5-SNAPSHOT-jdk14.jar
[INFO] [maven-one-plugin:install-maven-one-repository {execution: default}]
[INFO] Installing http://hudson.zones.apache.org/hudson/job/Jackrabbit-ocm/org.apache.jackrabbit$jackrabbit-ocm/ws/target/jackrabbit-ocm-1.5-SNAPSHOT.jar
 to /export/home/hudson/.maven/repository/org.apache.jackrabbit/jars/jackrabbit-ocm-1.5-SNAPSHOT.jar
[INFO] Installing http://hudson.zones.apache.org/hudson/job/Jackrabbit-ocm/org.apache.jackrabbit$jackrabbit-ocm/ws/target/jackrabbit-ocm-1.5-SNAPSHOT-sources.jar
 to /export/home/hudson/.maven/repository/org.apache.jackrabbit/java-sources/jackrabbit-ocm-1.5-SNAPSHOT-sources.jar
[INFO] Installing http://hudson.zones.apache.org/hudson/job/Jackrabbit-ocm/org.apache.jackrabbit$jackrabbit-ocm/ws/target/jackrabbit-ocm-1.5-SNAPSHOT-jdk14.jar
 to /export/home/hudson/.maven/repository/org.apache.jackrabbit/jars/jackrabbit-ocm-1.5-SNAPSHOT-jdk14.jar
[INFO] [deploy:deploy]
altDeploymentRepository = my::default::file:///export/home/jukka/repository/
[INFO] Using alternate deployment repository my::default::file:///export/home/jukka/repository/
[INFO] Retrieving previous build number from my
[WARNING] repository metadata for: 'snapshot org.apache.jackrabbit:jackrabbit-ocm:1.5-SNAPSHOT'
could not be retrieved from repository: my due to an error: Connection failed: Repository
path /export/home/jukka/repository does not exist, and cannot be created.
[INFO] Repository 'my' will be blacklisted
[HUDSON] Archiving http://hudson.zones.apache.org/hudson/job/Jackrabbit-ocm/org.apache.jackrabbit$jackrabbit-ocm/ws/pom.xml
 to /export/home/hudson/hudson/jobs/Jackrabbit-ocm/modules/org.apache.jackrabbit$jackrabbit-ocm/builds/2008-09-17_14-46-42/archive/org.apache.jackrabbit/jackrabbit-ocm/1.5-SNAPSHOT/pom.xml
[HUDSON] Archiving http://hudson.zones.apache.org/hudson/job/Jackrabbit-ocm/org.apache.jackrabbit$jackrabbit-ocm/ws/target/jackrabbit-ocm-1.5-SNAPSHOT.jar
 to /export/home/hudson/hudson/jobs/Jackrabbit-ocm/modules/org.apache.jackrabbit$jackrabbit-ocm/builds/2008-09-17_14-46-42/archive/org.apache.jackrabbit/jackrabbit-ocm/1.5-SNAPSHOT/jackrabbit-ocm-1.5-SNAPSHOT.jar
[HUDSON] Archiving http://hudson.zones.apache.org/hudson/job/Jackrabbit-ocm/org.apache.jackrabbit$jackrabbit-ocm/ws/target/jackrabbit-ocm-1.5-SNAPSHOT-sources.jar
 to /export/home/hudson/hudson/jobs/Jackrabbit-ocm/modules/org.apache.jackrabbit$jackrabbit-ocm/builds/2008-09-17_14-46-42/archive/org.apache.jackrabbit/jackrabbit-ocm/1.5-SNAPSHOT/jackrabbit-ocm-1.5-SNAPSHOT-sources.jar
[HUDSON] Archiving http://hudson.zones.apache.org/hudson/job/Jackrabbit-ocm/org.apache.jackrabbit$jackrabbit-ocm/ws/target/jackrabbit-ocm-1.5-SNAPSHOT-jdk14.jar
 to /export/home/hudson/hudson/jobs/Jackrabbit-ocm/modules/org.apache.jackrabbit$jackrabbit-ocm/builds/2008-09-17_14-46-42/archive/org.apache.jackrabbit/jackrabbit-ocm/1.5-SNAPSHOT/jackrabbit-ocm-1.5-SNAPSHOT-jdk14.jar
[INFO] ------------------------------------------------------------------------
[ERROR] BUILD ERROR
[INFO] ------------------------------------------------------------------------
[INFO] Error deploying artifact: Connection failed: Repository path /export/home/jukka/repository
does not exist, and cannot be created.

[INFO] ------------------------------------------------------------------------
[INFO] For more information, run Maven with the -e switch
[INFO] ------------------------------------------------------------------------
[INFO] Total time: 4 minutes 36 seconds
[INFO] Finished at: Wed Sep 17 14:51:21 UTC 2008
[INFO] Final Memory: 31M/190M
[INFO] ------------------------------------------------------------------------
Waiting for Hudson to finish collecting data


Mime
View raw message