jackrabbit-dev mailing list archives

Site index · List index
Message view « Date » · « Thread »
Top « Date » · « Thread »
From Apache Hudson Server <hud...@hudson.zones.apache.org>
Subject Build failed in Hudson: Jackrabbit-trunk » Apache Jackrabbit #10
Date Tue, 15 Apr 2008 01:10:00 GMT
See http://hudson.zones.apache.org/hudson/job/Jackrabbit-trunk/org.apache.jackrabbit$jackrabbit/10/changes

Changes:

[jukka] JCR-663: Maven2 site modules and checkstyle
    - Enabled JXR, Javadoc, Surefire, Checkstyle, and PMD reports

------------------------------------------
[...truncated 82 lines...]
[INFO] Loaded System Directive: org.apache.velocity.runtime.directive.Foreach
[INFO] Created: 20 parsers.
[INFO] Velocimacro : initialization starting.
[INFO] Velocimacro : adding VMs from VM library template : VM_global_library.vm
[ERROR] ResourceManager : unable to find resource 'VM_global_library.vm' in any resource loader.
[INFO] Velocimacro : error using  VM library template VM_global_library.vm : org.apache.velocity.exception.ResourceNotFoundException:
Unable to find resource 'VM_global_library.vm'
[INFO] Velocimacro :  VM library template macro registration complete.
[INFO] Velocimacro : allowInline = true : VMs can be defined inline in templates
[INFO] Velocimacro : allowInlineToOverride = false : VMs defined inline may NOT replace previous
VM definitions
[INFO] Velocimacro : allowInlineLocal = false : VMs defined inline will be  global in scope
if allowed.
[INFO] Velocimacro : initialization complete.
[INFO] Velocity successfully started.
[INFO] Setting property: classpath.resource.loader.class => 'org.codehaus.plexus.velocity.ContextClassLoaderResourceLoader'.
[INFO] Setting property: velocimacro.messages.on => 'false'.
[INFO] Setting property: resource.loader => 'classpath'.
[INFO] Setting property: resource.manager.logwhenfound => 'false'.
[INFO] ************************************************************** 
[INFO] Starting Jakarta Velocity v1.4
[INFO] RuntimeInstance initializing.
[INFO] Default Properties File: org/apache/velocity/runtime/defaults/velocity.properties
[INFO] Default ResourceManager initializing. (class org.apache.velocity.runtime.resource.ResourceManagerImpl)
[INFO] Resource Loader Instantiated: org.codehaus.plexus.velocity.ContextClassLoaderResourceLoader
[INFO] ClasspathResourceLoader : initialization starting.
[INFO] ClasspathResourceLoader : initialization complete.
[INFO] ResourceCache : initialized. (class org.apache.velocity.runtime.resource.ResourceCacheImpl)
[INFO] Default ResourceManager initialization complete.
[INFO] Loaded System Directive: org.apache.velocity.runtime.directive.Literal
[INFO] Loaded System Directive: org.apache.velocity.runtime.directive.Macro
[INFO] Loaded System Directive: org.apache.velocity.runtime.directive.Parse
[INFO] Loaded System Directive: org.apache.velocity.runtime.directive.Include
[INFO] Loaded System Directive: org.apache.velocity.runtime.directive.Foreach
[INFO] Created: 20 parsers.
[INFO] Velocimacro : initialization starting.
[INFO] Velocimacro : adding VMs from VM library template : VM_global_library.vm
[ERROR] ResourceManager : unable to find resource 'VM_global_library.vm' in any resource loader.
[INFO] Velocimacro : error using  VM library template VM_global_library.vm : org.apache.velocity.exception.ResourceNotFoundException:
Unable to find resource 'VM_global_library.vm'
[INFO] Velocimacro :  VM library template macro registration complete.
[INFO] Velocimacro : allowInline = true : VMs can be defined inline in templates
[INFO] Velocimacro : allowInlineToOverride = false : VMs defined inline may NOT replace previous
VM definitions
[INFO] Velocimacro : allowInlineLocal = false : VMs defined inline will be  global in scope
if allowed.
[INFO] Velocimacro : initialization complete.
[INFO] Velocity successfully started.
[INFO] artifact org.apache.maven.plugins:maven-surefire-report-plugin: checking for updates
from central
Downloading: http://repo1.maven.org/maven2/org/apache/maven/plugins/maven-surefire-report-plugin/2.4.2/maven-surefire-report-plugin-2.4.2.pom
4K downloaded
Downloading: http://repo1.maven.org/maven2/org/apache/maven/surefire/surefire/2.4.2/surefire-2.4.2.pom
6K downloaded
Downloading: http://repo1.maven.org/maven2/org/apache/maven/plugins/maven-surefire-report-plugin/2.4.2/maven-surefire-report-plugin-2.4.2.jar
30K downloaded
Downloading: http://repo1.maven.org/maven2/checkstyle/checkstyle-optional/4.1/checkstyle-optional-4.1.pom
338b downloaded
Downloading: http://repo1.maven.org/maven2/checkstyle/checkstyle/4.1/checkstyle-4.1.pom
799b downloaded
Downloading: http://repo1.maven.org/maven2/antlr/antlr/2.7.2/antlr-2.7.2.pom
145b downloaded
Downloading: http://repo1.maven.org/maven2/commons-beanutils/commons-beanutils-core/1.7.0/commons-beanutils-core-1.7.0.pom
719b downloaded
Downloading: http://repo1.maven.org/maven2/checkstyle/checkstyle-optional/4.1/checkstyle-optional-4.1.jar
29K downloaded
Downloading: http://repo1.maven.org/maven2/checkstyle/checkstyle/4.1/checkstyle-4.1.jar
523K downloaded
Downloading: http://repo1.maven.org/maven2/antlr/antlr/2.7.2/antlr-2.7.2.jar
349K downloaded
Downloading: http://repo1.maven.org/maven2/commons-beanutils/commons-beanutils-core/1.7.0/commons-beanutils-core-1.7.0.jar
164K downloaded
[INFO] Setting property: classpath.resource.loader.class => 'org.codehaus.plexus.velocity.ContextClassLoaderResourceLoader'.
[INFO] Setting property: velocimacro.messages.on => 'false'.
[INFO] Setting property: resource.loader => 'classpath'.
[INFO] Setting property: resource.manager.logwhenfound => 'false'.
[INFO] ************************************************************** 
[INFO] Starting Jakarta Velocity v1.4
[INFO] RuntimeInstance initializing.
[INFO] Default Properties File: org/apache/velocity/runtime/defaults/velocity.properties
[INFO] Default ResourceManager initializing. (class org.apache.velocity.runtime.resource.ResourceManagerImpl)
[INFO] Resource Loader Instantiated: org.codehaus.plexus.velocity.ContextClassLoaderResourceLoader
[INFO] ClasspathResourceLoader : initialization starting.
[INFO] ClasspathResourceLoader : initialization complete.
[INFO] ResourceCache : initialized. (class org.apache.velocity.runtime.resource.ResourceCacheImpl)
[INFO] Default ResourceManager initialization complete.
[INFO] Loaded System Directive: org.apache.velocity.runtime.directive.Literal
[INFO] Loaded System Directive: org.apache.velocity.runtime.directive.Macro
[INFO] Loaded System Directive: org.apache.velocity.runtime.directive.Parse
[INFO] Loaded System Directive: org.apache.velocity.runtime.directive.Include
[INFO] Loaded System Directive: org.apache.velocity.runtime.directive.Foreach
[INFO] Created: 20 parsers.
[INFO] Velocimacro : initialization starting.
[INFO] Velocimacro : adding VMs from VM library template : VM_global_library.vm
[ERROR] ResourceManager : unable to find resource 'VM_global_library.vm' in any resource loader.
[INFO] Velocimacro : error using  VM library template VM_global_library.vm : org.apache.velocity.exception.ResourceNotFoundException:
Unable to find resource 'VM_global_library.vm'
[INFO] Velocimacro :  VM library template macro registration complete.
[INFO] Velocimacro : allowInline = true : VMs can be defined inline in templates
[INFO] Velocimacro : allowInlineToOverride = false : VMs defined inline may NOT replace previous
VM definitions
[INFO] Velocimacro : allowInlineLocal = false : VMs defined inline will be  global in scope
if allowed.
[INFO] Velocimacro : initialization complete.
[INFO] Velocity successfully started.
[INFO] artifact org.apache.maven.plugins:maven-pmd-plugin: checking for updates from central
Downloading: http://repo1.maven.org/maven2/org/apache/maven/plugins/maven-pmd-plugin/2.3/maven-pmd-plugin-2.3.pom
6K downloaded
Downloading: http://repo1.maven.org/maven2/org/apache/maven/plugins/maven-pmd-plugin/2.3/maven-pmd-plugin-2.3.jar
39K downloaded
Downloading: http://repo1.maven.org/maven2/pmd/pmd-jdk14/4.1.1/pmd-jdk14-4.1.1.pom
9K downloaded
Downloading: http://repo1.maven.org/maven2/ant/ant/1.6/ant-1.6.pom
182b downloaded
Downloading: http://repo1.maven.org/maven2/jaxen/jaxen/1.1.1/jaxen-1.1.1.pom
7K downloaded
Downloading: http://repo1.maven.org/maven2/dom4j/dom4j/1.6.1/dom4j-1.6.1.pom
6K downloaded
Downloading: http://repo1.maven.org/maven2/jdom/jdom/1.0/jdom-1.0.pom
1K downloaded
Downloading: http://repo1.maven.org/maven2/xml-apis/xml-apis/1.3.02/xml-apis-1.3.02.pom
357b downloaded
Downloading: http://repo1.maven.org/maven2/xerces/xercesImpl/2.6.2/xercesImpl-2.6.2.pom
150b downloaded
Downloading: http://repo1.maven.org/maven2/xom/xom/1.0/xom-1.0.pom
1K downloaded
Downloading: http://repo1.maven.org/maven2/xerces/xmlParserAPIs/2.6.2/xmlParserAPIs-2.6.2.pom
153b downloaded
Downloading: http://repo1.maven.org/maven2/xalan/xalan/2.6.0/xalan-2.6.0.pom
491b downloaded
Downloading: http://repo1.maven.org/maven2/com/ibm/icu/icu4j/2.6.1/icu4j-2.6.1.pom
150b downloaded
Downloading: http://repo1.maven.org/maven2/junit/junit/3.8.2/junit-3.8.2.pom
747b downloaded
Downloading: http://repo1.maven.org/maven2/backport-util-concurrent/backport-util-concurrent/3.1/backport-util-concurrent-3.1.pom
880b downloaded
Downloading: http://repo1.maven.org/maven2/net/sourceforge/retroweaver/retroweaver-rt/2.0.2/retroweaver-rt-2.0.2.pom
1002b downloaded
Downloading: http://repo1.maven.org/maven2/backport-util-concurrent/backport-util-concurrent/3.0/backport-util-concurrent-3.0.pom
909b downloaded
Downloading: http://repo1.maven.org/maven2/org/codehaus/plexus/plexus-utils/1.4.2/plexus-utils-1.4.2.pom
1K downloaded
Downloading: http://repo1.maven.org/maven2/pmd/pmd-jdk14/4.1.1/pmd-jdk14-4.1.1.jar
1015K downloaded
Downloading: http://repo1.maven.org/maven2/ant/ant/1.6/ant-1.6.jar
929K downloaded
Downloading: http://repo1.maven.org/maven2/jaxen/jaxen/1.1.1/jaxen-1.1.1.jar
221K downloaded
Downloading: http://repo1.maven.org/maven2/dom4j/dom4j/1.6.1/dom4j-1.6.1.jar
306K downloaded
Downloading: http://repo1.maven.org/maven2/jdom/jdom/1.0/jdom-1.0.jar
149K downloaded
Downloading: http://repo1.maven.org/maven2/xml-apis/xml-apis/1.3.02/xml-apis-1.3.02.jar
189K downloaded
Downloading: http://repo1.maven.org/maven2/xerces/xercesImpl/2.6.2/xercesImpl-2.6.2.jar
986K downloaded
Downloading: http://repo1.maven.org/maven2/xom/xom/1.0/xom-1.0.jar
106K downloaded
Downloading: http://repo1.maven.org/maven2/xerces/xmlParserAPIs/2.6.2/xmlParserAPIs-2.6.2.jar
121K downloaded
Downloading: http://repo1.maven.org/maven2/xalan/xalan/2.6.0/xalan-2.6.0.jar
3075K downloaded
Downloading: http://repo1.maven.org/maven2/com/ibm/icu/icu4j/2.6.1/icu4j-2.6.1.jar
2393K downloaded
Downloading: http://repo1.maven.org/maven2/junit/junit/3.8.2/junit-3.8.2.jar
117K downloaded
Downloading: http://repo1.maven.org/maven2/backport-util-concurrent/backport-util-concurrent/3.1/backport-util-concurrent-3.1.jar
323K downloaded
Downloading: http://repo1.maven.org/maven2/net/sourceforge/retroweaver/retroweaver-rt/2.0.2/retroweaver-rt-2.0.2.jar
99K downloaded
Downloading: http://repo1.maven.org/maven2/org/codehaus/plexus/plexus-utils/1.4.2/plexus-utils-1.4.2.jar
185K downloaded
[INFO] Setting property: classpath.resource.loader.class => 'org.codehaus.plexus.velocity.ContextClassLoaderResourceLoader'.
[INFO] Setting property: velocimacro.messages.on => 'false'.
[INFO] Setting property: resource.loader => 'classpath'.
[INFO] Setting property: resource.manager.logwhenfound => 'false'.
[INFO] ************************************************************** 
[INFO] Starting Jakarta Velocity v1.4
[INFO] RuntimeInstance initializing.
[INFO] Default Properties File: org/apache/velocity/runtime/defaults/velocity.properties
[INFO] Default ResourceManager initializing. (class org.apache.velocity.runtime.resource.ResourceManagerImpl)
[INFO] Resource Loader Instantiated: org.codehaus.plexus.velocity.ContextClassLoaderResourceLoader
[INFO] ClasspathResourceLoader : initialization starting.
[INFO] ClasspathResourceLoader : initialization complete.
[INFO] ResourceCache : initialized. (class org.apache.velocity.runtime.resource.ResourceCacheImpl)
[INFO] Default ResourceManager initialization complete.
[INFO] Loaded System Directive: org.apache.velocity.runtime.directive.Literal
[INFO] Loaded System Directive: org.apache.velocity.runtime.directive.Macro
[INFO] Loaded System Directive: org.apache.velocity.runtime.directive.Parse
[INFO] Loaded System Directive: org.apache.velocity.runtime.directive.Include
[INFO] Loaded System Directive: org.apache.velocity.runtime.directive.Foreach
[INFO] Created: 20 parsers.
[INFO] Velocimacro : initialization starting.
[INFO] Velocimacro : adding VMs from VM library template : VM_global_library.vm
[ERROR] ResourceManager : unable to find resource 'VM_global_library.vm' in any resource loader.
[INFO] Velocimacro : error using  VM library template VM_global_library.vm : org.apache.velocity.exception.ResourceNotFoundException:
Unable to find resource 'VM_global_library.vm'
[INFO] Velocimacro :  VM library template macro registration complete.
[INFO] Velocimacro : allowInline = true : VMs can be defined inline in templates
[INFO] Velocimacro : allowInlineToOverride = false : VMs defined inline may NOT replace previous
VM definitions
[INFO] Velocimacro : allowInlineLocal = false : VMs defined inline will be  global in scope
if allowed.
[INFO] Velocimacro : initialization complete.
[INFO] Velocity successfully started.
[INFO] Setting property: classpath.resource.loader.class => 'org.codehaus.plexus.velocity.ContextClassLoaderResourceLoader'.
[INFO] Setting property: velocimacro.messages.on => 'false'.
[INFO] Setting property: resource.loader => 'classpath'.
[INFO] Setting property: resource.manager.logwhenfound => 'false'.
[INFO] Preparing javadoc:javadoc
[INFO] ------------------------------------------------------------------------
[INFO] Building Apache Jackrabbit
[INFO] ------------------------------------------------------------------------
[INFO] No goals needed for project - skipping
[INFO] ------------------------------------------------------------------------
[INFO] Building Jackrabbit API
[INFO] ------------------------------------------------------------------------
[INFO] No goals needed for project - skipping
[INFO] ------------------------------------------------------------------------
[INFO] Building Jackrabbit JCR Commons
[INFO] ------------------------------------------------------------------------
[INFO] No goals needed for project - skipping
[INFO] ------------------------------------------------------------------------
[INFO] Building Jackrabbit JCR Tests
[INFO] ------------------------------------------------------------------------
[INFO] No goals needed for project - skipping
[INFO] ------------------------------------------------------------------------
[INFO] Building Jackrabbit JCR Benchmarks
[INFO] ------------------------------------------------------------------------
[INFO] No goals needed for project - skipping
[INFO] ------------------------------------------------------------------------
[INFO] Building Jackrabbit SPI
[INFO] ------------------------------------------------------------------------
[INFO] No goals needed for project - skipping
[INFO] ------------------------------------------------------------------------
[INFO] Building Jackrabbit SPI Commons
[INFO] ------------------------------------------------------------------------
[HUDSON] Archiving http://hudson.zones.apache.org/hudson/job/Jackrabbit-trunk/org.apache.jackrabbit$jackrabbit/ws/pom.xml
 to /export/home/hudson/hudson/jobs/Jackrabbit-trunk/modules/org.apache.jackrabbit$jackrabbit/builds/2008-04-15_01-08-52/archive/org.apache.jackrabbit/jackrabbit/1.5-SNAPSHOT/pom.xml
[INFO] [antrun:run {execution: add-project-files}]
[INFO] Executing tasks
[INFO] Executed tasks
[INFO] Preparing surefire-report:report-only
[INFO] No goals needed for project - skipping
[INFO] Preparing findbugs:findbugs
[HUDSON] Archiving http://hudson.zones.apache.org/hudson/job/Jackrabbit-trunk/org.apache.jackrabbit$jackrabbit/ws/pom.xml
 to /export/home/hudson/hudson/jobs/Jackrabbit-trunk/modules/org.apache.jackrabbit$jackrabbit/builds/2008-04-15_01-08-52/archive/org.apache.jackrabbit/jackrabbit/1.5-SNAPSHOT/pom.xml
[INFO] [antrun:run {execution: add-project-files}]
[INFO] Executing tasks
[INFO] Executed tasks
[HUDSON] Archiving http://hudson.zones.apache.org/hudson/job/Jackrabbit-trunk/org.apache.jackrabbit$jackrabbit/ws/pom.xml
 to /export/home/hudson/hudson/jobs/Jackrabbit-trunk/modules/org.apache.jackrabbit$jackrabbit/builds/2008-04-15_01-08-52/archive/org.apache.jackrabbit/jackrabbit/1.5-SNAPSHOT/pom.xml
[INFO] [site:stage]
[HUDSON] Archiving http://hudson.zones.apache.org/hudson/job/Jackrabbit-trunk/org.apache.jackrabbit$jackrabbit/ws/pom.xml
 to /export/home/hudson/hudson/jobs/Jackrabbit-trunk/modules/org.apache.jackrabbit$jackrabbit/builds/2008-04-15_01-08-52/archive/org.apache.jackrabbit/jackrabbit/1.5-SNAPSHOT/pom.xml
[INFO] ------------------------------------------------------------------------
[ERROR] BUILD FAILURE
[INFO] ------------------------------------------------------------------------
[INFO] Missing site information in the distribution management element in the project: 'Apache
Jackrabbit'.
[INFO] ------------------------------------------------------------------------
[INFO] For more information, run Maven with the -e switch
[INFO] ------------------------------------------------------------------------
[INFO] Total time: 1 minute 5 seconds
[INFO] Finished at: Tue Apr 15 01:10:00 UTC 2008
[INFO] Final Memory: 38M/85M
[INFO] ------------------------------------------------------------------------


Mime
View raw message