jackrabbit-dev mailing list archives

Site index · List index
Message view « Date » · « Thread »
Top « Date » · « Thread »
From "Andrzej Zydron (JIRA)" <j...@apache.org>
Subject [jira] Updated: (JCR-1161) Export test cases fail with Java 5 on Mac OS X
Date Sat, 03 Nov 2007 05:43:06 GMT

     [ https://issues.apache.org/jira/browse/JCR-1161?page=com.atlassian.jira.plugin.system.issuetabpanels:all-tabpanel
]

Andrzej Zydron updated JCR-1161:
--------------------------------

    Attachment: azydron.vcf

Hi Julian,

I get th same error on Mac OS X 10.4.10 (8R2232) + Java HotSpot(TM) 
Client VM (build 1.5.0_07-87, mixed mode, sharing)

Any recommendations apart from skipping the test?

Thanks in advance,

AZ

-- 
email - azydron@xml-intl.com
smail - c/o Mr. A.Zydron
	PO Box 2167
        Gerrards Cross
        Bucks SL9 8XF
	United Kingdom
Mobile +(44) 7966 477 181
FAX    +(44) 1753 480 465
www - http://www.xml-intl.com

This message contains confidential information and is intended only for
the individual named.  If you are not the named addressee you may not
disseminate, distribute or copy this e-mail.  Please notify the sender
immediately by e-mail if you have received this e-mail by mistake and
delete this e-mail from your system.
E-mail transmission cannot be guaranteed to be secure or error-free as
information could be intercepted, corrupted, lost, destroyed, arrive
late or incomplete, or contain viruses.  The sender therefore does not
accept liability for any errors or omissions in the contents of this
message which arise as a result of e-mail transmission.  If verification
is required please request a hard-copy version. Unless explicitly stated
otherwise this message is provided for informational purposes only and
should not be construed as a solicitation or offer.




> Export test cases fail with Java 5 on Mac OS X
> ----------------------------------------------
>
>                 Key: JCR-1161
>                 URL: https://issues.apache.org/jira/browse/JCR-1161
>             Project: Jackrabbit
>          Issue Type: Bug
>          Components: jackrabbit-jcr-tests
>    Affects Versions: 0.9, 1.0, 1.0.1, 1.1, 1.1.1, 1.2.1, 1.2.2, 1.2.3, 1.3, 1.3.1
>            Reporter: Jukka Zitting
>            Assignee: Jukka Zitting
>            Priority: Minor
>         Attachments: azydron.vcf, azydron.vcf
>
>
> As reported by Roy during the Jackrabbit 1.3.1 release vote:
> I am getting test failures on OS X 10.4.10 (PPC) with java version "1.5.0_07"
> Java(TM) 2 Runtime Environment, Standard Edition (build 1.5.0_07-164)
> Java HotSpot(TM) Client VM (build 1.5.0_07-87, mixed mode, sharing).
> All failures are because of
> junit.framework.AssertionFailedError: namespace: http://www.jcp.org/
> jcr/mix/1.0 not exported
> More details below.
> ....Roy
> Running org.apache.jackrabbit.test.TestAll
> [Fatal Error] :1:10: Attribute name "is" associated with an element
> type "this" must be followed by the ' = ' character.
> [Fatal Error] :1:10: Attribute name "is" associated with an element
> type "this" must be followed by the ' = ' character.
> [Fatal Error] :-1:-1: Premature end of file.
> [Fatal Error] :-1:-1: Premature end of file.
> Tests run: 1055, Failures: 8, Errors: 0, Skipped: 0, Time elapsed:
> 119.126 sec <<< FAILURE!
> Results :
> Failed tests:
>   testExportDocView_handler_session_skipBinary_noRecurse
> (org.apache.jackrabbit.test.api.ExportDocViewTest)
>   testExportDocView_handler_session_skipBinary_recurse
> (org.apache.jackrabbit.test.api.ExportDocViewTest)
>   testExportDocView_handler_session_saveBinary_noRecurse
> (org.apache.jackrabbit.test.api.ExportDocViewTest)
>   testExportDocView_handler_session_saveBinary_recurse
> (org.apache.jackrabbit.test.api.ExportDocViewTest)
>   testExportDocView_stream_session_skipBinary_recurse
> (org.apache.jackrabbit.test.api.ExportDocViewTest)
>   testExportDocView_stream_session_skipBinary_noRecurse
> (org.apache.jackrabbit.test.api.ExportDocViewTest)
>   testExportDocView_stream_session_saveBinary_noRecurse
> (org.apache.jackrabbit.test.api.ExportDocViewTest)
>   testExportDocView_stream_session_saveBinary_recurse
> (org.apache.jackrabbit.test.api.ExportDocViewTest)
> Tests run: 1248, Failures: 8, Errors: 0, Skipped: 0
> ------------------------------------------------------------------------
> -------
> Test set: org.apache.jackrabbit.test.TestAll
> ------------------------------------------------------------------------
> -------
> Tests run: 1055, Failures: 8, Errors: 0, Skipped: 0, Time elapsed:
> 119.124 sec <<< FAILURE!
> testExportDocView_handler_session_skipBinary_noRecurse
> (org.apache.jackrabbit.test.api.ExportDocViewTest)  Time elapsed:
> 0.07 sec  <<< FAILURE!
> junit.framework.AssertionFailedError: namespace: http://www.jcp.org/
> jcr/mix/1.0 not exported

-- 
This message is automatically generated by JIRA.
-
You can reply to this email to add a comment to the issue online.


Mime
View raw message