jackrabbit-dev mailing list archives

Site index · List index
Message view « Date » · « Thread »
Top « Date » · « Thread »
From "Roy T. Fielding" <field...@gbiv.com>
Subject Re: [VOTE] Release Apache Jackrabbit 1.3.1
Date Sat, 28 Jul 2007 01:08:41 GMT
> I have posted a candidate for the Apache Jackrabbit 1.3.1 release at
>
>    http://people.apache.org/~jukka/jackrabbit/1.3.1/

All sigs and hashes good.  However, I am getting test failures on
OS X 10.4.10 (PPC) with java version "1.5.0_07"
Java(TM) 2 Runtime Environment, Standard Edition (build 1.5.0_07-164)
Java HotSpot(TM) Client VM (build 1.5.0_07-87, mixed mode, sharing).

All failures are because of

junit.framework.AssertionFailedError: namespace: http://www.jcp.org/ 
jcr/mix/1.0 not exported

More details below.

....Roy

Running org.apache.jackrabbit.test.TestAll
[Fatal Error] :1:10: Attribute name "is" associated with an element  
type "this" must be followed by the ' = ' character.
[Fatal Error] :1:10: Attribute name "is" associated with an element  
type "this" must be followed by the ' = ' character.
[Fatal Error] :-1:-1: Premature end of file.
[Fatal Error] :-1:-1: Premature end of file.
Tests run: 1055, Failures: 8, Errors: 0, Skipped: 0, Time elapsed:  
119.126 sec <<< FAILURE!

Results :

Failed tests:
   testExportDocView_handler_session_skipBinary_noRecurse 
(org.apache.jackrabbit.test.api.ExportDocViewTest)
   testExportDocView_handler_session_skipBinary_recurse 
(org.apache.jackrabbit.test.api.ExportDocViewTest)
   testExportDocView_handler_session_saveBinary_noRecurse 
(org.apache.jackrabbit.test.api.ExportDocViewTest)
   testExportDocView_handler_session_saveBinary_recurse 
(org.apache.jackrabbit.test.api.ExportDocViewTest)
   testExportDocView_stream_session_skipBinary_recurse 
(org.apache.jackrabbit.test.api.ExportDocViewTest)
   testExportDocView_stream_session_skipBinary_noRecurse 
(org.apache.jackrabbit.test.api.ExportDocViewTest)
   testExportDocView_stream_session_saveBinary_noRecurse 
(org.apache.jackrabbit.test.api.ExportDocViewTest)
   testExportDocView_stream_session_saveBinary_recurse 
(org.apache.jackrabbit.test.api.ExportDocViewTest)

Tests run: 1248, Failures: 8, Errors: 0, Skipped: 0


------------------------------------------------------------------------ 
-------
Test set: org.apache.jackrabbit.test.TestAll
------------------------------------------------------------------------ 
-------
Tests run: 1055, Failures: 8, Errors: 0, Skipped: 0, Time elapsed:  
119.124 sec <<< FAILURE!
testExportDocView_handler_session_skipBinary_noRecurse 
(org.apache.jackrabbit.test.api.ExportDocViewTest)  Time elapsed:  
0.07 sec  <<< FAILURE!
junit.framework.AssertionFailedError: namespace: http://www.jcp.org/ 
jcr/mix/1.0 not exported


Mime
View raw message