jackrabbit-dev mailing list archives

Site index · List index
Message view « Date » · « Thread »
Top « Date » · « Thread »
From "wendy Lee" <hawkliw...@gmail.com>
Subject Re: what wrong when I compile the jackrabbit-core
Date Sat, 16 Dec 2006 11:48:22 GMT
T E S T S
-------------------------------------------------------
Running org.apache.jackrabbit.core.nodetype.compact.TestAll
Tests run: 1, Failures: 0, Errors: 0, Skipped: 0, Time elapsed: 0.453 sec
Running org.apache.jackrabbit.test.TestAll
Tests run: 1055, Failures: 0, Errors: 0, Skipped: 0, Time elapsed: 154.891sec
Running org.apache.jackrabbit.core.xml.TestAll
Tests run: 2, Failures: 0, Errors: 0, Skipped: 0, Time elapsed: 0.094 sec
Running org.apache.jackrabbit.core.observation.TestAll
Tests run: 10, Failures: 0, Errors: 0, Skipped: 0, Time elapsed: 0.562 sec
Running org.apache.jackrabbit.core.query.TestAll
Tests run: 101, Failures: 0, Errors: 0, Skipped: 0, Time elapsed: 21.594 sec
Running org.apache.jackrabbit.core.config.TestAll
Tests run: 9, Failures: 0, Errors: 0, Skipped: 0, Time elapsed: 6.5 sec
Running org.apache.jackrabbit.core.nodetype.xml.TestAll
Tests run: 34, Failures: 0, Errors: 0, Skipped: 0, Time elapsed: 1.328 sec
Running org.apache.jackrabbit.core.TestAll
Tests run: 29, Failures: 1, Errors: 0, Skipped: 0, Time elapsed: 2.516 sec
<<< F
AILURE!
Running org.apache.jackrabbit.core.state.TestAll
Tests run: 3, Failures: 0, Errors: 0, Skipped: 0, Time elapsed: 0.046 sec
Running org.apache.jackrabbit.value.TestAll
Tests run: 1, Failures: 0, Errors: 0, Skipped: 0, Time elapsed: 0.063 sec

Results :
Tests run: 1245, Failures: 1, Errors: 0, Skipped: 0

[INFO]
------------------------------------------------------------------------
[ERROR] BUILD FAILURE
[INFO]
------------------------------------------------------------------------
[INFO] There are test failures.
[INFO]
------------------------------------------------------------------------
[INFO] Trace
org.apache.maven.BuildFailureException: There are test failures.
        at org.apache.maven.lifecycle.DefaultLifecycleExecutor.executeGoals
(Defa
ultLifecycleExecutor.java:555)
        at
org.apache.maven.lifecycle.DefaultLifecycleExecutor.executeGoalWithLi
fecycle(DefaultLifecycleExecutor.java:475)
        at org.apache.maven.lifecycle.DefaultLifecycleExecutor.executeGoal
(Defau
ltLifecycleExecutor.java:454)
        at
org.apache.maven.lifecycle.DefaultLifecycleExecutor.executeGoalAndHan
dleFailures(DefaultLifecycleExecutor.java:306)
        at
org.apache.maven.lifecycle.DefaultLifecycleExecutor.executeTaskSegmen
ts(DefaultLifecycleExecutor.java:273)
        at org.apache.maven.lifecycle.DefaultLifecycleExecutor.execute
(DefaultLi
fecycleExecutor.java:140)
        at org.apache.maven.DefaultMaven.doExecute(DefaultMaven.java:322)
        at org.apache.maven.DefaultMaven.execute(DefaultMaven.java:115)
        at org.apache.maven.cli.MavenCli.main(MavenCli.java:256)
        at sun.reflect.NativeMethodAccessorImpl.invoke0(Native Method)
        at sun.reflect.NativeMethodAccessorImpl.invoke
(NativeMethodAccessorImpl.
java:39)
        at sun.reflect.DelegatingMethodAccessorImpl.invoke
(DelegatingMethodAcces
sorImpl.java:25)
        at java.lang.reflect.Method.invoke(Method.java:585)
        at org.codehaus.classworlds.Launcher.launchEnhanced(Launcher.java
:315)
        at org.codehaus.classworlds.Launcher.launch(Launcher.java:255)
        at org.codehaus.classworlds.Launcher.mainWithExitCode(Launcher.java
:430)

        at org.codehaus.classworlds.Launcher.main(Launcher.java:375)
Caused by: org.apache.maven.plugin.MojoFailureException: There are test
failures
.
        at org.apache.maven.plugin.surefire.SurefirePlugin.execute
(SurefirePlugi
n.java:403)
        at org.apache.maven.plugin.DefaultPluginManager.executeMojo
(DefaultPlugi
nManager.java:412)
        at org.apache.maven.lifecycle.DefaultLifecycleExecutor.executeGoals
(Defa
ultLifecycleExecutor.java:534)
        ... 16 more
[INFO]
------------------------------------------------------------------------
[INFO] Total time: 4 minutes 2 seconds
[INFO] Finished at: Sat Dec 16 19:45:38 CST 2006
[INFO] Final Memory: 6M/21M
[INFO]
------------------------------------------------------------------------




I use mvn clean ,but nothing changed .
how I can skip it.....

Mime
  • Unnamed multipart/alternative (inline, None, 0 bytes)
View raw message