jackrabbit-dev mailing list archives

Site index · List index
Message view « Date » · « Thread »
Top « Date » · « Thread »
From "wendy Lee" <hawkliw...@gmail.com>
Subject what wrong when I compile the jackrabbit-core
Date Tue, 12 Dec 2006 12:06:32 GMT
I just update the source code to newest version ,when I run mvn install
.there are some error in the test .

-------------------------------------------------------
 T E S T S
-------------------------------------------------------
Running org.apache.jackrabbit.init.ExportDocViewTestData
Tests run: 1, Failures: 0, Errors: 1, Skipped: 0, Time elapsed: 7.109 sec
<<< FA
ILURE!
Running org.apache.jackrabbit.init.PropertyTestData
Tests run: 1, Failures: 0, Errors: 1, Skipped: 0, Time elapsed: 0.063 sec
<<< FA
ILURE!
Running org.apache.jackrabbit.init.NodeTestData
Tests run: 1, Failures: 0, Errors: 1, Skipped: 0, Time elapsed: 0.046 sec
<<< FA
ILURE!
Running org.apache.jackrabbit.init.QueryTestData
Tests run: 1, Failures: 0, Errors: 1, Skipped: 0, Time elapsed: 0.047 sec
<<< FA
ILURE!

Results :
Tests run: 4, Failures: 0, Errors: 4, Skipped: 0

[INFO]
------------------------------------------------------------------------
[ERROR] BUILD FAILURE
[INFO]
------------------------------------------------------------------------
[INFO] There are test failures.
[INFO]
------------------------------------------------------------------------
[INFO] Trace
org.apache.maven.BuildFailureException: There are test failures.
        at org.apache.maven.lifecycle.DefaultLifecycleExecutor.executeGoals
(Defa
ultLifecycleExecutor.java:555)
        at
org.apache.maven.lifecycle.DefaultLifecycleExecutor.executeGoalWithLi
fecycle(DefaultLifecycleExecutor.java:475)
        at org.apache.maven.lifecycle.DefaultLifecycleExecutor.executeGoal
(Defau
ltLifecycleExecutor.java:454)
        at
org.apache.maven.lifecycle.DefaultLifecycleExecutor.executeGoalAndHan
dleFailures(DefaultLifecycleExecutor.java:306)
        at
org.apache.maven.lifecycle.DefaultLifecycleExecutor.executeTaskSegmen
ts(DefaultLifecycleExecutor.java:273)
        at org.apache.maven.lifecycle.DefaultLifecycleExecutor.execute
(DefaultLi
fecycleExecutor.java:140)
        at org.apache.maven.DefaultMaven.doExecute(DefaultMaven.java:322)
        at org.apache.maven.DefaultMaven.execute(DefaultMaven.java:115)
        at org.apache.maven.cli.MavenCli.main(MavenCli.java:256)
        at sun.reflect.NativeMethodAccessorImpl.invoke0(Native Method)
        at sun.reflect.NativeMethodAccessorImpl.invoke
(NativeMethodAccessorImpl.
java:39)
        at sun.reflect.DelegatingMethodAccessorImpl.invoke
(DelegatingMethodAcces
sorImpl.java:25)
        at java.lang.reflect.Method.invoke(Method.java:585)
        at org.codehaus.classworlds.Launcher.launchEnhanced(Launcher.java
:315)
        at org.codehaus.classworlds.Launcher.launch(Launcher.java:255)
        at org.codehaus.classworlds.Launcher.mainWithExitCode(Launcher.java
:430)

        at org.codehaus.classworlds.Launcher.main(Launcher.java:375)
Caused by: org.apache.maven.plugin.MojoFailureException: There are test
failures
.
        at org.apache.maven.plugin.surefire.SurefirePlugin.execute
(SurefirePlugi
n.java:403)
        at org.apache.maven.plugin.DefaultPluginManager.executeMojo
(DefaultPlugi
nManager.java:412)
        at org.apache.maven.lifecycle.DefaultLifecycleExecutor.executeGoals
(Defa
ultLifecycleExecutor.java:534)
        ... 16 more
[INFO]
------------------------------------------------------------------------
[INFO] Total time: 19 seconds
[INFO] Finished at: Tue Dec 12 20:00:38 CST 2006
[INFO] Final Memory: 7M/21M
[INFO]
------------------------------------------------------------------------

Mime
  • Unnamed multipart/alternative (inline, None, 0 bytes)
View raw message