jackrabbit-dev mailing list archives

Site index · List index
Message view « Date » · « Thread »
Top « Date » · « Thread »
From Eduardo Cruz <eduardoc...@gmail.com>
Subject Re: Maven Error (II)
Date Fri, 02 Sep 2005 22:02:32 GMT
It seems to be the problem with Xalan, since I´m using JDK 1.5.

I placed the Xalan files in MAVEN_HOME/lib/endorsed and it is still the same 
!!! 

Eduardo

2005/9/2, Eduardo Cruz <eduardocruz@gmail.com>:
> 
> Hi, 
> 
> I installed artifact-plugin 1.6 and now I think its another problem.
> 
> Eduardo
> -----------------------------------
> D:\MyDocuments\jackrabbit>java -version
> java version "1.5.0_04"
> Java(TM) 2 Runtime Environment, Standard Edition (build 1.5.0_04-b05)
> Java HotSpot(TM) Client VM (build 1.5.0_04-b05, mixed mode, sharing)
> 
> D:\MyDocuments\jackrabbit>maven
> __ __
> | \/ |__ _Apache__ ___
> | |\/| / _` \ V / -_) ' \ ~ intelligent projects ~
> |_| |_\__,_|\_/\___|_||_| v. 1.1-beta-1
> 
> DEPRECATED: the default goal should be specified in the <build> section of 
> proje
> ct.xml instead of maven.xml
> build:start:
> 
> multiproject:install:
> multiproject:projects-init:
> [echo] Gathering project list
> Starting the reactor...
> Our processing order:
> Jackrabbit Api
> Jackrabbit Commons
> Jackrabbit Core
> +----------------------------------------
> | Gathering project list Jackrabbit Api
> | Memory: 3M/4M
> +----------------------------------------
> +----------------------------------------
> | Gathering project list Jackrabbit Commons
> | Memory: 3M/4M
> +----------------------------------------
> +----------------------------------------
> | Gathering project list Jackrabbit Core
> | Memory: 3M/4M
> +----------------------------------------
> 
> multiproject:goal:
> Starting the reactor...
> Our processing order:
> Jackrabbit Api
> Jackrabbit Commons
> Jackrabbit Core
> +----------------------------------------
> | Executing multiproject:install-callback Jackrabbit Api
> | Memory: 2M/4M
> +----------------------------------------
> DEPRECATED: the default goal should be specified in the <build> section of 
> proje
> ct.xml instead of maven.xml
> build:start:
> 
> multiproject:install-callback:
> [echo] Running jar:install for Jackrabbit Api
> java:prepare-filesystem:
> [mkdir] Created dir: D:\MyDocuments\jackrabbit\api\target\classes
> 
> java:compile:
> [echo] Compiling to D:\MyDocuments\jackrabbit\api/target/classes
> [echo] No java source files to compile.
> 
> java:jar-resources:
> 
> test:prepare-filesystem:
> [mkdir] Created dir: D:\MyDocuments\jackrabbit\api\target\test-classes
> [mkdir] Created dir: D:\MyDocuments\jackrabbit\api\target\test-reports
> 
> test:test-resources:
> 
> test:compile:
> [echo] No test source files to compile.
> 
> test:test:
> [echo] No tests to run.
> 
> jar:jar:
> [jar] Building jar: D:\MyDocuments\jackrabbit\api\target\jackrabbit-
> api-1.0-
> SNAPSHOT.jar
> 
> jar:install:
> [echo] Installing...
> Uploading to jackrabbit/jars/jackrabbit-api-1.0-SNAPSHOT.jar:
> .................... (4K)
> Uploading to jackrabbit/poms/jackrabbit-api-1.0-SNAPSHOT.pom:
> .................... (0K)
> 
> +----------------------------------------
> | Executing multiproject:install-callback Jackrabbit Commons
> | Memory: 4M/6M
> +----------------------------------------
> DEPRECATED: the default goal should be specified in the <build> section of 
> proje
> ct.xml instead of maven.xml
> 
> build:end:
> 
> Attempting to download jackrabbit-api-1.0-SNAPSHOT.jar.
> Error retrieving artifact from [http://www.day.com/maven/]: 
> org.apache.maven.wag
> on.authorization.AuthorizationException: Access denided to: 
> http://www.day.com/m
> aven///jackrabbit/jars/jackrabbit-api-1.0-SNAPSHOT.jar
> Artifact /jackrabbit/jars/jackrabbit-api-1.0-SNAPSHOT.jar doesn't exist in 
> remot
> e repository, but it exists locally.
> build:start:
> 
> multiproject:install-callback:
> [echo] Running jar:install for Jackrabbit Commons
> java:prepare-filesystem:
> [mkdir] Created dir: D:\MyDocuments\jackrabbit\commons\target\classes
> 
> java:compile:
> [echo] Compiling to D:\MyDocuments\jackrabbit\commons/target/classes
> [javac] Compiling 33 source files to 
> D:\MyDocuments\jackrabbit\commons\targe
> t\classes
> 
> java:jar-resources:
> 
> test:prepare-filesystem:
> [mkdir] Created dir: D:\MyDocuments\jackrabbit\commons\target\test-classes
> [mkdir] Created dir: D:\MyDocuments\jackrabbit\commons\target\test-reports
> 
> test:test-resources:
> 
> test:compile:
> [javac] Compiling 3 source files to 
> D:\MyDocuments\jackrabbit\commons\target
> \test-classes
> 
> test:test:
> [junit] Running org.apache.jackrabbit.name.TestAll
> [junit] Tests run: 6, Failures: 0, Errors: 0, Time elapsed: 0,36 sec
> 
> jar:jar:
> [jar] Building jar: 
> D:\MyDocuments\jackrabbit\commons\target\jackrabbit-comm
> ons-1.0-SNAPSHOT.jar
> 
> jar:install:
> [echo] Installing...
> Uploading to jackrabbit/jars/jackrabbit-commons-1.0-SNAPSHOT.jar:
> .................... (66K)
> Uploading to jackrabbit/poms/jackrabbit-commons-1.0-SNAPSHOT.pom:
> .................... (1K)
> 
> +----------------------------------------
> | Executing multiproject:install-callback Jackrabbit Core
> | Memory: 11M/15M
> +----------------------------------------
> DEPRECATED: the default goal should be specified in the <build> section of 
> proje
> ct.xml instead of maven.xml
> 
> build:end:
> 
> Attempting to download jackrabbit-commons-1.0-SNAPSHOT.jar.
> Error retrieving artifact from [http://www.day.com/maven/]: 
> org.apache.maven.wag
> on.authorization.AuthorizationException: Access denided to: 
> http://www.day.com/m
> aven///jackrabbit/jars/jackrabbit-commons-1.0-SNAPSHOT.jar
> Artifact /jackrabbit/jars/jackrabbit-commons-1.0-SNAPSHOT.jar doesn't 
> exist in r
> emote repository, but it exists locally.
> Attempting to download cqfs-jackrabbit-3.5.6-SNAPSHOT.jar.
> Attempting to download cqfs-3.5.6-SNAPSHOT.jar.
> build:start:
> 
> multiproject:install-callback:
> [echo] Running jar:install for Jackrabbit Core
> java:prepare-filesystem:
> [mkdir] Created dir: D:\MyDocuments\jackrabbit\core\target\classes
> Running post goal: java:prepare-filesystem
> jackrabbit:generate-sql-parser:
> javacc:
> [echo] jjtree grammar: 
> D:\MyDocuments\jackrabbit\core/src/grammar/sql/JCRSQL
> .jjt
> javacc:jjtree-generate:
> [echo] javaccPackageName:org.apache.jackrabbit.core.query.sql
> [echo] jjtreePackageName:org.apache.jackrabbit.core.query.sql
> 
> -OUTPUT_DIRECTORY=D:\MyDocuments\jackrabbit\core\target\generated-src\main\java\
> org\apache\jackrabbit\core\query\sql
> Creating directory: 
> D:\MyDocuments\jackrabbit\core\target\generated-src\main\jav
> a\org\apache\jackrabbit\core\query\sql
> Creating directorty: 
> D:\MyDocuments\jackrabbit\core\target\generated-src\main\ja
> va\org\apache\jackrabbit\core\query\sql
> Java Compiler Compiler Version 3.2 (Tree Builder)
> (type "jjtree" with no arguments for help)
> Reading from file 
> D:\MyDocuments\jackrabbit\core\src\grammar\sql\JCRSQL.jjt . .
> .
> File 
> "D:\MyDocuments\jackrabbit\core\target\generated-src\main\java\org\apache\j
> ackrabbit\core\query\sql\Node.java" does not exist. Will create one.
> File 
> "D:\MyDocuments\jackrabbit\core\target\generated-src\main\java\org\apache\j
> ackrabbit\core\query\sql\SimpleNode.java" does not exist. Will create one.
> File 
> "D:\MyDocuments\jackrabbit\core\target\generated-src\main\java\org\apache\j
> ackrabbit\core\query\sql\ASTQuery.java" does not exist. Will create one.
> File 
> "D:\MyDocuments\jackrabbit\core\target\generated-src\main\java\org\apache\j
> ackrabbit\core\query\sql\ASTSelectList.java" does not exist. Will create 
> one.
> File 
> "D:\MyDocuments\jackrabbit\core\target\generated-src\main\java\org\apache\j
> ackrabbit\core\query\sql\ASTFromClause.java" does not exist. Will create 
> one.
> File 
> "D:\MyDocuments\jackrabbit\core\target\generated-src\main\java\org\apache\j
> ackrabbit\core\query\sql\ASTWhereClause.java" does not exist. Will create 
> one.
> File 
> "D:\MyDocuments\jackrabbit\core\target\generated-src\main\java\org\apache\j
> ackrabbit\core\query\sql\ASTPredicate.java" does not exist. Will create 
> one.
> File 
> "D:\MyDocuments\jackrabbit\core\target\generated-src\main\java\org\apache\j
> ackrabbit\core\query\sql\ASTOrExpression.java" does not exist. Will create 
> one.
> 
> File 
> "D:\MyDocuments\jackrabbit\core\target\generated-src\main\java\org\apache\j
> ackrabbit\core\query\sql\ASTAndExpression.java" does not exist. Will 
> create one
> .
> File 
> "D:\MyDocuments\jackrabbit\core\target\generated-src\main\java\org\apache\j
> ackrabbit\core\query\sql\ASTNotExpression.java" does not exist. Will 
> create one
> .
> File 
> "D:\MyDocuments\jackrabbit\core\target\generated-src\main\java\org\apache\j
> ackrabbit\core\query\sql\ASTBracketExpression.java" does not exist. Will 
> create
> one.
> File 
> "D:\MyDocuments\jackrabbit\core\target\generated-src\main\java\org\apache\j
> ackrabbit\core\query\sql\ASTContainsExpression.java" does not exist. Will 
> creat
> e one.
> File 
> "D:\MyDocuments\jackrabbit\core\target\generated-src\main\java\org\apache\j
> ackrabbit\core\query\sql\ASTLiteral.java" does not exist. Will create one.
> File 
> "D:\MyDocuments\jackrabbit\core\target\generated-src\main\java\org\apache\j
> ackrabbit\core\query\sql\ASTIdentifier.java" does not exist. Will create 
> one.
> File 
> "D:\MyDocuments\jackrabbit\core\target\generated-src\main\java\org\apache\j
> ackrabbit\core\query\sql\ASTOrderByClause.java" does not exist. Will 
> create one
> .
> File 
> "D:\MyDocuments\jackrabbit\core\target\generated-src\main\java\org\apache\j
> ackrabbit\core\query\sql\ASTOrderSpec.java" does not exist. Will create 
> one.
> File 
> "D:\MyDocuments\jackrabbit\core\target\generated-src\main\java\org\apache\j
> ackrabbit\core\query\sql\ASTAscendingOrderSpec.java" does not exist. Will 
> creat
> e one.
> File 
> "D:\MyDocuments\jackrabbit\core\target\generated-src\main\java\org\apache\j
> ackrabbit\core\query\sql\ASTDescendingOrderSpec.java" does not exist. Will 
> crea
> te one.
> Annotated grammar generated successfully in 
> D:\MyDocuments\jackrabbit\core\targe
> t\generated-src\main\java\org\apache\jackrabbit\core\query\sql\JCRSQL.jj
> [echo] 
> D:\MyDocuments\jackrabbit\core\target\generated-src\main\java\org\apa
> che\jackrabbit\core\query\sql\JCRSQL.jj
> 
> javacc:javacc-generate:
> Java Compiler Compiler Version 3.2 (Parser Generator)
> (type "javacc" with no arguments for help)
> Reading from file 
> D:\MyDocuments\jackrabbit\core\target\generated-src\main\java\
> org\apache\jackrabbit\core\query\sql\JCRSQL.jj . . .
> Note: UNICODE_INPUT option is specified. Please make sure you create the 
> parser/
> lexer usig a Reader with the correct character encoding.
> File "TokenMgrError.java" does not exist. Will create one.
> File "ParseException.java" does not exist. Will create one.
> File "Token.java" does not exist. Will create one.
> File "SimpleCharStream.java" does not exist. Will create one.
> Parser generated successfully.
> 
> 
> [delete] Deleting 4 files from 
> D:\MyDocuments\jackrabbit\core\target\generat
> ed-src\main\java\org\apache\jackrabbit\core\query\sql
> 
> jackrabbit:generate-xpath-parser:
> [mkdir] Created dir: 
> D:\MyDocuments\jackrabbit\core\target\generated-src\mai
> n\javacc
> 
> 
> 
> [xslt] Processing D:\MyDocuments\jackrabbit\core\src\grammar\xpath\x
> path-grammar.xml to 
> D:\MyDocuments\jackrabbit\core\target\generated-src\main\jav
> acc\stripped-xpath-grammar.xml
> [xslt] Loading stylesheet 
> D:\MyDocuments\jackrabbit\core\src\grammar\xpath\s
> trip.xsl
> 
> BUILD FAILED
> File...... C:\Documents and 
> Settings\ecrs\.maven\cache\maven-multiproject-plugin
> -1.4.1\plugin.jelly
> Element... maven:reactor
> Line...... 218
> Column.... 9
> Unable to obtain goal [multiproject:install-callback] -- 
> D:\MyDocuments\jackrabb
> it\core\maven.xml:132:25: <ant:xslt> Provider 
> org.apache.xalan.processor.Transfo
> rmerFactoryImpl not found
> Total time : 36 seconds
> Finished at : Sexta-feira, 2 de Setembro de 2005 14h19min6s BRT
> 
> -- 
> 
> Eduardo Cruz
> -----------------------------------
> http://EduardoCruz.com
> ----------------------------------- 
> 



-- 

Eduardo Cruz
-----------------------------------
http://EduardoCruz.com
-----------------------------------

Mime
  • Unnamed multipart/alternative (inline, None, 0 bytes)
View raw message