jackrabbit-dev mailing list archives

Site index · List index
Message view « Date » · « Thread »
Top « Date » · « Thread »
From Eduardo Cruz <eduardoc...@gmail.com>
Subject Maven error
Date Thu, 01 Sep 2005 19:43:01 GMT
I downloaded Jackrabbit, when I start maven I got the following log above 
!!! 

Eduardo
--------------------------------------

D:\MyDocuments\jackrabbit>maven
__ __
| \/ |__ _Apache__ ___
| |\/| / _` \ V / -_) ' \ ~ intelligent projects ~
|_| |_\__,_|\_/\___|_||_| v. 1.1-beta-1

DEPRECATED: the default goal should be specified in the <build> section of 
proje
ct.xml instead of maven.xml
build:start:

multiproject:install:
multiproject:projects-init:
[echo] Gathering project list
Starting the reactor...
Our processing order:
Jackrabbit Api
Jackrabbit Commons
Jackrabbit Core
+----------------------------------------
| Gathering project list Jackrabbit Api
| Memory: 2M/4M
+----------------------------------------
+----------------------------------------
| Gathering project list Jackrabbit Commons
| Memory: 2M/4M
+----------------------------------------
+----------------------------------------
| Gathering project list Jackrabbit Core
| Memory: 2M/4M
+----------------------------------------

multiproject:goal:
Starting the reactor...
Our processing order:
Jackrabbit Api
Jackrabbit Commons
Jackrabbit Core
+----------------------------------------
| Executing multiproject:install-callback Jackrabbit Api
| Memory: 3M/4M
+----------------------------------------
DEPRECATED: the default goal should be specified in the <build> section of 
proje
ct.xml instead of maven.xml
build:start:

multiproject:install-callback:
[echo] Running jar:install for Jackrabbit Api
java:prepare-filesystem:

java:compile:
[echo] Compiling to D:\MyDocuments\jackrabbit\api/target/classes
[echo] No java source files to compile.

java:jar-resources:

test:prepare-filesystem:

test:test-resources:

test:compile:
[echo] No test source files to compile.

test:test:
[echo] No tests to run.

jar:jar:

jar:install:
[echo] Installing...
Uploading to jackrabbit/jars/jackrabbit-api-1.0-SNAPSHOT.jar:
.................... (4K)
[MethodExpression] Cannot evaluate expression
java.lang.reflect.InvocationTargetException
at sun.reflect.NativeMethodAccessorImpl.invoke0(Native Method)
at sun.reflect.NativeMethodAccessorImpl.invoke(NativeMethodAccessorImpl.
java:39)
at sun.reflect.DelegatingMethodAccessorImpl.invoke(DelegatingMethodAcces
sorImpl.java:25)
at java.lang.reflect.Method.invoke(Method.java:585)
at org.apache.commons.betwixt.expression.MethodExpression.evaluate(Metho
dExpression.java:96)
at org.apache.commons.betwixt.io.AbstractBeanWriter.writeContent(Abstrac
tBeanWriter.java:658)
at org.apache.commons.betwixt.io.AbstractBeanWriter.writeRestOfElement(A
bstractBeanWriter.java:539)
at org.apache.commons.betwixt.io.AbstractBeanWriter.write(AbstractBeanWr
iter.java:481)
at org.apache.commons.betwixt.io.AbstractBeanWriter.writeContent(Abstrac
tBeanWriter.java:643)
at org.apache.commons.betwixt.io.AbstractBeanWriter.writeRestOfElement(A
bstractBeanWriter.java:539)
at org.apache.commons.betwixt.io.AbstractBeanWriter.write(AbstractBeanWr
iter.java:481)
at org.apache.commons.betwixt.io.AbstractBeanWriter.write(AbstractBeanWr
iter.java:242)
at org.apache.commons.betwixt.io.AbstractBeanWriter.write(AbstractBeanWr
iter.java:162)
at org.apache.commons.betwixt.io.BeanWriter.write(BeanWriter.java:217)
at org.apache.maven.artifact.PomRewriter.getRewrittenModel(PomRewriter.j
ava:135)
at org.apache.maven.artifact.PomRewriter.getRewrittenPom(PomRewriter.jav
a:57)
at org.apache.maven.artifact.deployer.DefaultArtifactDeployer.handleInst
all(DefaultArtifactDeployer.java:174)
at org.apache.maven.artifact.deployer.DefaultArtifactDeployer.install(De
faultArtifactDeployer.java:143)
at org.apache.maven.artifact.deployer.DeployBean.install(DeployBean.java
:160)
at sun.reflect.NativeMethodAccessorImpl.invoke0(Native Method)
at sun.reflect.NativeMethodAccessorImpl.invoke(NativeMethodAccessorImpl.
java:39)
at sun.reflect.DelegatingMethodAccessorImpl.invoke(DelegatingMethodAcces
sorImpl.java:25)
at java.lang.reflect.Method.invoke(Method.java:585)
at org.apache.commons.jelly.impl.DynamicBeanTag.doTag(DynamicBeanTag.jav
a:180)
at org.apache.commons.jelly.impl.StaticTagScript.run(StaticTagScript.jav
a:102)
at org.apache.commons.jelly.impl.ScriptBlock.run(ScriptBlock.java:95)
at org.apache.commons.jelly.impl.DynamicTag.doTag(DynamicTag.java:79)
at org.apache.commons.jelly.impl.TagScript.run(TagScript.java:247)
at org.apache.commons.jelly.impl.ScriptBlock.run(ScriptBlock.java:95)
at org.apache.maven.jelly.tags.werkz.MavenGoalTag.runBodyTag(MavenGoalTa
g.java:78)
at org.apache.maven.jelly.tags.werkz.MavenGoalTag$MavenGoalAction.perfor
mAction(MavenGoalTag.java:109)
at org.apache.maven.werkz.Goal.fire(Goal.java:656)
at org.apache.maven.werkz.Goal.attain(Goal.java:592)
at org.apache.maven.werkz.WerkzProject.attainGoal(WerkzProject.java:210)

at org.apache.maven.jelly.tags.werkz.MavenAttainGoalTag.doTag(MavenAttai
nGoalTag.java:114)
at org.apache.commons.jelly.impl.TagScript.run(TagScript.java:247)
at org.apache.commons.jelly.impl.ScriptBlock.run(ScriptBlock.java:95)
at org.apache.maven.jelly.tags.werkz.MavenGoalTag.runBodyTag(MavenGoalTa
g.java:78)
at org.apache.maven.jelly.tags.werkz.MavenGoalTag$MavenGoalAction.perfor
mAction(MavenGoalTag.java:109)
at org.apache.maven.werkz.Goal.fire(Goal.java:656)
at org.apache.maven.werkz.Goal.attain(Goal.java:592)
at org.apache.maven.plugin.PluginManager.attainGoals(PluginManager.java:
693)
at org.apache.maven.MavenSession.attainGoals(MavenSession.java:263)
at org.apache.maven.jelly.tags.maven.ReactorTag.doTag(ReactorTag.java:36
8)
at org.apache.commons.jelly.impl.TagScript.run(TagScript.java:247)
at org.apache.commons.jelly.impl.ScriptBlock.run(ScriptBlock.java:95)
at org.apache.maven.jelly.tags.werkz.MavenGoalTag.runBodyTag(MavenGoalTa
g.java:78)
at org.apache.maven.jelly.tags.werkz.MavenGoalTag$MavenGoalAction.perfor
mAction(MavenGoalTag.java:109)
at org.apache.maven.werkz.Goal.fire(Goal.java:656)
at org.apache.maven.werkz.Goal.attain(Goal.java:592)
at org.apache.maven.werkz.WerkzProject.attainGoal(WerkzProject.java:210)

at org.apache.maven.jelly.tags.werkz.MavenAttainGoalTag.doTag(MavenAttai
nGoalTag.java:114)
at org.apache.commons.jelly.impl.TagScript.run(TagScript.java:247)
at org.apache.commons.jelly.impl.ScriptBlock.run(ScriptBlock.java:95)
at org.apache.maven.jelly.tags.werkz.MavenGoalTag.runBodyTag(MavenGoalTa
g.java:78)
at org.apache.maven.jelly.tags.werkz.MavenGoalTag$MavenGoalAction.perfor
mAction(MavenGoalTag.java:109)
at org.apache.maven.werkz.Goal.fire(Goal.java:656)
at org.apache.maven.werkz.Goal.attain(Goal.java:592)
at org.apache.maven.plugin.PluginManager.attainGoals(PluginManager.java:
693)
at org.apache.maven.MavenSession.attainGoals(MavenSession.java:263)
at org.apache.maven.cli.App.doMain(App.java:511)
at org.apache.maven.cli.App.main(App.java:1258)
at sun.reflect.NativeMethodAccessorImpl.invoke0(Native Method)
at sun.reflect.NativeMethodAccessorImpl.invoke(NativeMethodAccessorImpl.
java:39)
at sun.reflect.DelegatingMethodAccessorImpl.invoke(DelegatingMethodAcces
sorImpl.java:25)
at java.lang.reflect.Method.invoke(Method.java:585)
at com.werken.forehead.Forehead.run(Forehead.java:551)
at com.werken.forehead.Forehead.main(Forehead.java:581)
Caused by: java.lang.NumberFormatException: null
at java.lang.Integer.parseInt(Integer.java:415)
at java.lang.Integer.parseInt(Integer.java:497)
at org.apache.maven.project.Project.isPomCurrent(Project.java:486)
... 68 more
Uploading to jackrabbit/poms/jackrabbit-api-1.0-SNAPSHOT.pom:
.................... (1K)

+----------------------------------------
| Executing multiproject:install-callback Jackrabbit Commons
| Memory: 5M/6M
+----------------------------------------
DEPRECATED: the default goal should be specified in the <build> section of 
proje
ct.xml instead of maven.xml

build:end:

Attempting to download jackrabbit-api-1.0-SNAPSHOT.jar.
Error retrieving artifact from [http://www.day.com/maven/]: 
org.apache.maven.wag
on.authorization.AuthorizationException: Access denided to: 
http://www.day.com/m
aven///jackrabbit/jars/jackrabbit-api-1.0-SNAPSHOT.jar
Artifact /jackrabbit/jars/jackrabbit-api-1.0-SNAPSHOT.jar doesn't exist in 
remot
e repository, but it exists locally.
build:start:

multiproject:install-callback:
[echo] Running jar:install for Jackrabbit Commons
java:prepare-filesystem:

java:compile:
[echo] Compiling to D:\MyDocuments\jackrabbit\commons/target/classes

java:jar-resources:

test:prepare-filesystem:

test:test-resources:

test:compile:

test:test:
[junit] Running org.apache.jackrabbit.name.TestAll
[junit] Tests run: 6, Failures: 0, Errors: 0, Time elapsed: 0,344 sec

jar:jar:

jar:install:
[echo] Installing...
Uploading to jackrabbit/jars/jackrabbit-commons-1.0-SNAPSHOT.jar:
.................... (66K)

BUILD FAILED
File...... C:\Documents and 
Settings\ecrs\.maven\cache\maven-multiproject-plugin
-1.4.1\plugin.jelly
Element... maven:reactor
Line...... 218
Column.... 9
Unable to obtain goal [multiproject:install-callback] -- C:\Documents and 
Settin
gs\ecrs\.maven\cache\maven-artifact-plugin-1.5.2\plugin.jelly:62:9:<artifact:ar
tifact-install> org.apache.maven.project.Dependency.setProperties
(Ljava/util/Lis
t;)V
Total time : 25 seconds
Finished at : Quarta-feira, 31 de Agosto de 2005 16h27min17s BRT


-- 

Eduardo Cruz
-----------------------------------
http://EduardoCruz.com
-----------------------------------

Mime
  • Unnamed multipart/alternative (inline, None, 0 bytes)
View raw message