incubator-yoko-dev mailing list archives

Site index · List index
Message view « Date » · « Thread »
Top « Date » · « Thread »
From "Mosur Ravi, Balaji" <br...@iona.com>
Subject RE: Tests failed
Date Fri, 13 Jul 2007 11:17:05 GMT
Hi,

There is a known problem in windows. You would have to use the maven repository without spaces
in windows to workaround it...

Yoko-users list should be fine...

- Balaji


-----Original Message-----
From: Lukas Zapletal [mailto:lukas.zapletal@gmail.com]
Sent: Fri 7/13/2007 3:57 AM
To: yoko-dev@incubator.apache.org
Subject: Re: Tests failed
 
mvn -Dmaven.test.skip=true

helped

ps - what is wrong with yoko-users list archive? can I subscribe
there? does it work?

2007/7/13, Lukas Zapletal <lukas.zapletal@gmail.com>:
> Hello,
>
> I am trying to compile the current SVN version and I am getting:
>
>
> .......
> [surefire] testPortableTypes(org.apache.yoko.TypesTest)  Time elapsed:
> 0,14 sec  <<< ERROR!
> java.lang.Error: java.rmi.ServerException: RemoteException occurred in
> server thread; nested exception is:
>         java.rmi.UnmarshalException: error unmarshalling arguments;
> nested exception is:
>         java.net.MalformedURLException: no protocol: and
>         at org.apache.yoko.processmanager.ProcessManager.<init>(ProcessManager.java:51)
>         at org.apache.yoko.AbstractOrbTestBase.setUp(AbstractOrbTestBase.java:56)
>         at junit.framework.TestCase.runBare(TestCase.java:128)
>         at junit.framework.TestResult$1.protect(TestResult.java:106)
>         at junit.framework.TestResult.runProtected(TestResult.java:124)
>         at junit.framework.TestResult.run(TestResult.java:109)
>         at junit.framework.TestCase.run(TestCase.java:120)
>         at junit.framework.TestSuite.runTest(TestSuite.java:230)
>         at junit.framework.TestSuite.run(TestSuite.java:225)
>         at sun.reflect.NativeMethodAccessorImpl.invoke0(Native Method)
>         at sun.reflect.NativeMethodAccessorImpl.invoke(Unknown Source)
>         at sun.reflect.DelegatingMethodAccessorImpl.invoke(Unknown Source)
>         at java.lang.reflect.Method.invoke(Unknown Source)
>         at org.apache.maven.surefire.battery.JUnitBattery.executeJUnit(JUnitBattery.java:242)
>         at org.apache.maven.surefire.battery.JUnitBattery.execute(JUnitBattery.java:216)
>         at org.apache.maven.surefire.Surefire.executeBattery(Surefire.java:215)
>         at org.apache.maven.surefire.Surefire.run(Surefire.java:163)
>         at org.apache.maven.surefire.Surefire.run(Surefire.java:87)
>         at org.apache.maven.surefire.Surefire.run(Surefire.java:63)
>         at sun.reflect.NativeMethodAccessorImpl.invoke0(Native Method)
>         at sun.reflect.NativeMethodAccessorImpl.invoke(Unknown Source)
>         at sun.reflect.DelegatingMethodAccessorImpl.invoke(Unknown Source)
>         at java.lang.reflect.Method.invoke(Unknown Source)
>         at org.apache.maven.surefire.SurefireBooter.main(SurefireBooter.java:785)
> Caused by: java.rmi.ServerException: RemoteException occurred in
> server thread; nested exception is:
>         java.rmi.UnmarshalException: error unmarshalling arguments;
> nested exception is:
>         java.net.MalformedURLException: no protocol: and
>         at sun.rmi.server.UnicastServerRef.oldDispatch(Unknown Source)
>         at sun.rmi.server.UnicastServerRef.dispatch(Unknown Source)
>         at sun.rmi.transport.Transport$1.run(Unknown Source)
>         at java.security.AccessController.doPrivileged(Native Method)
>         at sun.rmi.transport.Transport.serviceCall(Unknown Source)
>         at sun.rmi.transport.tcp.TCPTransport.handleMessages(Unknown Source)
>         at sun.rmi.transport.tcp.TCPTransport$ConnectionHandler.run0(Unknown
> Source)
>         at sun.rmi.transport.tcp.TCPTransport$ConnectionHandler.run(Unknown
> Source)
>         at java.util.concurrent.ThreadPoolExecutor$Worker.runTask(Unknown
> Source)
>         at java.util.concurrent.ThreadPoolExecutor$Worker.run(Unknown Source)
>         at java.lang.Thread.run(Unknown Source)
>         at sun.rmi.transport.StreamRemoteCall.exceptionReceivedFromServer(Unknown
> Source)
>         at sun.rmi.transport.StreamRemoteCall.executeCall(Unknown Source)
>         at sun.rmi.server.UnicastRef.invoke(Unknown Source)
>         at sun.rmi.registry.RegistryImpl_Stub.rebind(Unknown Source)
>         at org.apache.yoko.processmanager.ProcessManager.<init>(ProcessManager.java:48)
>         ... 23 more
> Caused by: java.rmi.UnmarshalException: error unmarshalling arguments;
> nested exception is:
>         java.net.MalformedURLException: no protocol: and
>         at sun.rmi.registry.RegistryImpl_Skel.dispatch(Unknown Source)
>         at sun.rmi.server.UnicastServerRef.oldDispatch(Unknown Source)
>         at sun.rmi.server.UnicastServerRef.dispatch(Unknown Source)
>         at sun.rmi.transport.Transport$1.run(Unknown Source)
>         at java.security.AccessController.doPrivileged(Native Method)
>         at sun.rmi.transport.Transport.serviceCall(Unknown Source)
>         at sun.rmi.transport.tcp.TCPTransport.handleMessages(Unknown Source)
>         at sun.rmi.transport.tcp.TCPTransport$ConnectionHandler.run0(Unknown
> Source)
>         at sun.rmi.transport.tcp.TCPTransport$ConnectionHandler.run(Unknown
> Source)
>         at java.util.concurrent.ThreadPoolExecutor$Worker.runTask(Unknown
> Source)
>         at java.util.concurrent.ThreadPoolExecutor$Worker.run(Unknown Source)
>         at java.lang.Thread.run(Unknown Source)
> Caused by: java.net.MalformedURLException: no protocol: and
>         at java.net.URL.<init>(Unknown Source)
>         at java.net.URL.<init>(Unknown Source)
>         at java.net.URL.<init>(Unknown Source)
>         at sun.rmi.server.LoaderHandler.pathToURLs(Unknown Source)
>         at sun.rmi.server.LoaderHandler.loadClass(Unknown Source)
>         at java.rmi.server.RMIClassLoader$2.loadClass(Unknown Source)
>         at java.rmi.server.RMIClassLoader.loadClass(Unknown Source)
>         at sun.rmi.server.MarshalInputStream.resolveClass(Unknown Source)
>         at java.io.ObjectInputStream.readNonProxyDesc(Unknown Source)
>         at java.io.ObjectInputStream.readClassDesc(Unknown Source)
>         at java.io.ObjectInputStream.readOrdinaryObject(Unknown Source)
>         at java.io.ObjectInputStream.readObject0(Unknown Source)
>         at java.io.ObjectInputStream.readObject(Unknown Source)
>         ... 12 more
>
> [surefire] testUnion(org.apache.yoko.TypesTest)  Time elapsed: 0,15
> sec  <<< ERROR!
> java.lang.Error: java.rmi.ServerException: RemoteException occurred in
> server thread; nested exception is:
>         java.rmi.UnmarshalException: error unmarshalling arguments;
> nested exception is:
>         java.net.MalformedURLException: no protocol: and
>         at org.apache.yoko.processmanager.ProcessManager.<init>(ProcessManager.java:51)
>         at org.apache.yoko.AbstractOrbTestBase.setUp(AbstractOrbTestBase.java:56)
>         at junit.framework.TestCase.runBare(TestCase.java:128)
>         at junit.framework.TestResult$1.protect(TestResult.java:106)
>         at junit.framework.TestResult.runProtected(TestResult.java:124)
>         at junit.framework.TestResult.run(TestResult.java:109)
>         at junit.framework.TestCase.run(TestCase.java:120)
>         at junit.framework.TestSuite.runTest(TestSuite.java:230)
>         at junit.framework.TestSuite.run(TestSuite.java:225)
>         at sun.reflect.NativeMethodAccessorImpl.invoke0(Native Method)
>         at sun.reflect.NativeMethodAccessorImpl.invoke(Unknown Source)
>         at sun.reflect.DelegatingMethodAccessorImpl.invoke(Unknown Source)
>         at java.lang.reflect.Method.invoke(Unknown Source)
>         at org.apache.maven.surefire.battery.JUnitBattery.executeJUnit(JUnitBattery.java:242)
>         at org.apache.maven.surefire.battery.JUnitBattery.execute(JUnitBattery.java:216)
>         at org.apache.maven.surefire.Surefire.executeBattery(Surefire.java:215)
>         at org.apache.maven.surefire.Surefire.run(Surefire.java:163)
>         at org.apache.maven.surefire.Surefire.run(Surefire.java:87)
>         at org.apache.maven.surefire.Surefire.run(Surefire.java:63)
>         at sun.reflect.NativeMethodAccessorImpl.invoke0(Native Method)
>         at sun.reflect.NativeMethodAccessorImpl.invoke(Unknown Source)
>         at sun.reflect.DelegatingMethodAccessorImpl.invoke(Unknown Source)
>         at java.lang.reflect.Method.invoke(Unknown Source)
>         at org.apache.maven.surefire.SurefireBooter.main(SurefireBooter.java:785)
> Caused by: java.rmi.ServerException: RemoteException occurred in
> server thread; nested exception is:
>         java.rmi.UnmarshalException: error unmarshalling arguments;
> nested exception is:
>         java.net.MalformedURLException: no protocol: and
>         at sun.rmi.server.UnicastServerRef.oldDispatch(Unknown Source)
>         at sun.rmi.server.UnicastServerRef.dispatch(Unknown Source)
>         at sun.rmi.transport.Transport$1.run(Unknown Source)
>         at java.security.AccessController.doPrivileged(Native Method)
>         at sun.rmi.transport.Transport.serviceCall(Unknown Source)
>         at sun.rmi.transport.tcp.TCPTransport.handleMessages(Unknown Source)
>         at sun.rmi.transport.tcp.TCPTransport$ConnectionHandler.run0(Unknown
> Source)
>         at sun.rmi.transport.tcp.TCPTransport$ConnectionHandler.run(Unknown
> Source)
>         at java.util.concurrent.ThreadPoolExecutor$Worker.runTask(Unknown
> Source)
>         at java.util.concurrent.ThreadPoolExecutor$Worker.run(Unknown Source)
>         at java.lang.Thread.run(Unknown Source)
>         at sun.rmi.transport.StreamRemoteCall.exceptionReceivedFromServer(Unknown
> Source)
>         at sun.rmi.transport.StreamRemoteCall.executeCall(Unknown Source)
>         at sun.rmi.server.UnicastRef.invoke(Unknown Source)
>         at sun.rmi.registry.RegistryImpl_Stub.rebind(Unknown Source)
>         at org.apache.yoko.processmanager.ProcessManager.<init>(ProcessManager.java:48)
>         ... 23 more
> Caused by: java.rmi.UnmarshalException: error unmarshalling arguments;
> nested exception is:
>         java.net.MalformedURLException: no protocol: and
>         at sun.rmi.registry.RegistryImpl_Skel.dispatch(Unknown Source)
>         at sun.rmi.server.UnicastServerRef.oldDispatch(Unknown Source)
>         at sun.rmi.server.UnicastServerRef.dispatch(Unknown Source)
>         at sun.rmi.transport.Transport$1.run(Unknown Source)
>         at java.security.AccessController.doPrivileged(Native Method)
>         at sun.rmi.transport.Transport.serviceCall(Unknown Source)
>         at sun.rmi.transport.tcp.TCPTransport.handleMessages(Unknown Source)
>         at sun.rmi.transport.tcp.TCPTransport$ConnectionHandler.run0(Unknown
> Source)
>         at sun.rmi.transport.tcp.TCPTransport$ConnectionHandler.run(Unknown
> Source)
>         at java.util.concurrent.ThreadPoolExecutor$Worker.runTask(Unknown
> Source)
>         at java.util.concurrent.ThreadPoolExecutor$Worker.run(Unknown Source)
>         at java.lang.Thread.run(Unknown Source)
> Caused by: java.net.MalformedURLException: no protocol: and
>         at java.net.URL.<init>(Unknown Source)
>         at java.net.URL.<init>(Unknown Source)
>         at java.net.URL.<init>(Unknown Source)
>         at sun.rmi.server.LoaderHandler.pathToURLs(Unknown Source)
>         at sun.rmi.server.LoaderHandler.loadClass(Unknown Source)
>         at java.rmi.server.RMIClassLoader$2.loadClass(Unknown Source)
>         at java.rmi.server.RMIClassLoader.loadClass(Unknown Source)
>         at sun.rmi.server.MarshalInputStream.resolveClass(Unknown Source)
>         at java.io.ObjectInputStream.readNonProxyDesc(Unknown Source)
>         at java.io.ObjectInputStream.readClassDesc(Unknown Source)
>         at java.io.ObjectInputStream.readOrdinaryObject(Unknown Source)
>         at java.io.ObjectInputStream.readObject0(Unknown Source)
>         at java.io.ObjectInputStream.readObject(Unknown Source)
>         ... 12 more
>
>
>
> Results :
> [surefire] Tests run: 46, Failures: 0, Errors: 46
>
> [INFO] ------------------------------------------------------------------------
> [ERROR] BUILD ERROR
> [INFO] ------------------------------------------------------------------------
> [INFO] There are test failures.
> [INFO] ------------------------------------------------------------------------
> [INFO] For more information, run Maven with the -e switch
> [INFO] ------------------------------------------------------------------------
> [INFO] Total time: 30 seconds
> [INFO] Finished at: Fri Jul 13 08:39:10 CEST 2007
> [INFO] Final Memory: 13M/25M
> [INFO] ------------------------------------------------------------------------
>
> --
> Lukas Zapletal
> http://lukas.zapletalovi.com
>


-- 
Lukas Zapletal
http://lukas.zapletalovi.com


Mime
  • Unnamed multipart/alternative (inline, None, 0 bytes)
View raw message