incubator-yoko-dev mailing list archives

Site index · List index
Message view « Date » · « Thread »
Top « Date » · « Thread »
From "Darren Middleman" <dmiddle...@gmail.com>
Subject Re: [continuum] BUILD FAILURE: Apache Yoko Bindings
Date Fri, 15 Jun 2007 22:58:43 GMT
This looks to be caused by a change in CXF.  I had to check out a copy of
CXF and build it on my local machine (which meant the latest CXF version was
finally installed to my .m2 folder) to see the failures.  I think my most
recent commit should fix the problems.

Cheers,
Darren


On 6/15/07, Darren Middleman <dmiddleman@gmail.com> wrote:
>
> This is odd...I can't get these failures on a checked out copy of Yoko.
> Everything builds fine for me.
>
> I'll keep looking into these failures....
>
> Darren
>
> On 6/15/07, Continuum@vmbuild.apache.org <
> yoko-commits@incubator.apache.org> wrote:
> >
> > Online report :
> > http://vmbuild.apache.org/continuum/servlet/continuum/target/ProjectBuild.vm/view/ProjectBuild/id/214/buildId/183797
> > Build statistics:
> >   State: Failed
> >   Previous State: Failed
> >   Started at: Fri, 15 Jun 2007 14:16:41 -0700
> >   Finished at: Fri, 15 Jun 2007 14:20:11 -0700
> >   Total time: 3m 29s
> >   Build Trigger: Schedule
> >   Exit code: 1
> >   Building machine hostname: vmbuild.apache.org
> >   Operating system : Linux(unknown)
> >   Java version : 1.5.0_06(Sun Microsystems Inc.)
> >
> > Changes
> >          dmiddlem          Update to resolve continuum failures.
> >
> >
> > /incubator/yoko/trunk/bindings/src/main/java/org/apache/yoko/bindings/corba/CorbaDestination.java
> >
> >
> >
> > ****************************************************************************
> > Output:
> >
> > ****************************************************************************
> > [INFO] Scanning for projects...
> > [INFO]
> > ----------------------------------------------------------------------------
> >
> > [INFO] Building Apache Yoko Bindings
> > [INFO]    task-segment: [clean, install]
> > [INFO]
> > ----------------------------------------------------------------------------
> > [INFO] [clean:clean]
> > [INFO] Deleting directory /x1/continuum/working-directory/214/target
> > [INFO] Deleting directory
> > /x1/continuum/working-directory/214/target/classes
> > [INFO] Deleting directory
> > /x1/continuum/working-directory/214/target/test-classes
> > [INFO] Deleting directory
> > /x1/continuum/working-directory/214/target/site
> > [INFO] [dependency:copy {execution: default}]
> > [INFO] Configured Artifact: org.apache.yoko:yoko-spec-corba:?:jar
> > [INFO] Configured Artifact: org.apache.yoko:yoko-core:?:jar
> > [INFO] Copying yoko-spec-corba-1.0-incubating-SNAPSHOT.jar to
> > /x1/continuum/working-directory/214/target/endorsed/yoko-
> > spec-corba-1.0-incubating-SNAPSHOT.jar
> > [INFO] Copying yoko-core-1.0-incubating-SNAPSHOT.jar to
> > /x1/continuum/working-directory/214/target/endorsed/yoko-
> > core-1.0-incubating-SNAPSHOT.jar
> > [INFO] Setting property: classpath.resource.loader.class => '
> > org.codehaus.plexus.velocity.ContextClassLoaderResourceLoader'.
> > [INFO] Setting property: velocimacro.messages.on => 'false'.
> > [INFO] Setting property: resource.loader => 'classpath'.
> > [INFO] Setting property: resource.manager.logwhenfound => 'false'.
> > [INFO] **************************************************************
> > [INFO] Starting Jakarta Velocity v1.4
> > [INFO] RuntimeInstance initializing.
> > [INFO] Default Properties File:
> > org/apache/velocity/runtime/defaults/velocity.properties
> > [INFO] Default ResourceManager initializing. (class
> > org.apache.velocity.runtime.resource.ResourceManagerImpl )
> > [INFO] Resource Loader Instantiated:
> > org.codehaus.plexus.velocity.ContextClassLoaderResourceLoader
> > [INFO] ClasspathResourceLoader : initialization starting.
> > [INFO] ClasspathResourceLoader : initialization complete.
> > [INFO] ResourceCache : initialized. (class
> > org.apache.velocity.runtime.resource.ResourceCacheImpl)
> > [INFO] Default ResourceManager initialization complete.
> > [INFO] Loaded System Directive:
> > org.apache.velocity.runtime.directive.Literal
> > [INFO] Loaded System Directive:
> > org.apache.velocity.runtime.directive.Macro
> > [INFO] Loaded System Directive:
> > org.apache.velocity.runtime.directive.Parse
> > [INFO] Loaded System Directive:
> > org.apache.velocity.runtime.directive.Include
> > [INFO] Loaded System Directive:
> > org.apache.velocity.runtime.directive.Foreach
> > [INFO] Created: 20 parsers.
> > [INFO] Velocimacro : initialization starting.
> > [INFO] Velocimacro : adding VMs from VM library template :
> > VM_global_library.vm
> > [ERROR] ResourceManager : unable to find resource 'VM_global_library.vm'
> > in any resource loader.
> > [INFO] Velocimacro : error using  VM library template
> > VM_global_library.vm :
> > org.apache.velocity.exception.ResourceNotFoundException : Unable to find
> > resource 'VM_global_library.vm'
> > [INFO] Velocimacro :  VM library template macro registration complete.
> > [INFO] Velocimacro : allowInline = true : VMs can be defined inline in
> > templates
> > [INFO] Velocimacro : allowInlineToOverride = false : VMs defined inline
> > may NOT replace previous VM definitions
> > [INFO] Velocimacro : allowInlineLocal = false : VMs defined inline will
> > be  global in scope if allowed.
> > [INFO] Velocimacro : initialization complete.
> > [INFO] Velocity successfully started.
> > [INFO] [checkstyle:checkstyle {execution: process-sources}]
> > [INFO] Starting audit...
> > Audit done.
> >
> > [WARNING] Unable to locate Source XRef to link to - DISABLED
> > [INFO] Setting property: classpath.resource.loader.class => '
> > org.codehaus.plexus.velocity.ContextClassLoaderResourceLoader '.
> > [INFO] Setting property: velocimacro.messages.on => 'false'.
> > [INFO] Setting property: resource.loader => 'classpath'.
> > [INFO] Setting property: resource.manager.logwhenfound => 'false'.
> > [INFO] [remote-resources:process {execution: default}]
> > [INFO] [resources:resources]
> > [INFO] Using default encoding to copy filtered resources.
> > [INFO] Copying 5 resources
> > [INFO] Copying 4 resources
> > [INFO] Resource directory does not exist:
> > /x1/continuum/working-directory/214/target/generated/src/main/resources
> > [INFO] Copying 2 resources to META-INF
> > [INFO] Copying 3 resources
> > [INFO] [compiler:compile]
> > [INFO] Compiling 72 source files to
> > /x1/continuum/working-directory/214/target/classes
> > [WARNING]
> > /x1/continuum/working-directory/214/src/main/java/org/apache/yoko/bindings/corba/interceptors/CorbaStreamFaultInInterceptor.java:[62,8]
> > [deprecation] AbstractPhaseInterceptor() in
> > org.apache.cxf.phase.AbstractPhaseInterceptor has been deprecated
> >
> > [WARNING]
> > /x1/continuum/working-directory/214/src/main/java/org/apache/yoko/bindings/corba/interceptors/CorbaStreamFaultInInterceptor.java:[63,8]
> > [deprecation] setPhase( java.lang.String) in
> > org.apache.cxf.phase.AbstractPhaseInterceptor has been deprecated
> >
> > [WARNING]
> > /x1/continuum/working-directory/214/src/main/java/org/apache/yoko/bindings/corba/interceptors/CorbaStreamInInterceptor.java:[73,8]
> > [deprecation] AbstractPhaseInterceptor() in
> > org.apache.cxf.phase.AbstractPhaseInterceptor has been deprecated
> >
> > [WARNING]
> > /x1/continuum/working-directory/214/src/main/java/org/apache/yoko/bindings/corba/interceptors/CorbaStreamInInterceptor.java:[74,8]
> > [deprecation] setPhase( java.lang.String) in
> > org.apache.cxf.phase.AbstractPhaseInterceptor has been deprecated
> >
> > [WARNING]
> > /x1/continuum/working-directory/214/src/main/java/org/apache/yoko/bindings/corba/interceptors/CorbaStreamOutInterceptor.java:[54,8]
> > [deprecation] AbstractPhaseInterceptor() in
> > org.apache.cxf.phase.AbstractPhaseInterceptor has been deprecated
> >
> > [WARNING]
> > /x1/continuum/working-directory/214/src/main/java/org/apache/yoko/bindings/corba/interceptors/CorbaStreamOutInterceptor.java:[55,8]
> > [deprecation] setPhase( java.lang.String) in
> > org.apache.cxf.phase.AbstractPhaseInterceptor has been deprecated
> >
> > [WARNING]
> > /x1/continuum/working-directory/214/src/main/java/org/apache/yoko/bindings/corba/interceptors/CorbaStreamFaultOutInterceptor.java:[75,8]
> > [deprecation] AbstractPhaseInterceptor() in
> > org.apache.cxf.phase.AbstractPhaseInterceptor has been deprecated
> >
> > [WARNING]
> > /x1/continuum/working-directory/214/src/main/java/org/apache/yoko/bindings/corba/interceptors/CorbaStreamFaultOutInterceptor.java:[76,8]
> > [deprecation] setPhase( java.lang.String) in
> > org.apache.cxf.phase.AbstractPhaseInterceptor has been deprecated
> >
> > [WARNING]
> > /x1/continuum/working-directory/214/src/main/java/org/apache/yoko/bindings/corba/interceptors/CorbaStreamOutEndingInterceptor.java:[61,8]
> > [deprecation] AbstractPhaseInterceptor() in
> > org.apache.cxf.phase.AbstractPhaseInterceptor has been deprecated
> >
> > [WARNING]
> > /x1/continuum/working-directory/214/src/main/java/org/apache/yoko/bindings/corba/interceptors/CorbaStreamOutEndingInterceptor.java:[62,8]
> > [deprecation] setPhase( java.lang.String) in
> > org.apache.cxf.phase.AbstractPhaseInterceptor has been deprecated
> >
> > [INFO] [antrun:run {execution: generate-test-sources}]
> > [INFO] Executing tasks
> >     [mkdir] Created dir:
> > /x1/continuum/working-directory/214/target/generated/src/test/resources/wsdl/type_test
> >
> >      [xslt] Processing
> > /x1/continuum/working-directory/214/src/test/resources/wsdl/type_test/type_test.xsd
> > to
> > /x1/continuum/working-directory/214/target/generated/src/test/resources/wsdl/type_test/type_test_1.xsd
> >      [xslt] Loading stylesheet
> > /x1/continuum/working-directory/214/src/test/resources/wsdl/type_test/type_test_ID_xsd.xsl
> >
> >      [xslt] Processing
> > /x1/continuum/working-directory/214/src/test/resources/wsdl/type_test/type_test.xsd
> > to
> > /x1/continuum/working-directory/214/target/generated/src/test/resources/wsdl/type_test/type_test_2.xsd
> >      [xslt] Loading stylesheet
> > /x1/continuum/working-directory/214/src/test/resources/wsdl/type_test/type_test_ID_xsd.xsl
> >
> >      [xslt] Processing
> > /x1/continuum/working-directory/214/src/test/resources/wsdl/type_test/type_test.xsd
> > to
> > /x1/continuum/working-directory/214/target/generated/src/test/resources/wsdl/type_test/type_test_3.xsd
> >      [xslt] Loading stylesheet
> > /x1/continuum/working-directory/214/src/test/resources/wsdl/type_test/type_test_ID_xsd.xsl
> >
> >      [xslt] Processing
> > /x1/continuum/working-directory/214/src/test/resources/wsdl/type_test/type_test.xsd
> > to
> > /x1/continuum/working-directory/214/target/generated/src/test/resources/wsdl/type_test/type_test_corba_inc.wsdl
> >
> >      [xslt] Loading stylesheet
> > /x1/continuum/working-directory/214/src/test/resources/wsdl/type_test/type_test_wsdl.xsl
> >     [mkdir] Created dir:
> > /x1/continuum/working-directory/214/target/generated/src/test/java/org/apache/type_test/corba
> >
> >      [xslt] Processing
> > /x1/continuum/working-directory/214/src/test/resources/wsdl/type_test/type_test.xsd
> > to
> > /x1/continuum/working-directory/214/target/generated/src/test/java/org/apache/type_test/corba/TypeTestImpl.java
> >
> >      [xslt] Loading stylesheet
> > /x1/continuum/working-directory/214/src/test/resources/wsdl/type_test/type_test_impl_java.xsl
> >      [xslt] Processing
> > /x1/continuum/working-directory/214/src/test/resources/wsdl/type_test/type_test.xsd
> > to
> > /x1/continuum/working-directory/214/target/generated/src/test/java/org/apache/type_test/corba/TypeTestTester.java
> >
> >      [xslt] Loading stylesheet
> > /x1/continuum/working-directory/214/src/test/resources/wsdl/type_test/type_test_tester_java.xsl
> > [INFO] Executed tasks
> > [INFO] Registering compile test source root
> > /x1/continuum/working-directory/214/target/generated/src/test/java
> > [INFO] [yokos:wsdltoidl {execution: generate-type-test-corba-binding}]
> > wsdltoidl -d
> > /x1/continuum/working-directory/214/target/generated/src/test/resources/wsdl/type_test
> > -corba -w type_test_corba.wsdl -b TypeTestCORBABinding -verbose
> > /x1/continuum/working-directory/214/target/generated/src/test/resources/wsdl/type_test/type_test_corba_inc.wsdl
> >
> > wsdltoidl - 2.0-incubator-SNAPSHOT
> >
> > Retrieving document at
> > '/x1/continuum/working-directory/214/target/generated/src/test/resources/wsdl/type_test/type_test_corba_inc.wsdl'.
> > Jun 15, 2007 2:17:30 PM
> > org.apache.yoko.tools.processors.wsdl.WSDLToCorbaHelper createArray
> > WARNING: Couldn't Map to Array:{http://apache.org/type_test/corba}AnonymousStructSequenceStructArray:minOccurs=1:maxOccurs=1
> >
> > <http://apache.org/type_test/corba%7DAnonymousStructSequenceStructArray:minOccurs=1:maxOccurs=1>
> > Jun 15, 2007 2:17:30 PM
> > org.apache.yoko.tools.processors.wsdl.WSDLToCorbaHelper createArray
> > WARNING: Couldn't Map to Array:{http://apache.org/type_test/corba}AnonymousStructSequenceStructArray:minOccurs=1:maxOccurs=1<http://apache.org/type_test/corba%7DAnonymousStructSequenceStructArray:minOccurs=1:maxOccurs=1>
> > Jun 15, 2007 2:17:30 PM
> > org.apache.yoko.tools.processors.wsdl.WSDLToCorbaHelper createArray
> > WARNING: Couldn't Map to Array:{
> > http://apache.org/type_test/corba}AnonymousStructSequenceStructArray:minOccurs=1:maxOccurs=1<http://apache.org/type_test/corba%7DAnonymousStructSequenceStructArray:minOccurs=1:maxOccurs=1>
> > Jun 15, 2007 2:17:30 PM
> > org.apache.yoko.tools.processors.wsdl.WSDLToCorbaHelper createArray
> > WARNING: Couldn't Map to Array:{http://apache.org/type_test/corba}AnonymousStructSequenceStructArray:minOccurs=1:maxOccurs=1
> >
> > <http://apache.org/type_test/corba%7DAnonymousStructSequenceStructArray:minOccurs=1:maxOccurs=1>
> > Jun 15, 2007 2:17:30 PM
> > org.apache.yoko.tools.processors.wsdl.WSDLToCorbaHelper createArray
> > WARNING: Couldn't Map to Array:{http://apache.org/type_test/corba}AnonymousStructSequenceStructArray:minOccurs=1:maxOccurs=1<http://apache.org/type_test/corba%7DAnonymousStructSequenceStructArray:minOccurs=1:maxOccurs=1>
> > Jun 15, 2007 2:17:30 PM
> > org.apache.yoko.tools.processors.wsdl.WSDLToCorbaHelper createArray
> > WARNING: Couldn't Map to Array:{
> > http://apache.org/type_test/corba}AnonymousStructSequenceStructArray:minOccurs=1:maxOccurs=1<http://apache.org/type_test/corba%7DAnonymousStructSequenceStructArray:minOccurs=1:maxOccurs=1>
> > Jun 15, 2007 2:17:30 PM
> > org.apache.yoko.tools.processors.wsdl.WSDLToCorbaHelper createArray
> > WARNING: Couldn't Map to Array:{http://apache.org/type_test/corba}AnonymousStructSequenceStructArray:minOccurs=1:maxOccurs=1
> >
> > <http://apache.org/type_test/corba%7DAnonymousStructSequenceStructArray:minOccurs=1:maxOccurs=1>
> > Jun 15, 2007 2:17:30 PM
> > org.apache.yoko.tools.processors.wsdl.WSDLToCorbaHelper createArray
> > WARNING: Couldn't Map to Array:{http://apache.org/type_test/corba}AnonymousStructSequenceStructArray:minOccurs=1:maxOccurs=1<http://apache.org/type_test/corba%7DAnonymousStructSequenceStructArray:minOccurs=1:maxOccurs=1>
> > Jun 15, 2007 2:17:30 PM
> > org.apache.yoko.tools.processors.wsdl.WSDLToCorbaHelper createArray
> > WARNING: Couldn't Map to Array:{
> > http://apache.org/type_test/corba}AnonymousStructSequenceStructArray:minOccurs=1:maxOccurs=1<http://apache.org/type_test/corba%7DAnonymousStructSequenceStructArray:minOccurs=1:maxOccurs=1>
> > Jun 15, 2007 2:17:30 PM
> > org.apache.yoko.tools.processors.wsdl.WSDLToCorbaHelper createArray
> > WARNING: Couldn't Map to Array:{http://apache.org/type_test/corba}AnonymousStructSequenceStructArray:minOccurs=1:maxOccurs=1
> >
> > <http://apache.org/type_test/corba%7DAnonymousStructSequenceStructArray:minOccurs=1:maxOccurs=1>
> > Jun 15, 2007 2:17:30 PM
> > org.apache.yoko.tools.processors.wsdl.WSDLToCorbaHelper createArray
> > WARNING: Couldn't Map to Array:{http://apache.org/type_test/corba}AnonymousStructSequenceStructArray:minOccurs=1:maxOccurs=1<http://apache.org/type_test/corba%7DAnonymousStructSequenceStructArray:minOccurs=1:maxOccurs=1>
> > [INFO] [yokos:idltowsdl {execution:
> > idltowsdl-generate-type-test-corba-binding}]
> > ( interface idltowsdlTypeTest { ( greetMe string ( in string name ) ) (
> > typedef long TpInt32 ) ( typedef TpInt32 TpDuration ) ( testAlias TpDuration
> > ( in TpDuration inDuration ) ( inout TpDuration inoutDuration ) ( out
> > TpDuration outDuration ) ) ( testFloat float ( in float inFloat ) ( inout
> > float inoutFloat ) ( out float outFloat ) ) ( testDouble double ( in double
> > inDouble ) ( inout double inoutDouble ) ( out double outDouble ) ) (
> > testShort short ( in short inShort ) ( inout short inoutShort ) ( out short
> > outShort ) ) ( testLong long ( in long inLong ) ( inout long inoutLong ) (
> > out long outLong ) ) ( testLongLong long long ( in long long inLongLong ) (
> > inout long long inoutLongLong ) ( out long long outLongLong ) ) (
> > testUnsignedShort unsigned short ( in unsigned short inUnsignedShort ) (
> > inout unsigned short inoutUnsignedShort ) ( out unsigned short
> > outUnsignedShort ) ) ( testUnsignedLong unsigned long ( in unsigned long
> > inUnsignedLong ) ( inout unsigned long inoutUnsignedLong ) ( out unsigned
> > long outUnsignedLong ) ) ( testUnsignedLongLong unsigned long long ( in
> > unsigned long long inUnsignedLongLong ) ( inout unsigned long long
> > inoutUnsignedLongLong ) ( out unsigned long long outUnsignedLongLong ) ) (
> > testChar char ( in char inChar ) ( inout char inoutChar ) ( out char outChar
> > ) ) ( testWchar wchar ( in wchar inWchar ) ( inout wchar inoutWchar ) ( out
> > wchar outWchar ) ) ( testBoolean boolean ( in boolean inBoolean ) ( inout
> > boolean inoutBoolean ) ( out boolean outBoolean ) ) ( testOctet octet ( in
> > octet inOctet ) ( inout octet inoutOctet ) ( out octet outOctet ) ) (
> > testAny any ( in any inAny ) ( inout any inoutAny ) ( out any outAny ) ) (
> > typedef ( sequence long ) seqLong ) ( testSeqLong seqLong ( in seqLong
> > inSeqLong ) ( inout seqLong inoutSeqLong ) ( out seqLong outSeqLong ) ) (
> > testString string ( in string inString ) ( inout string inoutString ) ( out
> > string outString ) ) ( testWstring wstring ( in wstring inWstring ) ( inout
> > wstring inoutWstring ) ( out wstring outWstring ) ) ( typedef ( fixed 31 2 )
> > fixedPt ) ( testFixedPt fixedPt ( in fixedPt inFixedPt ) ( inout fixedPt
> > inoutFixedPt ) ( out fixedPt outFixedPt ) ) ( struct struct1 long
> > struct1long short struct1short ) ( struct struct2 long struct2long struct1
> > struct2struct ) ( testStruct struct1 ( in struct1 inStruct1 ) ( inout
> > struct1 inoutStruct1 ) ( out struct1 outStruct1 ) ) ( enum enum1 e1_1 e1_2
> > e1_3 e1_4 e1_5 e1_6 ) ( union union1 enum1 ( case e1_1 long u1_1 ) ( case (
> > case e1_2 ) e1_3 string u1_2 ) ( default short u1_3 ) ) ( testUnion union1 (
> > in union1 inUnion1 ) ( inout union1 inoutUnion1 ) ( out union1 outUnion1 ) )
> > ( testEnum enum1 ( in enum1 inEnum1 ) ( inout enum1 inoutEnum1 ) ( out enum1
> > outEnum1 ) ) ( typedef ( sequence union1 ) unionSet ) ( testUnionSet
> > unionSet ( in unionSet inUnionSet ) ( inout unionSet inoutUnionSet ) ( out
> > unionSet outUnionSet ) ) ( typedef ( sequence struct2 ) structSet ) (
> > typedef ( sequence enum1 ) enumSet ) ( typedef ( sequence string ) stringSet
> > ) ( union union2 enum1 ( case e1_1 union1 u2_1 ) ( case e1_2 enum1 u2_2 ) (
> > case e1_3 unionSet u2_3 ) ( case e1_4 enumSet u2_4 ) ( case e1_5 stringSet
> > u2_5 ) ( default structSet u2_6 ) ) ( testUnionVariants union2 ( in union2
> > inUnion2 ) ( inout union2 inoutUnion2 ) ( out union2 outUnion2 ) ) (
> > testAnonString ( string 4 ) ( in ( string 4 ) inAnonString ) ( inout (
> > string 4 ) inoutAnonString ) ( out ( string 4 ) outAnonString ) ) (
> > testAnonWstring ( wstring 4 ) ( in ( wstring 4 ) inAnonWstring ) ( inout (
> > wstring 4 ) inoutAnonWstring ) ( out ( wstring 4 ) outAnonWstring ) ) (
> > struct RecursiveStruct string name ( sequence RecursiveStruct ) children ) (
> > union RecursiveUnion short ( case 1 string case1 ) ( case 2 ( sequence
> > RecursiveUnion ) children ) ( default long id ) ) ( testRecursiveStruct
> > RecursiveStruct ( in RecursiveStruct inStruct ) ( inout RecursiveStruct
> > inoutStruct ) ( out RecursiveStruct outStruct ) ) ( testRecursiveUnion
> > RecursiveUnion ( in RecursiveUnion inUnion ) ( inout RecursiveUnion
> > inoutUnion ) ( out RecursiveUnion outUnion ) ) } )
> > [INFO] [resources:testResources]
> > [INFO] Using default encoding to copy filtered resources.
> > [INFO] Copying 0 resource
> > [INFO] Copying 25 resources
> > [INFO] Copying 8 resources
> > [INFO] Copying 3 resources
> > [INFO] [cxf-codegen:wsdl2java {execution:
> > generate-type-test-java-sources}]
> > Jun 15, 2007 2:17:40 PM org.apache.cxf.tools.wsdlto.core.PluginLoaderloadPlugin
> > INFO: Loading plugin
> > jar:file:/home/continuum/.m2/repository/org/apache/cxf/cxf-tools-wsdlto-frontend-jaxws/2.0-incubator-SNAPSHOT/cxf-
> >
> > tools-wsdlto-frontend-jaxws-2.0-incubator-SNAPSHOT.jar!/META-INF/tools-plugin.xml
> > Jun 15, 2007 2:17:40 PM org.apache.cxf.tools.wsdlto.core.PluginLoaderloadPlugin
> > INFO: Found 1 frontends in <jaxws> plugin.
> > Jun 15, 2007 2:17:40 PM org.apache.cxf.tools.wsdlto.core.PluginLoaderloadPlugin
> > INFO: Loading <jaxws> frontend from <jaxws> plugin.
> > Jun 15, 2007 2:17:40 PM org.apache.cxf.tools.wsdlto.core.PluginLoaderloadPlugin
> > INFO: Loading plugin
> > jar:file:/home/continuum/.m2/repository/org/apache/cxf/cxf-tools-wsdlto-databinding-jaxb/2.0-incubator-SNAPSHOT/cxf-
> > tools-wsdlto-databinding-jaxb-2.0-incubator-SNAPSHOT.jar!/META-INF/tools-plugin.xml
> > Jun 15, 2007 2:17:40 PM org.apache.cxf.tools.wsdlto.core.PluginLoaderloadPlugin
> > INFO: Found 1 databindings in <jaxb> plugin.
> > Jun 15, 2007 2:17:40 PM org.apache.cxf.tools.wsdlto.core.PluginLoaderloadPlugin
> > INFO: Loading <jaxb> databinding from <jaxb> plugin.
> > Loading FrontEnd jaxws ...
> > Loading DataBinding jaxb ...
> > wsdl2java -d
> > /x1/continuum/working-directory/214/target/generated/src/test/java -verbose
> > /x1/continuum/working-directory/214/target/generated/src/test/resources/wsdl/type_test/type_test_corba.wsdl
> >
> > wsdl2java - 2.0-incubator-SNAPSHOT
> >
> > Jun 15, 2007 2:17:42 PM
> > org.springframework.context.support.AbstractApplicationContext refresh
> > INFO: Refreshing org.apache.cxf.bus.spring.BusApplicationContext@13a4a2f:
> > display name [ org.apache.cxf.bus.spring.BusApplicationContext@13a4a2f];
> > startup date [Fri Jun 15 14:17:42 PDT 2007]; root of context hierarchy
> > Jun 15, 2007 2:17:42 PM org.apache.cxf.bus.spring.BusApplicationContextgetConfigResources
> > INFO: Could not find the configuration file cxf.xml on the classpath.
> > Jun 15, 2007 2:17:42 PM
> > org.springframework.beans.factory.xml.XmlBeanDefinitionReaderloadBeanDefinitions
> > INFO: Loading XML bean definitions from class path resource
> > [META-INF/cxf/cxf.xml]
> > Jun 15, 2007 2:17:42 PM
> > org.springframework.context.support.AbstractApplicationContext refresh
> > INFO: Bean factory for application context [
> > org.apache.cxf.bus.spring.BusApplicationContext@13a4a2f]:
> > org.springframework.beans.factory.support.DefaultListableBeanFactory@9ebbfd
> > Jun 15, 2007 2:17:43 PM
> > org.springframework.context.support.AbstractApplicationContext$BeanPostProcessorCheckerpostProcessAfterInitialization
> > INFO: Bean 'org.apache.cxf.bus.spring.Jsr250BeanPostProcessor' is not
> > eligible for getting processed by all BeanPostProcessors (for example: not
> > eligible for auto-proxying)
> > Jun 15, 2007 2:17:43 PM
> > org.springframework.context.support.AbstractApplicationContext$BeanPostProcessorCheckerpostProcessAfterInitialization
> > INFO: Bean 'cxf' is not eligible for getting processed by all
> > BeanPostProcessors (for example: not eligible for auto-proxying)
> > Jun 15, 2007 2:17:43 PM
> > org.springframework.context.support.AbstractApplicationContext$BeanPostProcessorCheckerpostProcessAfterInitialization
> > INFO: Bean 'org.apache.cxf.bus.spring.BusExtensionPostProcessor' is not
> > eligible for getting processed by all BeanPostProcessors (for example: not
> > eligible for auto-proxying)
> > Jun 15, 2007 2:17:43 PM
> > org.springframework.beans.factory.support.DefaultListableBeanFactorypreInstantiateSingletons
> > INFO: Pre-instantiating singletons in
> > org.springframework.beans.factory.support.DefaultListableBeanFactory@9ebbfd: defining beans [cxf,
> > org.apache.cxf.bus.spring.Jsr250BeanPostProcessor,
> > org.apache.cxf.bus.spring.BusExtensionPostProcessor,
> > org.apache.cxf.resource.ResourceManager,
> > org.apache.cxf.binding.BindingFactoryManager,
> > org.apache.cxf.transport.DestinationFactoryManager ,
> > org.apache.cxf.transport.ConduitInitiatorManager,
> > org.apache.cxf.wsdl.WSDLManager,org.apache.cxf.phase.PhaseManager,
> > org.apache.cxf.workqueue.WorkQueueManager,
> > org.apache.cxf.buslifecycle.BusLifeCycleManager,
> > org.apache.cxf.endpoint.ServerRegistry ,
> > org.apache.cxf.endpoint.ServerLifeCycleManager,
> > org.apache.cxf.endpoint.ClientLifeCycleManager,
> > org.apache.cxf.transports.http.QueryHandlerRegistry,
> > org.apache.cxf.endpoint.EndpointResolverRegistry,
> > org.apache.cxf.headers.HeaderManager ,
> > org.apache.cxf.catalog.OASISCatalogManager]; root of factory hierarchy
> > [INFO] [cxf-codegen:wsdl2java {execution:
> > generate-corba-type-test-java-sources}]
> > Loading FrontEnd jaxws ...
> > Loading DataBinding jaxb ...
> > wsdl2java -d
> > /x1/continuum/working-directory/214/target/generated/src/test/java -verbose
> > /x1/continuum/working-directory/214/target/generated/src/test/resources/wsdl/type_test/idltowsdl_type_test.wsdl
> > wsdl2java - 2.0-incubator-SNAPSHOT
> >
> > [INFO] [cxf-codegen:wsdl2java {execution:
> > generate-corba-object-reference-test-java-sources}]
> > Loading FrontEnd jaxws ...
> > Loading DataBinding jaxb ...
> > wsdl2java -d
> > /x1/continuum/working-directory/214/target/generated/src/test/java -verbose
> > /x1/continuum/working-directory/214/src/test/resources/wsdl/ObjectRef.wsdl
> > wsdl2java - 2.0-incubator-SNAPSHOT
> >
> > Loading FrontEnd jaxws ...
> > Loading DataBinding jaxb ...
> > wsdl2java -d
> > /x1/continuum/working-directory/214/target/generated/src/test/java -verbose
> > /x1/continuum/working-directory/214/src/test/resources/wsdl/NestedObjRef.wsdl
> >
> > wsdl2java - 2.0-incubator-SNAPSHOT
> >
> > [INFO] [cxf-codegen:wsdl2java {execution:
> > generate-corba-exception-test-java-sources}]
> > Loading FrontEnd jaxws ...
> > Loading DataBinding jaxb ...
> > wsdl2java -d
> > /x1/continuum/working-directory/214/target/generated/src/test/java -verbose
> > /x1/continuum/working-directory/214/src/test/resources/wsdl/SystemEx.wsdl
> > wsdl2java - 2.0-incubator-SNAPSHOT
> >
> > Loading FrontEnd jaxws ...
> > Loading DataBinding jaxb ...
> > wsdl2java -d
> > /x1/continuum/working-directory/214/target/generated/src/test/java -verbose
> > /x1/continuum/working-directory/214/src/test/resources/wsdl/exceptions.wsdl
> > wsdl2java - 2.0-incubator-SNAPSHOT
> >
> > [INFO] [cxf-codegen:wsdl2java {execution:
> > generate-corba-any-test-java-sources}]
> > Loading FrontEnd jaxws ...
> > Loading DataBinding jaxb ...
> > wsdl2java -d
> > /x1/continuum/working-directory/214/target/generated/src/test/java -verbose
> > /x1/continuum/working-directory/214/src/test/resources/wsdl/AnyTest.wsdl
> > wsdl2java - 2.0-incubator-SNAPSHOT
> >
> > [INFO] [cxf-codegen:wsdl2java {execution:
> > generate-duplicate-operation-name-test-java-sources}]
> > Loading FrontEnd jaxws ...
> > Loading DataBinding jaxb ...
> > wsdl2java -d
> > /x1/continuum/working-directory/214/target/generated/src/test/java -verbose
> > /x1/continuum/working-directory/214/src/test/resources/wsdl/OpNames.wsdl
> > wsdl2java - 2.0-incubator-SNAPSHOT
> >
> > [INFO] [compiler:testCompile]
> > [INFO] Compiling 410 source files to
> > /x1/continuum/working-directory/214/target/test-classes
> > [WARNING]
> > /x1/continuum/working-directory/214/src/test/java/org/apache/yoko/bindings/corba/CorbaConduitTest.java:[206,65]
> > [unchecked] unchecked conversion
> > found   : java.util.HashMap
> > required: java.util.Map<org.omg.CORBA.TypeCode,
> > org.apache.schemas.yoko.bindings.corba.RaisesType>
> >
> > [WARNING]
> > /x1/continuum/working-directory/214/src/test/java/org/apache/yoko/bindings/corba/CorbaConduitTest.java:[207,52]
> > [unchecked] unchecked conversion
> > found   : java.util.ArrayList
> > required: java.util.List<
> > org.apache.schemas.yoko.bindings.corba.RaisesType>
> >
> > [WARNING]
> > /x1/continuum/working-directory/214/src/test/java/org/apache/yoko/bindings/corba/CorbaConduitTest.java:[228,52]
> > [unchecked] unchecked conversion
> > found   : java.util.List
> > required: java.util.List<org.apache.yoko.bindings.corba.CorbaTypeMap>
> >
> > [INFO] [surefire:test]
> > [INFO] Setting reports dir:
> > /x1/continuum/working-directory/214/target/surefire-reports
> >
> > -------------------------------------------------------
> > T E S T S
> > -------------------------------------------------------
> > Initializing object reference support test...
> > Testing custom object reference as a parameter...
> > Testing default object reference as a parameter...
> > Testing custom object reference as a return value...
> > Testing default object reference as a return value...
> > Testing nil object reference as a parameter...
> > Testing nil object reference as a return value...
> > [surefire] Running
> > org.apache.yoko.bindings.corba.CorbaObjectReferenceTest
> > [surefire] Tests run: 6, Failures: 0, Errors: 0, Time elapsed: 32.046sec
> > [surefire]
> >
> > [surefire] Running
> > org.apache.yoko.bindings.corba.runtime.CorbaStreamableTest
> > [surefire] Tests run: 5, Failures: 0, Errors: 0, Time elapsed: 0.023 sec
> > [surefire]
> >
> > [surefire] Running
> > org.apache.yoko.bindings.corba.runtime.CorbaObjectWriterTest
> > [surefire] Tests run: 18, Failures: 0, Errors: 0, Time elapsed: 0.13 sec
> > [surefire]
> >
> > Test OnMessage in TestObserver
> > [surefire] Running
> > org.apache.yoko.bindings.corba.runtime.CorbaDSIServantTest
> > [surefire] Tests run: 1, Failures: 0, Errors: 0, Time elapsed: 0.447 sec
> > [surefire]
> >
> > [surefire] Running
> > org.apache.yoko.bindings.corba.runtime.CorbaObjectReaderTest
> > [surefire] Tests run: 21, Failures: 0, Errors: 0, Time elapsed: 0.11 sec
> > [surefire]
> >
> > org.omg.CORBA.COMM_FAILURE:   vmcid: 0x0 minor code: 0x0  completed: No
> >         at org.apache.yoko.orb.OB.Util.unmarshalSystemException(
> > Util.java:117)
> >         at org.apache.yoko.orb.CORBA.ServerRequest._OB_doMarshal(
> > ServerRequest.java:197)
> >         at
> > org.apache.yoko.orb.OBPortableServer.ServantDispatcher.dispatch(
> > ServantDispatcher.java:228)
> >         at org.apache.yoko.orb.OBPortableServer.POA_impl._OB_dispatch
> > (POA_impl.java:1607)
> >         at org.apache.yoko.orb.OB.DispatchRequest_impl.invoke(DispatchRequest_impl.java:56)
> >         at org.apache.yoko.orb.OB.DispatchSameThread_impl.dispatch
> > (DispatchStrategyFactory_impl.java:53)
> >         at org.apache.yoko.orb.OB.Upcall.invoke(Upcall.java:360)
> >         at org.apache.yoko.orb.OB.GIOPConnectionThreaded.execReceive(
> > GIOPConnectionThreaded.java:502)
> >         at
> > org.apache.yoko.orb.OB.GIOPConnectionThreaded$ReceiverThread.run(
> > GIOPConnectionThreaded.java:64)
> > org.omg.CORBA.TRANSIENT :  vmcid: 0x0 minor code: 0x0  completed: No
> >         at org.apache.yoko.orb.OB.Util.unmarshalSystemException(
> > Util.java:149)
> >         at org.apache.yoko.orb.CORBA.ServerRequest._OB_doMarshal(
> > ServerRequest.java:197)
> >         at
> > org.apache.yoko.orb.OBPortableServer.ServantDispatcher.dispatch(
> > ServantDispatcher.java:228)
> >         at org.apache.yoko.orb.OBPortableServer.POA_impl._OB_dispatch
> > (POA_impl.java:1607)
> >         at org.apache.yoko.orb.OB.DispatchRequest_impl.invoke(DispatchRequest_impl.java:56)
> >         at org.apache.yoko.orb.OB.DispatchSameThread_impl.dispatch
> > (DispatchStrategyFactory_impl.java:53)
> >         at org.apache.yoko.orb.OB.Upcall.invoke(Upcall.java:360)
> >         at org.apache.yoko.orb.OB.GIOPConnectionThreaded.execReceive(
> > GIOPConnectionThreaded.java:502)
> >         at
> > org.apache.yoko.orb.OB.GIOPConnectionThreaded$ReceiverThread.run(
> > GIOPConnectionThreaded.java:64)
> > org.omg.CORBA.NO_PERMISSION: :  vmcid: 0x0 minor code: 0x0  completed:
> > No
> >         at org.apache.yoko.orb.OB.Util.unmarshalSystemException(
> > Util.java:121)
> >         at org.apache.yoko.orb.CORBA.ServerRequest._OB_doMarshal(
> > ServerRequest.java:197)
> >         at
> > org.apache.yoko.orb.OBPortableServer.ServantDispatcher.dispatch(
> > ServantDispatcher.java:228)
> >         at org.apache.yoko.orb.OBPortableServer.POA_impl._OB_dispatch
> > (POA_impl.java:1607)
> >         at org.apache.yoko.orb.OB.DispatchRequest_impl.invoke(DispatchRequest_impl.java:56)
> >         at org.apache.yoko.orb.OB.DispatchSameThread_impl.dispatch
> > (DispatchStrategyFactory_impl.java:53)
> >         at org.apache.yoko.orb.OB.Upcall.invoke(Upcall.java:360)
> >         at org.apache.yoko.orb.OB.GIOPConnectionThreaded.execReceive(
> > GIOPConnectionThreaded.java:502)
> >         at
> > org.apache.yoko.orb.OB.GIOPConnectionThreaded$ReceiverThread.run(
> > GIOPConnectionThreaded.java:64)
> > [surefire] Running
> > org.apache.yoko.bindings.corba.CorbaSystemExceptionTest
> > [surefire] Tests run: 3, Failures: 0, Errors: 0, Time elapsed: 10.226sec
> > [surefire]
> >
> > [surefire] Running
> > org.apache.yoko.bindings.corba.types.CorbaPrimitiveHandlerTest
> > [surefire] Tests run: 14, Failures: 0, Errors: 0, Time elapsed: 0.049sec
> > [surefire]
> >
> > Jun 15, 2007 2:18:53 PM org.apache.yoko.bindings.corba.CorbaDestinationshutdown
> > SEVERE: Couldn't shutdown the corba destination. Failed to destroy orb
> > [surefire] Running
> > org.apache.yoko.bindings.corba.types.CorbaHandlerUtilsTest
> > [surefire] Tests run: 2, Failures: 0, Errors: 2, Time elapsed: 0.756 sec
> > [surefire]
> > [surefire] testCreateTypeHandler(
> > org.apache.yoko.bindings.corba.types.CorbaHandlerUtilsTest )  Time
> > elapsed: 0.682 sec  <<< ERROR!
> > org.apache.yoko.bindings.corba.CorbaBindingException: Unable to
> > deactivate CORBA servant
> >         at org.apache.yoko.bindings.corba.CorbaDestination.deactivate(
> > CorbaDestination.java :264)
> >         at
> > org.apache.yoko.bindings.corba.CorbaDestination.setMessageObserver(
> > CorbaDestination.java:128)
> >         at org.apache.cxf.endpoint.ServerImpl.stop(ServerImpl.java:145)
> >         at org.apache.cxf.endpoint.ServerRegistryImpl.preShutdown (
> > ServerRegistryImpl.java:87)
> >         at
> > org.apache.cxf.buslifecycle.CXFBusLifeCycleManager.preShutdown(
> > CXFBusLifeCycleManager.java:77)
> >         at org.apache.cxf.bus.CXFBusImpl.shutdown(CXFBusImpl.java:106)
> >         at
> > org.apache.yoko.bindings.corba.types.CorbaHandlerUtilsTest.tearDown(
> > CorbaHandlerUtilsTest.java:95)
> >         at junit.framework.TestCase.runBare(TestCase.java:136)
> >         at junit.framework.TestResult$1.protect(TestResult.java :106)
> >         at junit.framework.TestResult.runProtected(TestResult.java:124)
> >         at junit.framework.TestResult.run(TestResult.java:109)
> >         at junit.framework.TestCase.run(TestCase.java:120)
> >         at junit.framework.TestSuite.runTest(TestSuite.java:230)
> >         at junit.framework.TestSuite.run(TestSuite.java:225)
> >         at sun.reflect.NativeMethodAccessorImpl.invoke0(Native Method)
> >         at sun.reflect.NativeMethodAccessorImpl.invoke (
> > NativeMethodAccessorImpl.java:39)
> >         at sun.reflect.DelegatingMethodAccessorImpl.invoke(
> > DelegatingMethodAccessorImpl.java:25)
> >         at java.lang.reflect.Method.invoke(Method.java:585)
> >         at org.apache.maven.surefire.battery.JUnitBattery.executeJUnit (
> > JUnitBattery.java:242)
> >         at org.apache.maven.surefire.battery.JUnitBattery.execute(
> > JUnitBattery.java:216)
> >         at org.apache.maven.surefire.Surefire.executeBattery(
> > Surefire.java:215)
> >         at org.apache.maven.surefire.Surefire.run (Surefire.java:163)
> >         at org.apache.maven.surefire.Surefire.run(Surefire.java:87)
> >         at org.apache.maven.surefire.Surefire.run(Surefire.java:63)
> >         at sun.reflect.NativeMethodAccessorImpl.invoke0(Native Method)
> >         at sun.reflect.NativeMethodAccessorImpl.invoke(
> > NativeMethodAccessorImpl.java:39)
> >         at sun.reflect.DelegatingMethodAccessorImpl.invoke(
> > DelegatingMethodAccessorImpl.java:25)
> >         at java.lang.reflect.Method.invoke (Method.java:585)
> >         at org.apache.maven.surefire.SurefireBooter.main(
> > SurefireBooter.java:785)
> > Caused by: org.omg.CORBA.OBJECT_NOT_EXIST: POA has been
> > destroyed:  vmcid: 0x0 minor code: 0x0  completed: No
> >         at
> > org.apache.yoko.orb.OBPortableServer.POA_impl.deactivate_object
> > (POA_impl.java:1147)
> >         at org.apache.yoko.bindings.corba.CorbaDestination.deactivate(
> > CorbaDestination.java:262)
> >         ... 28 more
> >
> > [surefire] testInitializeObjectHandler(
> > org.apache.yoko.bindings.corba.types.CorbaHandlerUtilsTest)  Time
> > elapsed: 0.055 sec  <<< ERROR!
> > org.apache.yoko.bindings.corba.CorbaBindingException:
> > org.omg.CORBA.OBJECT_NOT_EXIST: ORB is destroyed:  vmcid: 0x0 minor
> > code: 0x0  completed: No
> >         at org.apache.yoko.bindings.corba.CorbaDestination.shutdown(
> > CorbaDestination.java:104)
> >         at org.apache.cxf.endpoint.ServerImpl.stop(ServerImpl.java:146)
> >         at org.apache.cxf.endpoint.ServerRegistryImpl.preShutdown (
> > ServerRegistryImpl.java:87)
> >         at
> > org.apache.cxf.buslifecycle.CXFBusLifeCycleManager.preShutdown(
> > CXFBusLifeCycleManager.java:77)
> >         at org.apache.cxf.bus.CXFBusImpl.shutdown(CXFBusImpl.java:106)
> >         at
> > org.apache.yoko.bindings.corba.types.CorbaHandlerUtilsTest.tearDown(
> > CorbaHandlerUtilsTest.java:95)
> >         at junit.framework.TestCase.runBare(TestCase.java:136)
> >         at junit.framework.TestResult$1.protect(TestResult.java :106)
> >         at junit.framework.TestResult.runProtected(TestResult.java:124)
> >         at junit.framework.TestResult.run(TestResult.java:109)
> >         at junit.framework.TestCase.run(TestCase.java:120)
> >         at junit.framework.TestSuite.runTest(TestSuite.java:230)
> >         at junit.framework.TestSuite.run(TestSuite.java:225)
> >         at sun.reflect.NativeMethodAccessorImpl.invoke0(Native Method)
> >         at sun.reflect.NativeMethodAccessorImpl.invoke (
> > NativeMethodAccessorImpl.java:39)
> >         at sun.reflect.DelegatingMethodAccessorImpl.invoke(
> > DelegatingMethodAccessorImpl.java:25)
> >         at java.lang.reflect.Method.invoke(Method.java:585)
> >         at org.apache.maven.surefire.battery.JUnitBattery.executeJUnit (
> > JUnitBattery.java:242)
> >         at org.apache.maven.surefire.battery.JUnitBattery.execute(
> > JUnitBattery.java:216)
> >         at org.apache.maven.surefire.Surefire.executeBattery(
> > Surefire.java:215)
> >         at org.apache.maven.surefire.Surefire.run (Surefire.java:163)
> >         at org.apache.maven.surefire.Surefire.run(Surefire.java:87)
> >         at org.apache.maven.surefire.Surefire.run(Surefire.java:63)
> >         at sun.reflect.NativeMethodAccessorImpl.invoke0(Native Method)
> >         at sun.reflect.NativeMethodAccessorImpl.invoke(
> > NativeMethodAccessorImpl.java:39)
> >         at sun.reflect.DelegatingMethodAccessorImpl.invoke(
> > DelegatingMethodAccessorImpl.java:25)
> >         at java.lang.reflect.Method.invoke (Method.java:585)
> >         at org.apache.maven.surefire.SurefireBooter.main(
> > SurefireBooter.java:785)
> > Caused by: org.omg.CORBA.OBJECT_NOT_EXIST: ORB is destroyed:  vmcid: 0x0
> > minor code: 0x0  completed: No
> >         at org.apache.yoko.orb.OBCORBA.ORB_impl.destroy
> > (ORB_impl.java:1385)
> >         at org.apache.yoko.bindings.corba.CorbaDestination.shutdown(
> > CorbaDestination.java:101)
> >         ... 27 more
> >
> >
> > [surefire] Running
> > org.apache.yoko.bindings.corba.types.CorbaEnumHandlerTest
> > [surefire] Tests run: 1, Failures: 0, Errors: 0, Time elapsed: 0.004 sec
> > [surefire]
> >
> > [surefire] Running
> > org.apache.yoko.bindings.corba.types.CorbaFixedHandlerTest
> > [surefire] Tests run: 1, Failures: 0, Errors: 0, Time elapsed: 0.009 sec
> > [surefire]
> >
> > [surefire] Running
> > org.apache.yoko.bindings.corba.types.CorbaStructHandlerTest
> > [surefire] Tests run: 1, Failures: 0, Errors: 0, Time elapsed: 0.01 sec
> > [surefire]
> >
> > [surefire] Running
> > org.apache.yoko.bindings.corba.types.CorbaArrayHandlerTest
> > [surefire] Tests run: 1, Failures: 0, Errors: 0, Time elapsed: 0.011 sec
> > [surefire]
> >
> > [surefire] Running
> > org.apache.yoko.bindings.corba.types.CorbaAnyHandlerTest
> > [surefire] Tests run: 1, Failures: 0, Errors: 0, Time elapsed: 0.03 sec
> > [surefire]
> >
> > [surefire] Running
> > org.apache.yoko.bindings.corba.types.CorbaObjectHandlerTest
> > [surefire] Tests run: 2, Failures: 0, Errors: 0, Time elapsed: 0.004 sec
> > [surefire]
> >
> > [surefire] Running
> > org.apache.yoko.bindings.corba.types.CorbaSequenceHandlerTest
> > [surefire] Tests run: 1, Failures: 0, Errors: 0, Time elapsed: 0.009 sec
> > [surefire]
> >
> > [surefire] Running org.apache.yoko.bindings.corba.CorbaConduitTest
> > [surefire] Tests run: 13, Failures: 0, Errors: 0, Time elapsed: 2.667sec
> > [surefire]
> >
> > Jun 15, 2007 2:18:56 PM org.apache.yoko.bindings.corba.CorbaDestinationshutdown
> > SEVERE: Couldn't shutdown the corba destination. Failed to destroy orb
> > Jun 15, 2007 2:18:56 PM org.apache.yoko.bindings.corba.CorbaDestinationshutdown
> > SEVERE: Couldn't shutdown the corba destination. Failed to destroy orb
> > Jun 15, 2007 2:18:56 PM org.apache.yoko.bindings.corba.CorbaDestinationshutdown
> > SEVERE: Couldn't shutdown the corba destination. Failed to destroy orb
> > Jun 15, 2007 2:18:56 PM org.apache.yoko.bindings.corba.CorbaDestinationshutdown
> > SEVERE: Couldn't shutdown the corba destination. Failed to destroy orb
> > Jun 15, 2007 2:18:56 PM org.apache.yoko.bindings.corba.CorbaDestinationshutdown
> > SEVERE: Couldn't shutdown the corba destination. Failed to destroy orb
> > Jun 15, 2007 2:18:56 PM org.apache.yoko.bindings.corba.CorbaDestinationshutdown
> > SEVERE: Couldn't shutdown the corba destination. Failed to destroy orb
> > Jun 15, 2007 2:18:56 PM org.apache.yoko.bindings.corba.CorbaDestinationshutdown
> > SEVERE: Couldn't shutdown the corba destination. Failed to destroy orb
> > Jun 15, 2007 2:18:56 PM org.apache.yoko.bindings.corba.CorbaDestinationshutdown
> > SEVERE: Couldn't shutdown the corba destination. Failed to destroy orb
> > Jun 15, 2007 2:18:57 PM org.apache.yoko.bindings.corba.CorbaDestinationshutdown
> > SEVERE: Couldn't shutdown the corba destination. Failed to destroy orb
> > [surefire] Running org.apache.yoko.bindings.corba.CorbaServerConduitTest
> > [surefire] Tests run: 9, Failures: 0, Errors: 9, Time elapsed: 1.026 sec
> > [surefire]
> > [surefire] testPrepare(
> > org.apache.yoko.bindings.corba.CorbaServerConduitTest)  Time elapsed:
> > 0.016 sec  <<< ERROR!
> > org.apache.yoko.bindings.corba.CorbaBindingException:
> > org.omg.CORBA.OBJECT_NOT_EXIST: ORB is destroyed:  vmcid: 0x0 minor
> > code: 0x0  completed: No
> >         at org.apache.yoko.bindings.corba.CorbaDestination.shutdown(
> > CorbaDestination.java :104)
> >         at org.apache.cxf.endpoint.ServerImpl.stop(ServerImpl.java:146)
> >         at org.apache.cxf.endpoint.ServerRegistryImpl.preShutdown(
> > ServerRegistryImpl.java:87)
> >         at
> > org.apache.cxf.buslifecycle.CXFBusLifeCycleManager.preShutdown (
> > CXFBusLifeCycleManager.java:77)
> >         at org.apache.cxf.bus.CXFBusImpl.shutdown(CXFBusImpl.java:106)
> >         at
> > org.apache.yoko.bindings.corba.CorbaServerConduitTest.tearDown(
> > CorbaServerConduitTest.java:89)
> >         at junit.framework.TestCase.runBare(TestCase.java:136)
> >         at junit.framework.TestResult$1.protect(TestResult.java:106)
> >         at junit.framework.TestResult.runProtected(TestResult.java:124)
> >         at junit.framework.TestResult.run (TestResult.java:109)
> >         at junit.framework.TestCase.run(TestCase.java:120)
> >         at junit.framework.TestSuite.runTest(TestSuite.java:230)
> >         at junit.framework.TestSuite.run(TestSuite.java:225)
> >         at sun.reflect.GeneratedMethodAccessor27.invoke(Unknown Source)
> >         at sun.reflect.DelegatingMethodAccessorImpl.invoke(
> > DelegatingMethodAccessorImpl.java:25)
> >         at java.lang.reflect.Method.invoke(Method.java:585)
> >         at org.apache.maven.surefire.battery.JUnitBattery.executeJUnit(
> > JUnitBattery.java:242)
> >         at org.apache.maven.surefire.battery.JUnitBattery.execute(
> > JUnitBattery.java:216)
> >         at org.apache.maven.surefire.Surefire.executeBattery (
> > Surefire.java:215)
> >         at org.apache.maven.surefire.Surefire.run(Surefire.java:163)
> >         at org.apache.maven.surefire.Surefire.run(Surefire.java:87)
> >         at org.apache.maven.surefire.Surefire.run(Surefire.java :63)
> >         at sun.reflect.NativeMethodAccessorImpl.invoke0(Native Method)
> >         at sun.reflect.NativeMethodAccessorImpl.invoke(
> > NativeMethodAccessorImpl.java:39)
> >         at sun.reflect.DelegatingMethodAccessorImpl.invoke (
> > DelegatingMethodAccessorImpl.java:25)
> >         at java.lang.reflect.Method.invoke(Method.java:585)
> >         at org.apache.maven.surefire.SurefireBooter.main(
> > SurefireBooter.java:785)
> > Caused by: org.omg.CORBA.OBJECT_NOT_EXIST: ORB is destroyed:  vmcid: 0x0
> > minor code: 0x0  completed: No
> >         at org.apache.yoko.orb.OBCORBA.ORB_impl.destroy
> > (ORB_impl.java:1385)
> >         at org.apache.yoko.bindings.corba.CorbaDestination.shutdown(
> > CorbaDestination.java :101)
> >         ... 26 more
> >
> > [surefire] testGetTargetReference(
> > org.apache.yoko.bindings.corba.CorbaServerConduitTest)  Time elapsed:
> > 0.018 sec  <<< ERROR!
> > org.apache.yoko.bindings.corba.CorbaBindingException :
> > org.omg.CORBA.OBJECT_NOT_EXIST: ORB is destroyed:  vmcid: 0x0 minor
> > code: 0x0  completed: No
> >         at org.apache.yoko.bindings.corba.CorbaDestination.shutdown(
> > CorbaDestination.java:104)
> >         at org.apache.cxf.endpoint.ServerImpl.stop (ServerImpl.java:146)
> >         at org.apache.cxf.endpoint.ServerRegistryImpl.preShutdown(
> > ServerRegistryImpl.java:87)
> >         at
> > org.apache.cxf.buslifecycle.CXFBusLifeCycleManager.preShutdown(
> > CXFBusLifeCycleManager.java :77)
> >         at org.apache.cxf.bus.CXFBusImpl.shutdown(CXFBusImpl.java:106)
> >         at
> > org.apache.yoko.bindings.corba.CorbaServerConduitTest.tearDown(
> > CorbaServerConduitTest.java:89)
> >         at junit.framework.TestCase.runBare (TestCase.java:136)
> >         at junit.framework.TestResult$1.protect(TestResult.java:106)
> >         at junit.framework.TestResult.runProtected(TestResult.java:124)
> >         at junit.framework.TestResult.run(TestResult.java :109)
> >         at junit.framework.TestCase.run(TestCase.java:120)
> >         at junit.framework.TestSuite.runTest(TestSuite.java:230)
> >         at junit.framework.TestSuite.run(TestSuite.java:225)
> >         at sun.reflect.GeneratedMethodAccessor27.invoke (Unknown Source)
> >         at sun.reflect.DelegatingMethodAccessorImpl.invoke(
> > DelegatingMethodAccessorImpl.java:25)
> >         at java.lang.reflect.Method.invoke(Method.java:585)
> >         at org.apache.maven.surefire.battery.JUnitBattery.executeJUnit (
> > JUnitBattery.java:242)
> >         at org.apache.maven.surefire.battery.JUnitBattery.execute(
> > JUnitBattery.java:216)
> >         at org.apache.maven.surefire.Surefire.executeBattery(
> > Surefire.java:215)
> >         at org.apache.maven.surefire.Surefire.run (Surefire.java:163)
> >         at org.apache.maven.surefire.Surefire.run(Surefire.java:87)
> >         at org.apache.maven.surefire.Surefire.run(Surefire.java:63)
> >         at sun.reflect.NativeMethodAccessorImpl.invoke0(Native Method)
> >         at sun.reflect.NativeMethodAccessorImpl.invoke(
> > NativeMethodAccessorImpl.java:39)
> >         at sun.reflect.DelegatingMethodAccessorImpl.invoke(
> > DelegatingMethodAccessorImpl.java:25)
> >         at java.lang.reflect.Method.invoke (Method.java:585)
> >         at org.apache.maven.surefire.SurefireBooter.main(
> > SurefireBooter.java:785)
> > Caused by: org.omg.CORBA.OBJECT_NOT_EXIST: ORB is destroyed:  vmcid: 0x0
> > minor code: 0x0  completed: No
> >         at org.apache.yoko.orb.OBCORBA.ORB_impl.destroy
> > (ORB_impl.java:1385)
> >         at org.apache.yoko.bindings.corba.CorbaDestination.shutdown(
> > CorbaDestination.java:101)
> >         ... 26 more
> >
> > [surefire] testGetAddress(
> > org.apache.yoko.bindings.corba.CorbaServerConduitTest )  Time elapsed:
> > 0.006 sec  <<< ERROR!
> > org.apache.yoko.bindings.corba.CorbaBindingException:
> > org.omg.CORBA.OBJECT_NOT_EXIST: ORB is destroyed:  vmcid: 0x0 minor
> > code: 0x0  completed: No
> >         at org.apache.yoko.bindings.corba.CorbaDestination.shutdown (
> > CorbaDestination.java:104)
> >         at org.apache.cxf.endpoint.ServerImpl.stop(ServerImpl.java:146)
> >         at org.apache.cxf.endpoint.ServerRegistryImpl.preShutdown(
> > ServerRegistryImpl.java:87)
> >         at
> > org.apache.cxf.buslifecycle.CXFBusLifeCycleManager.preShutdown (
> > CXFBusLifeCycleManager.java:77)
> >         at org.apache.cxf.bus.CXFBusImpl.shutdown(CXFBusImpl.java:106)
> >         at
> > org.apache.yoko.bindings.corba.CorbaServerConduitTest.tearDown(
> > CorbaServerConduitTest.java:89)
> >         at junit.framework.TestCase.runBare(TestCase.java:136)
> >         at junit.framework.TestResult$1.protect(TestResult.java:106)
> >         at junit.framework.TestResult.runProtected(TestResult.java:124)
> >         at junit.framework.TestResult.run (TestResult.java:109)
> >         at junit.framework.TestCase.run(TestCase.java:120)
> >         at junit.framework.TestSuite.runTest(TestSuite.java:230)
> >         at junit.framework.TestSuite.run(TestSuite.java:225)
> >         at sun.reflect.GeneratedMethodAccessor27.invoke(Unknown Source)
> >         at sun.reflect.DelegatingMethodAccessorImpl.invoke(
> > DelegatingMethodAccessorImpl.java:25)
> >         at java.lang.reflect.Method.invoke(Method.java:585)
> >         at org.apache.maven.surefire.battery.JUnitBattery.executeJUnit(
> > JUnitBattery.java:242)
> >         at org.apache.maven.surefire.battery.JUnitBattery.execute(
> > JUnitBattery.java:216)
> >         at org.apache.maven.surefire.Surefire.executeBattery (
> > Surefire.java:215)
> >         at org.apache.maven.surefire.Surefire.run(Surefire.java:163)
> >         at org.apache.maven.surefire.Surefire.run(Surefire.java:87)
> >         at org.apache.maven.surefire.Surefire.run(Surefire.java :63)
> >         at sun.reflect.NativeMethodAccessorImpl.invoke0(Native Method)
> >         at sun.reflect.NativeMethodAccessorImpl.invoke(
> > NativeMethodAccessorImpl.java:39)
> >         at sun.reflect.DelegatingMethodAccessorImpl.invoke (
> > DelegatingMethodAccessorImpl.java:25)
> >         at java.lang.reflect.Method.invoke(Method.java:585)
> >         at org.apache.maven.surefire.SurefireBooter.main(
> > SurefireBooter.java:785)
> > Caused by: org.omg.CORBA.OBJECT_NOT_EXIST: ORB is destroyed:  vmcid: 0x0
> > minor code: 0x0  completed: No
> >         at org.apache.yoko.orb.OBCORBA.ORB_impl.destroy
> > (ORB_impl.java:1385)
> >         at org.apache.yoko.bindings.corba.CorbaDestination.shutdown(
> > CorbaDestination.java :101)
> >         ... 26 more
> >
> > [surefire] testClose(
> > org.apache.yoko.bindings.corba.CorbaServerConduitTest)  Time elapsed:
> > 0.091 sec  <<< ERROR!
> > org.apache.yoko.bindings.corba.CorbaBindingException:
> > org.omg.CORBA.OBJECT_NOT_EXIST: ORB is destroyed:  vmcid: 0x0 minor
> > code: 0x0  completed: No
> >         at org.apache.yoko.bindings.corba.CorbaDestination.shutdown(
> > CorbaDestination.java:104)
> >         at org.apache.cxf.endpoint.ServerImpl.stop(ServerImpl.java :146)
> >         at org.apache.cxf.endpoint.ServerRegistryImpl.preShutdown(
> > ServerRegistryImpl.java:87)
> >         at
> > org.apache.cxf.buslifecycle.CXFBusLifeCycleManager.preShutdown(
> > CXFBusLifeCycleManager.java:77)
> >         at org.apache.cxf.bus.CXFBusImpl.shutdown(CXFBusImpl.java:106)
> >         at
> > org.apache.yoko.bindings.corba.CorbaServerConduitTest.tearDown(
> > CorbaServerConduitTest.java:89)
> >         at junit.framework.TestCase.runBare(TestCase.java :136)
> >         at junit.framework.TestResult$1.protect(TestResult.java:106)
> >         at junit.framework.TestResult.runProtected(TestResult.java:124)
> >         at junit.framework.TestResult.run(TestResult.java:109)
> >         at junit.framework.TestCase.run(TestCase.java:120)
> >         at junit.framework.TestSuite.runTest(TestSuite.java:230)
> >         at junit.framework.TestSuite.run(TestSuite.java:225)
> >         at sun.reflect.GeneratedMethodAccessor27.invoke (Unknown Source)
> >         at sun.reflect.DelegatingMethodAccessorImpl.invoke(
> > DelegatingMethodAccessorImpl.java:25)
> >         at java.lang.reflect.Method.invoke(Method.java:585)
> >         at org.apache.maven.surefire.battery.JUnitBattery.executeJUnit (
> > JUnitBattery.java:242)
> >         at org.apache.maven.surefire.battery.JUnitBattery.execute(
> > JUnitBattery.java:216)
> >         at org.apache.maven.surefire.Surefire.executeBattery(
> > Surefire.java:215)
> >         at org.apache.maven.surefire.Surefire.run (Surefire.java:163)
> >         at org.apache.maven.surefire.Surefire.run(Surefire.java:87)
> >         at org.apache.maven.surefire.Surefire.run(Surefire.java:63)
> >         at sun.reflect.NativeMethodAccessorImpl.invoke0(Native Method)
> >         at sun.reflect.NativeMethodAccessorImpl.invoke(
> > NativeMethodAccessorImpl.java:39)
> >         at sun.reflect.DelegatingMethodAccessorImpl.invoke(
> > DelegatingMethodAccessorImpl.java:25)
> >         at java.lang.reflect.Method.invoke (Method.java:585)
> >         at org.apache.maven.surefire.SurefireBooter.main(
> > SurefireBooter.java:785)
> > Caused by: org.omg.CORBA.OBJECT_NOT_EXIST: ORB is destroyed:  vmcid: 0x0
> > minor code: 0x0  completed: No
> >         at org.apache.yoko.orb.OBCORBA.ORB_impl.destroy
> > (ORB_impl.java:1385)
> >         at org.apache.yoko.bindings.corba.CorbaDestination.shutdown(
> > CorbaDestination.java:101)
> >         ... 26 more
> >
> > [surefire] testGetTarget(
> > org.apache.yoko.bindings.corba.CorbaServerConduitTest )  Time elapsed:
> > 0.071 sec  <<< ERROR!
> > org.apache.yoko.bindings.corba.CorbaBindingException:
> > org.omg.CORBA.OBJECT_NOT_EXIST: ORB is destroyed:  vmcid: 0x0 minor
> > code: 0x0  completed: No
> >         at org.apache.yoko.bindings.corba.CorbaDestination.shutdown (
> > CorbaDestination.java:104)
> >         at org.apache.cxf.endpoint.ServerImpl.stop(ServerImpl.java:146)
> >         at org.apache.cxf.endpoint.ServerRegistryImpl.preShutdown(
> > ServerRegistryImpl.java:87)
> >         at
> > org.apache.cxf.buslifecycle.CXFBusLifeCycleManager.preShutdown (
> > CXFBusLifeCycleManager.java:77)
> >         at org.apache.cxf.bus.CXFBusImpl.shutdown(CXFBusImpl.java:106)
> >         at
> > org.apache.yoko.bindings.corba.CorbaServerConduitTest.tearDown(
> > CorbaServerConduitTest.java:89)
> >         at junit.framework.TestCase.runBare(TestCase.java:136)
> >         at junit.framework.TestResult$1.protect(TestResult.java:106)
> >         at junit.framework.TestResult.runProtected(TestResult.java:124)
> >         at junit.framework.TestResult.run (TestResult.java:109)
> >         at junit.framework.TestCase.run(TestCase.java:120)
> >         at junit.framework.TestSuite.runTest(TestSuite.java:230)
> >         at junit.framework.TestSuite.run(TestSuite.java:225)
> >         at sun.reflect.GeneratedMethodAccessor27.invoke(Unknown Source)
> >         at sun.reflect.DelegatingMethodAccessorImpl.invoke(
> > DelegatingMethodAccessorImpl.java:25)
> >         at java.lang.reflect.Method.invoke(Method.java:585)
> >         at org.apache.maven.surefire.battery.JUnitBattery.executeJUnit(
> > JUnitBattery.java:242)
> >         at org.apache.maven.surefire.battery.JUnitBattery.execute(
> > JUnitBattery.java:216)
> >         at org.apache.maven.surefire.Surefire.executeBattery (
> > Surefire.java:215)
> >         at org.apache.maven.surefire.Surefire.run(Surefire.java:163)
> >         at org.apache.maven.surefire.Surefire.run(Surefire.java:87)
> >         at org.apache.maven.surefire.Surefire.run(Surefire.java :63)
> >         at sun.reflect.NativeMethodAccessorImpl.invoke0(Native Method)
> >         at sun.reflect.NativeMethodAccessorImpl.invoke(
> > NativeMethodAccessorImpl.java:39)
> >         at sun.reflect.DelegatingMethodAccessorImpl.invoke (
> > DelegatingMethodAccessorImpl.java:25)
> >         at java.lang.reflect.Method.invoke(Method.java:585)
> >         at org.apache.maven.surefire.SurefireBooter.main(
> > SurefireBooter.java:785)
> > Caused by: org.omg.CORBA.OBJECT_NOT_EXIST: ORB is destroyed:  vmcid: 0x0
> > minor code: 0x0  completed: No
> >         at org.apache.yoko.orb.OBCORBA.ORB_impl.destroy
> > (ORB_impl.java:1385)
> >         at org.apache.yoko.bindings.corba.CorbaDestination.shutdown(
> > CorbaDestination.java :101)
> >         ... 26 more
> >
> > [surefire] testCorbaServerConduit(
> > org.apache.yoko.bindings.corba.CorbaServerConduitTest)  Time elapsed:
> > 0.055 sec  <<< ERROR!
> > org.apache.yoko.bindings.corba.CorbaBindingException :
> > org.omg.CORBA.OBJECT_NOT_EXIST: ORB is destroyed:  vmcid: 0x0 minor
> > code: 0x0  completed: No
> >         at org.apache.yoko.bindings.corba.CorbaDestination.shutdown(
> > CorbaDestination.java:104)
> >         at org.apache.cxf.endpoint.ServerImpl.stop (ServerImpl.java:146)
> >         at org.apache.cxf.endpoint.ServerRegistryImpl.preShutdown(
> > ServerRegistryImpl.java:87)
> >         at
> > org.apache.cxf.buslifecycle.CXFBusLifeCycleManager.preShutdown(
> > CXFBusLifeCycleManager.java :77)
> >         at org.apache.cxf.bus.CXFBusImpl.shutdown(CXFBusImpl.java:106)
> >         at
> > org.apache.yoko.bindings.corba.CorbaServerConduitTest.tearDown(
> > CorbaServerConduitTest.java:89)
> >         at junit.framework.TestCase.runBare (TestCase.java:136)
> >         at junit.framework.TestResult$1.protect(TestResult.java:106)
> >         at junit.framework.TestResult.runProtected(TestResult.java:124)
> >         at junit.framework.TestResult.run(TestResult.java :109)
> >         at junit.framework.TestCase.run(TestCase.java:120)
> >         at junit.framework.TestSuite.runTest(TestSuite.java:230)
> >         at junit.framework.TestSuite.run(TestSuite.java:225)
> >         at sun.reflect.GeneratedMethodAccessor27.invoke (Unknown Source)
> >         at sun.reflect.DelegatingMethodAccessorImpl.invoke(
> > DelegatingMethodAccessorImpl.java:25)
> >         at java.lang.reflect.Method.invoke(Method.java:585)
> >         at org.apache.maven.surefire.battery.JUnitBattery.executeJUnit (
> > JUnitBattery.java:242)
> >         at org.apache.maven.surefire.battery.JUnitBattery.execute(
> > JUnitBattery.java:216)
> >         at org.apache.maven.surefire.Surefire.executeBattery(
> > Surefire.java:215)
> >         at org.apache.maven.surefire.Surefire.run (Surefire.java:163)
> >         at org.apache.maven.surefire.Surefire.run(Surefire.java:87)
> >         at org.apache.maven.surefire.Surefire.run(Surefire.java:63)
> >         at sun.reflect.NativeMethodAccessorImpl.invoke0(Native Method)
> >         at sun.reflect.NativeMethodAccessorImpl.invoke(
> > NativeMethodAccessorImpl.java:39)
> >         at sun.reflect.DelegatingMethodAccessorImpl.invoke(
> > DelegatingMethodAccessorImpl.java:25)
> >         at java.lang.reflect.Method.invoke (Method.java:585)
> >         at org.apache.maven.surefire.SurefireBooter.main(
> > SurefireBooter.java:785)
> > Caused by: org.omg.CORBA.OBJECT_NOT_EXIST: ORB is destroyed:  vmcid: 0x0
> > minor code: 0x0  completed: No
> >         at org.apache.yoko.orb.OBCORBA.ORB_impl.destroy
> > (ORB_impl.java:1385)
> >         at org.apache.yoko.bindings.corba.CorbaDestination.shutdown(
> > CorbaDestination.java:101)
> >         ... 26 more
> >
> > [surefire] testBuildRequestResult(
> > org.apache.yoko.bindings.corba.CorbaServerConduitTest)  Time elapsed:
> > 0.22 sec  <<< ERROR!
> > org.apache.yoko.bindings.corba.CorbaBindingException:
> > org.omg.CORBA.OBJECT_NOT_EXIST: ORB is destroyed:  vmcid: 0x0 minor
> > code: 0x0  completed: No
> >         at org.apache.yoko.bindings.corba.CorbaDestination.shutdown(
> > CorbaDestination.java:104)
> >         at org.apache.cxf.endpoint.ServerImpl.stop(ServerImpl.java:146)
> >         at org.apache.cxf.endpoint.ServerRegistryImpl.preShutdown (
> > ServerRegistryImpl.java:87)
> >         at
> > org.apache.cxf.buslifecycle.CXFBusLifeCycleManager.preShutdown(
> > CXFBusLifeCycleManager.java:77)
> >         at org.apache.cxf.bus.CXFBusImpl.shutdown(CXFBusImpl.java:106)
> >         at
> > org.apache.yoko.bindings.corba.CorbaServerConduitTest.tearDown(
> > CorbaServerConduitTest.java:89)
> >         at junit.framework.TestCase.runBare(TestCase.java:136)
> >         at junit.framework.TestResult$1.protect(TestResult.java :106)
> >         at junit.framework.TestResult.runProtected(TestResult.java:124)
> >         at junit.framework.TestResult.run(TestResult.java:109)
> >         at junit.framework.TestCase.run(TestCase.java:120)
> >         at junit.framework.TestSuite.runTest(TestSuite.java:230)
> >         at junit.framework.TestSuite.run(TestSuite.java:225)
> >         at sun.reflect.GeneratedMethodAccessor27.invoke(Unknown Source)
> >         at sun.reflect.DelegatingMethodAccessorImpl.invoke (
> > DelegatingMethodAccessorImpl.java:25)
> >         at java.lang.reflect.Method.invoke(Method.java:585)
> >         at org.apache.maven.surefire.battery.JUnitBattery.executeJUnit(
> > JUnitBattery.java:242)
> >         at org.apache.maven.surefire.battery.JUnitBattery.execute (
> > JUnitBattery.java:216)
> >         at org.apache.maven.surefire.Surefire.executeBattery(
> > Surefire.java:215)
> >         at org.apache.maven.surefire.Surefire.run(Surefire.java:163)
> >         at org.apache.maven.surefire.Surefire.run (Surefire.java:87)
> >         at org.apache.maven.surefire.Surefire.run(Surefire.java:63)
> >         at sun.reflect.NativeMethodAccessorImpl.invoke0(Native Method)
> >         at sun.reflect.NativeMethodAccessorImpl.invoke (
> > NativeMethodAccessorImpl.java:39)
> >         at sun.reflect.DelegatingMethodAccessorImpl.invoke(
> > DelegatingMethodAccessorImpl.java:25)
> >         at java.lang.reflect.Method.invoke(Method.java:585)
> >         at org.apache.maven.surefire.SurefireBooter.main (
> > SurefireBooter.java:785)
> > Caused by: org.omg.CORBA.OBJECT_NOT_EXIST: ORB is destroyed:  vmcid: 0x0
> > minor code: 0x0  completed: No
> >         at org.apache.yoko.orb.OBCORBA.ORB_impl.destroy
> > (ORB_impl.java:1385)
> >         at org.apache.yoko.bindings.corba.CorbaDestination.shutdown(
> > CorbaDestination.java:101)
> >         ... 26 more
> >
> > [surefire] testBuildRequestResultException(
> > org.apache.yoko.bindings.corba.CorbaServerConduitTest)  Time elapsed:
> > 0.405 sec  <<< ERROR!
> > org.apache.yoko.bindings.corba.CorbaBindingException:
> > org.omg.CORBA.OBJECT_NOT_EXIST: ORB is destroyed:  vmcid: 0x0 minor
> > code: 0x0  completed: No
> >         at org.apache.yoko.bindings.corba.CorbaDestination.shutdown (
> > CorbaDestination.java:104)
> >         at org.apache.cxf.endpoint.ServerImpl.stop(ServerImpl.java:146)
> >         at org.apache.cxf.endpoint.ServerRegistryImpl.preShutdown(
> > ServerRegistryImpl.java:87)
> >         at
> > org.apache.cxf.buslifecycle.CXFBusLifeCycleManager.preShutdown (
> > CXFBusLifeCycleManager.java:77)
> >         at org.apache.cxf.bus.CXFBusImpl.shutdown(CXFBusImpl.java:106)
> >         at
> > org.apache.yoko.bindings.corba.CorbaServerConduitTest.tearDown(
> > CorbaServerConduitTest.java:89)
> >         at junit.framework.TestCase.runBare(TestCase.java:136)
> >         at junit.framework.TestResult$1.protect(TestResult.java:106)
> >         at junit.framework.TestResult.runProtected(TestResult.java:124)
> >         at junit.framework.TestResult.run (TestResult.java:109)
> >         at junit.framework.TestCase.run(TestCase.java:120)
> >         at junit.framework.TestSuite.runTest(TestSuite.java:230)
> >         at junit.framework.TestSuite.run(TestSuite.java:225)
> >         at sun.reflect.GeneratedMethodAccessor27.invoke(Unknown Source)
> >         at sun.reflect.DelegatingMethodAccessorImpl.invoke(
> > DelegatingMethodAccessorImpl.java:25)
> >         at java.lang.reflect.Method.invoke(Method.java:585)
> >         at org.apache.maven.surefire.battery.JUnitBattery.executeJUnit(
> > JUnitBattery.java:242)
> >         at org.apache.maven.surefire.battery.JUnitBattery.execute(
> > JUnitBattery.java:216)
> >         at org.apache.maven.surefire.Surefire.executeBattery (
> > Surefire.java:215)
> >         at org.apache.maven.surefire.Surefire.run(Surefire.java:163)
> >         at org.apache.maven.surefire.Surefire.run(Surefire.java:87)
> >         at org.apache.maven.surefire.Surefire.run(Surefire.java :63)
> >         at sun.reflect.NativeMethodAccessorImpl.invoke0(Native Method)
> >         at sun.reflect.NativeMethodAccessorImpl.invoke(
> > NativeMethodAccessorImpl.java:39)
> >         at sun.reflect.DelegatingMethodAccessorImpl.invoke (
> > DelegatingMethodAccessorImpl.java:25)
> >         at java.lang.reflect.Method.invoke(Method.java:585)
> >         at org.apache.maven.surefire.SurefireBooter.main(
> > SurefireBooter.java:785)
> > Caused by: org.omg.CORBA.OBJECT_NOT_EXIST: ORB is destroyed:  vmcid: 0x0
> > minor code: 0x0  completed: No
> >         at org.apache.yoko.orb.OBCORBA.ORB_impl.destroy
> > (ORB_impl.java:1385)
> >         at org.apache.yoko.bindings.corba.CorbaDestination.shutdown(
> > CorbaDestination.java :101)
> >         ... 26 more
> >
> > [surefire] testBuildRequestResultArgumentReturn(
> > org.apache.yoko.bindings.corba.CorbaServerConduitTest)  Time elapsed:
> > 0.122 sec  <<< ERROR!
> > org.apache.yoko.bindings.corba.CorbaBindingException :
> > org.omg.CORBA.OBJECT_NOT_EXIST: ORB is destroyed:  vmcid: 0x0 minor
> > code: 0x0  completed: No
> >         at org.apache.yoko.bindings.corba.CorbaDestination.shutdown(
> > CorbaDestination.java:104)
> >         at org.apache.cxf.endpoint.ServerImpl.stop (ServerImpl.java:146)
> >         at org.apache.cxf.endpoint.ServerRegistryImpl.preShutdown(
> > ServerRegistryImpl.java:87)
> >         at
> > org.apache.cxf.buslifecycle.CXFBusLifeCycleManager.preShutdown(
> > CXFBusLifeCycleManager.java :77)
> >         at org.apache.cxf.bus.CXFBusImpl.shutdown(CXFBusImpl.java:106)
> >         at
> > org.apache.yoko.bindings.corba.CorbaServerConduitTest.tearDown(
> > CorbaServerConduitTest.java:89)
> >         at junit.framework.TestCase.runBare (TestCase.java:136)
> >         at junit.framework.TestResult$1.protect(TestResult.java:106)
> >         at junit.framework.TestResult.runProtected(TestResult.java:124)
> >         at junit.framework.TestResult.run(TestResult.java :109)
> >         at junit.framework.TestCase.run(TestCase.java:120)
> >         at junit.framework.TestSuite.runTest(TestSuite.java:230)
> >         at junit.framework.TestSuite.run(TestSuite.java:225)
> >         at sun.reflect.GeneratedMethodAccessor27.invoke (Unknown Source)
> >         at sun.reflect.DelegatingMethodAccessorImpl.invoke(
> > DelegatingMethodAccessorImpl.java:25)
> >         at java.lang.reflect.Method.invoke(Method.java:585)
> >         at org.apache.maven.surefire.battery.JUnitBattery.executeJUnit (
> > JUnitBattery.java:242)
> >         at org.apache.maven.surefire.battery.JUnitBattery.execute(
> > JUnitBattery.java:216)
> >         at org.apache.maven.surefire.Surefire.executeBattery(
> > Surefire.java:215)
> >         at org.apache.maven.surefire.Surefire.run (Surefire.java:163)
> >         at org.apache.maven.surefire.Surefire.run(Surefire.java:87)
> >         at org.apache.maven.surefire.Surefire.run(Surefire.java:63)
> >         at sun.reflect.NativeMethodAccessorImpl.invoke0(Native Method)
> >         at sun.reflect.NativeMethodAccessorImpl.invoke(
> > NativeMethodAccessorImpl.java:39)
> >         at sun.reflect.DelegatingMethodAccessorImpl.invoke(
> > DelegatingMethodAccessorImpl.java:25)
> >         at java.lang.reflect.Method.invoke (Method.java:585)
> >         at org.apache.maven.surefire.SurefireBooter.main(
> > SurefireBooter.java:785)
> > Caused by: org.omg.CORBA.OBJECT_NOT_EXIST: ORB is destroyed:  vmcid: 0x0
> > minor code: 0x0  completed: No
> >         at org.apache.yoko.orb.OBCORBA.ORB_impl.destroy
> > (ORB_impl.java:1385)
> >         at org.apache.yoko.bindings.corba.CorbaDestination.shutdown(
> > CorbaDestination.java:101)
> >         ... 26 more
> >
> >
> > Jun 15, 2007 2:18:57 PM org.apache.yoko.bindings.corba.CorbaDestinationshutdown
> > SEVERE: Couldn't shutdown the corba destination. Failed to destroy orb
> > Jun 15, 2007 2:18:57 PM org.apache.yoko.bindings.corba.CorbaDestinationshutdown
> > SEVERE: Couldn't shutdown the corba destination. Failed to destroy orb
> > Jun 15, 2007 2:18:57 PM org.apache.yoko.bindings.corba.CorbaDestinationshutdown
> > SEVERE: Couldn't shutdown the corba destination. Failed to destroy orb
> > Jun 15, 2007 2:18:57 PM org.apache.yoko.bindings.corba.CorbaDestinationshutdown
> > SEVERE: Couldn't shutdown the corba destination. Failed to destroy orb
> > Jun 15, 2007 2:18:57 PM org.apache.yoko.bindings.corba.CorbaDestinationshutdown
> > SEVERE: Couldn't shutdown the corba destination. Failed to destroy orb
> > Jun 15, 2007 2:18:57 PM org.apache.yoko.bindings.corba.CorbaDestinationshutdown
> > SEVERE: Couldn't shutdown the corba destination. Failed to destroy orb
> > Jun 15, 2007 2:18:57 PM org.apache.yoko.bindings.corba.CorbaDestinationshutdown
> > SEVERE: Couldn't shutdown the corba destination. Failed to destroy orb
> > Jun 15, 2007 2:18:57 PM org.apache.yoko.bindings.corba.CorbaDestinationshutdown
> > SEVERE: Couldn't shutdown the corba destination. Failed to destroy orb
> > Jun 15, 2007 2:18:57 PM org.apache.yoko.bindings.corba.CorbaDestinationshutdown
> > SEVERE: Couldn't shutdown the corba destination. Failed to destroy orb
> > [surefire] Running
> > org.apache.yoko.bindings.corba.CorbaBindingFactoryTest
> > [surefire] Tests run: 9, Failures: 0, Errors: 9, Time elapsed: 0.252 sec
> > [surefire]
> > [surefire] testCreateBinding(
> > org.apache.yoko.bindings.corba.CorbaBindingFactoryTest )  Time elapsed:
> > 0.117 sec  <<< ERROR!
> > org.apache.yoko.bindings.corba.CorbaBindingException:
> > org.omg.CORBA.OBJECT_NOT_EXIST: ORB is destroyed:  vmcid: 0x0 minor
> > code: 0x0  completed: No
> >         at org.apache.yoko.bindings.corba.CorbaDestination.shutdown (
> > CorbaDestination.java:104)
> >         at org.apache.cxf.endpoint.ServerImpl.stop(ServerImpl.java:146)
> >         at org.apache.cxf.endpoint.ServerRegistryImpl.preShutdown(
> > ServerRegistryImpl.java:87)
> >         at
> > org.apache.cxf.buslifecycle.CXFBusLifeCycleManager.preShutdown (
> > CXFBusLifeCycleManager.java:77)
> >         at org.apache.cxf.bus.CXFBusImpl.shutdown(CXFBusImpl.java:106)
> >         at
> > org.apache.yoko.bindings.corba.CorbaBindingFactoryTest.tearDown(
> > CorbaBindingFactoryTest.java:78)
> >         at junit.framework.TestCase.runBare(TestCase.java:136)
> >         at junit.framework.TestResult$1.protect(TestResult.java:106)
> >         at junit.framework.TestResult.runProtected(TestResult.java:124)
> >         at junit.framework.TestResult.run(TestResult.java:109)
> >         at junit.framework.TestCase.run(TestCase.java:120)
> >         at junit.framework.TestSuite.runTest(TestSuite.java:230)
> >         at junit.framework.TestSuite.run (TestSuite.java:225)
> >         at sun.reflect.GeneratedMethodAccessor27.invoke(Unknown Source)
> >         at sun.reflect.DelegatingMethodAccessorImpl.invoke(
> > DelegatingMethodAccessorImpl.java:25)
> >         at java.lang.reflect.Method.invoke (Method.java:585)
> >         at org.apache.maven.surefire.battery.JUnitBattery.executeJUnit(
> > JUnitBattery.java:242)
> >         at org.apache.maven.surefire.battery.JUnitBattery.execute(
> > JUnitBattery.java:216)
> >         at org.apache.maven.surefire.Surefire.executeBattery(
> > Surefire.java:215)
> >         at org.apache.maven.surefire.Surefire.run(Surefire.java:163)
> >         at org.apache.maven.surefire.Surefire.run(Surefire.java:87)
> >         at org.apache.maven.surefire.Surefire.run(Surefire.java:63)
> >         at sun.reflect.NativeMethodAccessorImpl.invoke0(Native Method)
> >         at sun.reflect.NativeMethodAccessorImpl.invoke(
> > NativeMethodAccessorImpl.java:39)
> >         at sun.reflect.DelegatingMethodAccessorImpl.invoke(
> > DelegatingMethodAccessorImpl.java:25)
> >         at java.lang.reflect.Method.invoke(Method.java:585)
> >         at org.apache.maven.surefire.SurefireBooter.main (
> > SurefireBooter.java:785)
> > Caused by: org.omg.CORBA.OBJECT_NOT_EXIST: ORB is destroyed:  vmcid: 0x0
> > minor code: 0x0  completed: No
> >         at org.apache.yoko.orb.OBCORBA.ORB_impl.destroy
> > (ORB_impl.java:1385)
> >         at org.apache.yoko.bindings.corba.CorbaDestination.shutdown(
> > CorbaDestination.java:101)
> >         ... 26 more
> >
> > [surefire] testGetCorbaConduit(
> > org.apache.yoko.bindings.corba.CorbaBindingFactoryTest)  Time elapsed:
> > 0.065 sec  <<< ERROR!
> > org.apache.yoko.bindings.corba.CorbaBindingException:
> > org.omg.CORBA.OBJECT_NOT_EXIST: ORB is destroyed:  vmcid: 0x0 minor
> > code: 0x0  completed: No
> >         at org.apache.yoko.bindings.corba.CorbaDestination.shutdown (
> > CorbaDestination.java:104)
> >         at org.apache.cxf.endpoint.ServerImpl.stop(ServerImpl.java:146)
> >         at org.apache.cxf.endpoint.ServerRegistryImpl.preShutdown(
> > ServerRegistryImpl.java:87)
> >         at
> > org.apache.cxf.buslifecycle.CXFBusLifeCycleManager.preShutdown (
> > CXFBusLifeCycleManager.java:77)
> >         at org.apache.cxf.bus.CXFBusImpl.shutdown(CXFBusImpl.java:106)
> >         at
> > org.apache.yoko.bindings.corba.CorbaBindingFactoryTest.tearDown(
> > CorbaBindingFactoryTest.java:78)
> >         at junit.framework.TestCase.runBare(TestCase.java:136)
> >         at junit.framework.TestResult$1.protect(TestResult.java:106)
> >         at junit.framework.TestResult.runProtected(TestResult.java:124)
> >         at junit.framework.TestResult.run(TestResult.java:109)
> >         at junit.framework.TestCase.run(TestCase.java:120)
> >         at junit.framework.TestSuite.runTest(TestSuite.java:230)
> >         at junit.framework.TestSuite.run (TestSuite.java:225)
> >         at sun.reflect.GeneratedMethodAccessor27.invoke(Unknown Source)
> >         at sun.reflect.DelegatingMethodAccessorImpl.invoke(
> > DelegatingMethodAccessorImpl.java:25)
> >         at java.lang.reflect.Method.invoke (Method.java:585)
> >         at org.apache.maven.surefire.battery.JUnitBattery.executeJUnit(
> > JUnitBattery.java:242)
> >         at org.apache.maven.surefire.battery.JUnitBattery.execute(
> > JUnitBattery.java:216)
> >         at org.apache.maven.surefire.Surefire.executeBattery(
> > Surefire.java:215)
> >         at org.apache.maven.surefire.Surefire.run(Surefire.java:163)
> >         at org.apache.maven.surefire.Surefire.run(Surefire.java:87)
> >         at org.apache.maven.surefire.Surefire.run(Surefire.java:63)
> >         at sun.reflect.NativeMethodAccessorImpl.invoke0(Native Method)
> >         at sun.reflect.NativeMethodAccessorImpl.invoke(
> > NativeMethodAccessorImpl.java:39)
> >         at sun.reflect.DelegatingMethodAccessorImpl.invoke(
> > DelegatingMethodAccessorImpl.java:25)
> >         at java.lang.reflect.Method.invoke(Method.java:585)
> >         at org.apache.maven.surefire.SurefireBooter.main (
> > SurefireBooter.java:785)
> > Caused by: org.omg.CORBA.OBJECT_NOT_EXIST: ORB is destroyed:  vmcid: 0x0
> > minor code: 0x0  completed: No
> >         at org.apache.yoko.orb.OBCORBA.ORB_impl.destroy
> > (ORB_impl.java:1385)
> >         at org.apache.yoko.bindings.corba.CorbaDestination.shutdown(
> > CorbaDestination.java:101)
> >         ... 26 more
> >
> > [surefire] testGetDestination(
> > org.apache.yoko.bindings.corba.CorbaBindingFactoryTest)  Time elapsed:
> > 0.009 sec  <<< ERROR!
> > org.apache.yoko.bindings.corba.CorbaBindingException:
> > org.omg.CORBA.OBJECT_NOT_EXIST: ORB is destroyed:  vmcid: 0x0 minor
> > code: 0x0  completed: No
> >         at org.apache.yoko.bindings.corba.CorbaDestination.shutdown (
> > CorbaDestination.java:104)
> >         at org.apache.cxf.endpoint.ServerImpl.stop(ServerImpl.java:146)
> >         at org.apache.cxf.endpoint.ServerRegistryImpl.preShutdown(
> > ServerRegistryImpl.java:87)
> >         at
> > org.apache.cxf.buslifecycle.CXFBusLifeCycleManager.preShutdown (
> > CXFBusLifeCycleManager.java:77)
> >         at org.apache.cxf.bus.CXFBusImpl.shutdown(CXFBusImpl.java:106)
> >         at
> > org.apache.yoko.bindings.corba.CorbaBindingFactoryTest.tearDown(
> > CorbaBindingFactoryTest.java:78)
> >         at junit.framework.TestCase.runBare(TestCase.java:136)
> >         at junit.framework.TestResult$1.protect(TestResult.java:106)
> >         at junit.framework.TestResult.runProtected(TestResult.java:124)
> >         at junit.framework.TestResult.run(TestResult.java:109)
> >         at junit.framework.TestCase.run(TestCase.java:120)
> >         at junit.framework.TestSuite.runTest(TestSuite.java:230)
> >         at junit.framework.TestSuite.run (TestSuite.java:225)
> >         at sun.reflect.GeneratedMethodAccessor27.invoke(Unknown Source)
> >         at sun.reflect.DelegatingMethodAccessorImpl.invoke(
> > DelegatingMethodAccessorImpl.java:25)
> >         at java.lang.reflect.Method.invoke (Method.java:585)
> >         at org.apache.maven.surefire.battery.JUnitBattery.executeJUnit(
> > JUnitBattery.java:242)
> >         at org.apache.maven.surefire.battery.JUnitBattery.execute(
> > JUnitBattery.java:216)
> >         at org.apache.maven.surefire.Surefire.executeBattery(
> > Surefire.java:215)
> >         at org.apache.maven.surefire.Surefire.run(Surefire.java:163)
> >         at org.apache.maven.surefire.Surefire.run(Surefire.java:87)
> >         at org.apache.maven.surefire.Surefire.run(Surefire.java:63)
> >         at sun.reflect.NativeMethodAccessorImpl.invoke0(Native Method)
> >         at sun.reflect.NativeMethodAccessorImpl.invoke(
> > NativeMethodAccessorImpl.java:39)
> >         at sun.reflect.DelegatingMethodAccessorImpl.invoke(
> > DelegatingMethodAccessorImpl.java:25)
> >         at java.lang.reflect.Method.invoke(Method.java:585)
> >         at org.apache.maven.surefire.SurefireBooter.main (
> > SurefireBooter.java:785)
> > Caused by: org.omg.CORBA.OBJECT_NOT_EXIST: ORB is destroyed:  vmcid: 0x0
> > minor code: 0x0  completed: No
> >         at org.apache.yoko.orb.OBCORBA.ORB_impl.destroy
> > (ORB_impl.java:1385)
> >         at org.apache.yoko.bindings.corba.CorbaDestination.shutdown(
> > CorbaDestination.java:101)
> >         ... 26 more
> >
> > [surefire] testTransportIds(
> > org.apache.yoko.bindings.corba.CorbaBindingFactoryTest)  Time elapsed:
> > 0.011 sec  <<< ERROR!
> > org.apache.yoko.bindings.corba.CorbaBindingException:
> > org.omg.CORBA.OBJECT_NOT_EXIST: ORB is destroyed:  vmcid: 0x0 minor
> > code: 0x0  completed: No
> >         at org.apache.yoko.bindings.corba.CorbaDestination.shutdown (
> > CorbaDestination.java:104)
> >         at org.apache.cxf.endpoint.ServerImpl.stop(ServerImpl.java:146)
> >         at org.apache.cxf.endpoint.ServerRegistryImpl.preShutdown(
> > ServerRegistryImpl.java:87)
> >         at
> > org.apache.cxf.buslifecycle.CXFBusLifeCycleManager.preShutdown (
> > CXFBusLifeCycleManager.java:77)
> >         at org.apache.cxf.bus.CXFBusImpl.shutdown(CXFBusImpl.java:106)
> >         at
> > org.apache.yoko.bindings.corba.CorbaBindingFactoryTest.tearDown(
> > CorbaBindingFactoryTest.java:78)
> >         at junit.framework.TestCase.runBare(TestCase.java:136)
> >         at junit.framework.TestResult$1.protect(TestResult.java:106)
> >         at junit.framework.TestResult.runProtected(TestResult.java:124)
> >         at junit.framework.TestResult.run(TestResult.java:109)
> >         at junit.framework.TestCase.run(TestCase.java:120)
> >         at junit.framework.TestSuite.runTest(TestSuite.java:230)
> >         at junit.framework.TestSuite.run (TestSuite.java:225)
> >         at sun.reflect.GeneratedMethodAccessor27.invoke(Unknown Source)
> >         at sun.reflect.DelegatingMethodAccessorImpl.invoke(
> > DelegatingMethodAccessorImpl.java:25)
> >         at java.lang.reflect.Method.invoke (Method.java:585)
> >         at org.apache.maven.surefire.battery.JUnitBattery.executeJUnit(
> > JUnitBattery.java:242)
> >         at org.apache.maven.surefire.battery.JUnitBattery.execute(
> > JUnitBattery.java:216)
> >         at org.apache.maven.surefire.Surefire.executeBattery(
> > Surefire.java:215)
> >         at org.apache.maven.surefire.Surefire.run(Surefire.java:163)
> >         at org.apache.maven.surefire.Surefire.run(Surefire.java:87)
> >         at org.apache.maven.surefire.Surefire.run(Surefire.java:63)
> >         at sun.reflect.NativeMethodAccessorImpl.invoke0(Native Method)
> >         at sun.reflect.NativeMethodAccessorImpl.invoke(
> > NativeMethodAccessorImpl.java:39)
> >         at sun.reflect.DelegatingMethodAccessorImpl.invoke(
> > DelegatingMethodAccessorImpl.java:25)
> >         at java.lang.reflect.Method.invoke(Method.java:585)
> >         at org.apache.maven.surefire.SurefireBooter.main (
> > SurefireBooter.java:785)
> > Caused by: org.omg.CORBA.OBJECT_NOT_EXIST: ORB is destroyed:  vmcid: 0x0
> > minor code: 0x0  completed: No
> >         at org.apache.yoko.orb.OBCORBA.ORB_impl.destroy
> > (ORB_impl.java:1385)
> >         at org.apache.yoko.bindings.corba.CorbaDestination.shutdown(
> > CorbaDestination.java:101)
> >         ... 26 more
> >
> > [surefire] testGetUriPrefixes(
> > org.apache.yoko.bindings.corba.CorbaBindingFactoryTest)  Time elapsed:
> > 0.002 sec  <<< ERROR!
> > org.apache.yoko.bindings.corba.CorbaBindingException:
> > org.omg.CORBA.OBJECT_NOT_EXIST: ORB is destroyed:  vmcid: 0x0 minor
> > code: 0x0  completed: No
> >         at org.apache.yoko.bindings.corba.CorbaDestination.shutdown (
> > CorbaDestination.java:104)
> >         at org.apache.cxf.endpoint.ServerImpl.stop(ServerImpl.java:146)
> >         at org.apache.cxf.endpoint.ServerRegistryImpl.preShutdown(
> > ServerRegistryImpl.java:87)
> >         at
> > org.apache.cxf.buslifecycle.CXFBusLifeCycleManager.preShutdown (
> > CXFBusLifeCycleManager.java:77)
> >         at org.apache.cxf.bus.CXFBusImpl.shutdown(CXFBusImpl.java:106)
> >         at
> > org.apache.yoko.bindings.corba.CorbaBindingFactoryTest.tearDown(
> > CorbaBindingFactoryTest.java:78)
> >         at junit.framework.TestCase.runBare(TestCase.java:136)
> >         at junit.framework.TestResult$1.protect(TestResult.java:106)
> >         at junit.framework.TestResult.runProtected(TestResult.java:124)
> >         at junit.framework.TestResult.run(TestResult.java:109)
> >         at junit.framework.TestCase.run(TestCase.java:120)
> >         at junit.framework.TestSuite.runTest(TestSuite.java:230)
> >         at junit.framework.TestSuite.run (TestSuite.java:225)
> >
>
> ...
>
> [Message clipped]

Mime
  • Unnamed multipart/alternative (inline, None, 0 bytes)
View raw message