incubator-wink-dev mailing list archives

Site index · List index
Message view « Date » · « Thread »
Top « Date » · « Thread »
From Apache Hudson Server <hud...@hudson.zones.apache.org>
Subject Build failed in Hudson: Wink-Trunk-JDK1.5-itests #22
Date Tue, 17 Nov 2009 12:47:53 GMT
See <http://hudson.zones.apache.org/hudson/job/Wink-Trunk-JDK1.5-itests/22/>

------------------------------------------
[...truncated 1907 lines...]
[INFO] [resources:testResources {execution: default-testResources}]
[INFO] Using 'UTF-8' encoding to copy filtered resources.
[INFO] skip non existing resourceDirectory <http://hudson.zones.apache.org/hudson/job/Wink-Trunk-JDK1.5-itests/ws/trunk/wink-examples/ext/WebDAV/src/test/resources>
[INFO] Copying 4 resources
[INFO] [compiler:testCompile {execution: default-testCompile}]
[INFO] No sources to compile
[INFO] [surefire:test {execution: default-test}]
[INFO] Surefire report directory: <http://hudson.zones.apache.org/hudson/job/Wink-Trunk-JDK1.5-itests/ws/trunk/wink-examples/ext/WebDAV/target/surefire-reports>

-------------------------------------------------------
 T E S T S
-------------------------------------------------------
There are no tests to run.

Results :

Tests run: 0, Failures: 0, Errors: 0, Skipped: 0

[HUDSON] Recording test results
[INFO] [war:war {execution: default-war}]
[INFO] Packaging webapp
[INFO] Assembling webapp[WebDAV] in [<http://hudson.zones.apache.org/hudson/job/Wink-Trunk-JDK1.5-itests/ws/trunk/wink-examples/ext/WebDAV/target/WebDAV]>
[INFO] Processing war project
[INFO] Copying webapp webResources[<http://hudson.zones.apache.org/hudson/job/Wink-Trunk-JDK1.5-itests/ws/trunk/wink-examples/ext/WebDAV/target/classes]>
to[<http://hudson.zones.apache.org/hudson/job/Wink-Trunk-JDK1.5-itests/ws/trunk/wink-examples/ext/WebDAV/target/WebDAV]>
[INFO] Copying webapp resources[<http://hudson.zones.apache.org/hudson/job/Wink-Trunk-JDK1.5-itests/ws/trunk/wink-examples/ext/WebDAV/src/main/webapp]>
[INFO] Processing overlay[ id org.apache.wink.example:QADefect]
[INFO] Webapp assembled in[453 msecs]
[INFO] Building war: <http://hudson.zones.apache.org/hudson/job/Wink-Trunk-JDK1.5-itests/ws/trunk/wink-examples/ext/WebDAV/target/WebDAV.war>
[INFO] [ianal:verify-legal-files {execution: default}]
[INFO] Checking legal files in: WebDAV.war
[INFO] [install:install {execution: default-install}]
[INFO] Installing <http://hudson.zones.apache.org/hudson/job/Wink-Trunk-JDK1.5-itests/ws/trunk/wink-examples/ext/WebDAV/target/WebDAV.war>
to /export/home/hudson/.m2/repository/org/apache/wink/example/WebDAV/0.2-incubating-SNAPSHOT/WebDAV-0.2-incubating-SNAPSHOT.war
[HUDSON] Archiving <http://hudson.zones.apache.org/hudson/job/Wink-Trunk-JDK1.5-itests/ws/trunk/wink-examples/ext/WebDAV/pom.xml>
to /export/home/hudson/hudson/jobs/Wink-Trunk-JDK1.5-itests/modules/org.apache.wink.example$WebDAV/builds/2009-11-17_12-38-24/archive/org.apache.wink.example/WebDAV/0.2-incubating-SNAPSHOT/pom.xml
[HUDSON] Archiving <http://hudson.zones.apache.org/hudson/job/Wink-Trunk-JDK1.5-itests/ws/trunk/wink-examples/ext/WebDAV/target/WebDAV.war>
to /export/home/hudson/hudson/jobs/Wink-Trunk-JDK1.5-itests/modules/org.apache.wink.example$WebDAV/builds/2009-11-17_12-38-24/archive/org.apache.wink.example/WebDAV/0.2-incubating-SNAPSHOT/WebDAV.war
[INFO] ------------------------------------------------------------------------
[INFO] Building Apache Wink Scripts
[INFO]    task-segment: [clean, install]
[INFO] ------------------------------------------------------------------------
[INFO] [clean:clean {execution: default-clean}]
[INFO] Deleting file set: <http://hudson.zones.apache.org/hudson/job/Wink-Trunk-JDK1.5-itests/ws/trunk/wink-scripts/target>
(included: [**], excluded: [])
[INFO] [remote-resources:process {execution: default}]
[INFO] [site:attach-descriptor {execution: default-attach-descriptor}]
[INFO] [ianal:verify-legal-files {execution: default}]
[INFO] [install:install {execution: default-install}]
[INFO] Installing <http://hudson.zones.apache.org/hudson/job/Wink-Trunk-JDK1.5-itests/ws/trunk/wink-scripts/pom.xml>
to /export/home/hudson/.m2/repository/org/apache/wink/wink-scripts/0.2-incubating-SNAPSHOT/wink-scripts-0.2-incubating-SNAPSHOT.pom
[HUDSON] Archiving <http://hudson.zones.apache.org/hudson/job/Wink-Trunk-JDK1.5-itests/ws/trunk/wink-scripts/pom.xml>
to /export/home/hudson/hudson/jobs/Wink-Trunk-JDK1.5-itests/modules/org.apache.wink$wink-scripts/builds/2009-11-17_12-38-24/archive/org.apache.wink/wink-scripts/0.2-incubating-SNAPSHOT/pom.xml
[HUDSON] Archiving /export/home/hudson/.m2/repository/org/apache/wink/wink-scripts/0.2-incubating-SNAPSHOT/wink-scripts-0.2-incubating-SNAPSHOT.pom
to /export/home/hudson/hudson/jobs/Wink-Trunk-JDK1.5-itests/modules/org.apache.wink$wink-scripts/builds/2009-11-17_12-38-24/archive/org.apache.wink/wink-scripts/0.2-incubating-SNAPSHOT/wink-scripts-0.2-incubating-SNAPSHOT.pom
[INFO] ------------------------------------------------------------------------
[INFO] Building Apache Wink Scripts :: Dist
[INFO]    task-segment: [clean, install]
[INFO] ------------------------------------------------------------------------
[INFO] [clean:clean {execution: default-clean}]
[INFO] Deleting file set: <http://hudson.zones.apache.org/hudson/job/Wink-Trunk-JDK1.5-itests/ws/trunk/wink-scripts/wink-dist/target>
(included: [**], excluded: [])
[INFO] [remote-resources:process {execution: default}]
[INFO] [site:attach-descriptor {execution: default-attach-descriptor}]
[INFO] [ianal:verify-legal-files {execution: default}]
[INFO] [install:install {execution: default-install}]
[INFO] Installing <http://hudson.zones.apache.org/hudson/job/Wink-Trunk-JDK1.5-itests/ws/trunk/wink-scripts/wink-dist/pom.xml>
to /export/home/hudson/.m2/repository/org/apache/wink/apache-wink/0.2-incubating-SNAPSHOT/apache-wink-0.2-incubating-SNAPSHOT.pom
[HUDSON] Archiving <http://hudson.zones.apache.org/hudson/job/Wink-Trunk-JDK1.5-itests/ws/trunk/wink-scripts/wink-dist/pom.xml>
to /export/home/hudson/hudson/jobs/Wink-Trunk-JDK1.5-itests/modules/org.apache.wink$apache-wink/builds/2009-11-17_12-38-24/archive/org.apache.wink/apache-wink/0.2-incubating-SNAPSHOT/pom.xml
[HUDSON] Archiving /export/home/hudson/.m2/repository/org/apache/wink/apache-wink/0.2-incubating-SNAPSHOT/apache-wink-0.2-incubating-SNAPSHOT.pom
to /export/home/hudson/hudson/jobs/Wink-Trunk-JDK1.5-itests/modules/org.apache.wink$apache-wink/builds/2009-11-17_12-38-24/archive/org.apache.wink/apache-wink/0.2-incubating-SNAPSHOT/apache-wink-0.2-incubating-SNAPSHOT.pom
[INFO] ------------------------------------------------------------------------
[INFO] Building Apache Wink Assembly
[INFO]    task-segment: [clean, install]
[INFO] ------------------------------------------------------------------------
[INFO] [clean:clean {execution: default-clean}]
[INFO] Deleting file set: <http://hudson.zones.apache.org/hudson/job/Wink-Trunk-JDK1.5-itests/ws/trunk/wink-assembly/target>
(included: [**], excluded: [])
[INFO] [remote-resources:process {execution: default}]
[INFO] [site:attach-descriptor {execution: default-attach-descriptor}]
[INFO] [ianal:verify-legal-files {execution: default}]
[INFO] [install:install {execution: default-install}]
[INFO] Installing <http://hudson.zones.apache.org/hudson/job/Wink-Trunk-JDK1.5-itests/ws/trunk/wink-assembly/pom.xml>
to /export/home/hudson/.m2/repository/org/apache/wink/wink-assembly/0.2-incubating-SNAPSHOT/wink-assembly-0.2-incubating-SNAPSHOT.pom
[HUDSON] Archiving <http://hudson.zones.apache.org/hudson/job/Wink-Trunk-JDK1.5-itests/ws/trunk/wink-assembly/pom.xml>
to /export/home/hudson/hudson/jobs/Wink-Trunk-JDK1.5-itests/modules/org.apache.wink$wink-assembly/builds/2009-11-17_12-38-24/archive/org.apache.wink/wink-assembly/0.2-incubating-SNAPSHOT/pom.xml
[HUDSON] Archiving /export/home/hudson/.m2/repository/org/apache/wink/wink-assembly/0.2-incubating-SNAPSHOT/wink-assembly-0.2-incubating-SNAPSHOT.pom
to /export/home/hudson/hudson/jobs/Wink-Trunk-JDK1.5-itests/modules/org.apache.wink$wink-assembly/builds/2009-11-17_12-38-24/archive/org.apache.wink/wink-assembly/0.2-incubating-SNAPSHOT/wink-assembly-0.2-incubating-SNAPSHOT.pom
[INFO] ------------------------------------------------------------------------
[INFO] Building Apache Wink Assembly :: Aggregate JAR
[INFO]    task-segment: [clean, install]
[INFO] ------------------------------------------------------------------------
[INFO] [clean:clean {execution: default-clean}]
[INFO] Deleting file set: <http://hudson.zones.apache.org/hudson/job/Wink-Trunk-JDK1.5-itests/ws/trunk/wink-assembly/wink-assembly-aggregatejar/target>
(included: [**], excluded: [])
[INFO] [remote-resources:process {execution: default}]
[INFO] [site:attach-descriptor {execution: default-attach-descriptor}]
[INFO] [ianal:verify-legal-files {execution: default}]
[INFO] [install:install {execution: default-install}]
[INFO] Installing <http://hudson.zones.apache.org/hudson/job/Wink-Trunk-JDK1.5-itests/ws/trunk/wink-assembly/wink-assembly-aggregatejar/pom.xml>
to /export/home/hudson/.m2/repository/org/apache/wink/wink-assembly-aggregatejar/0.2-incubating-SNAPSHOT/wink-assembly-aggregatejar-0.2-incubating-SNAPSHOT.pom
[HUDSON] Archiving <http://hudson.zones.apache.org/hudson/job/Wink-Trunk-JDK1.5-itests/ws/trunk/wink-assembly/wink-assembly-aggregatejar/pom.xml>
to /export/home/hudson/hudson/jobs/Wink-Trunk-JDK1.5-itests/modules/org.apache.wink$wink-assembly-aggregatejar/builds/2009-11-17_12-38-24/archive/org.apache.wink/wink-assembly-aggregatejar/0.2-incubating-SNAPSHOT/pom.xml
[HUDSON] Archiving /export/home/hudson/.m2/repository/org/apache/wink/wink-assembly-aggregatejar/0.2-incubating-SNAPSHOT/wink-assembly-aggregatejar-0.2-incubating-SNAPSHOT.pom
to /export/home/hudson/hudson/jobs/Wink-Trunk-JDK1.5-itests/modules/org.apache.wink$wink-assembly-aggregatejar/builds/2009-11-17_12-38-24/archive/org.apache.wink/wink-assembly-aggregatejar/0.2-incubating-SNAPSHOT/wink-assembly-aggregatejar-0.2-incubating-SNAPSHOT.pom
[INFO] ------------------------------------------------------------------------
[INFO] Building Apache Wink Assembly :: Distribution
[INFO]    task-segment: [clean, install]
[INFO] ------------------------------------------------------------------------
[INFO] [clean:clean {execution: default-clean}]
[INFO] Deleting file set: <http://hudson.zones.apache.org/hudson/job/Wink-Trunk-JDK1.5-itests/ws/trunk/wink-assembly/wink-assembly-dist/target>
(included: [**], excluded: [])
[INFO] [remote-resources:process {execution: default}]
[INFO] [site:attach-descriptor {execution: default-attach-descriptor}]
[INFO] [ianal:verify-legal-files {execution: default}]
[INFO] [install:install {execution: default-install}]
[INFO] Installing <http://hudson.zones.apache.org/hudson/job/Wink-Trunk-JDK1.5-itests/ws/trunk/wink-assembly/wink-assembly-dist/pom.xml>
to /export/home/hudson/.m2/repository/org/apache/wink/wink-assembly-dist/0.2-incubating-SNAPSHOT/wink-assembly-dist-0.2-incubating-SNAPSHOT.pom
[HUDSON] Archiving <http://hudson.zones.apache.org/hudson/job/Wink-Trunk-JDK1.5-itests/ws/trunk/wink-assembly/wink-assembly-dist/pom.xml>
to /export/home/hudson/hudson/jobs/Wink-Trunk-JDK1.5-itests/modules/org.apache.wink$wink-assembly-dist/builds/2009-11-17_12-38-24/archive/org.apache.wink/wink-assembly-dist/0.2-incubating-SNAPSHOT/pom.xml
[HUDSON] Archiving /export/home/hudson/.m2/repository/org/apache/wink/wink-assembly-dist/0.2-incubating-SNAPSHOT/wink-assembly-dist-0.2-incubating-SNAPSHOT.pom
to /export/home/hudson/hudson/jobs/Wink-Trunk-JDK1.5-itests/modules/org.apache.wink$wink-assembly-dist/builds/2009-11-17_12-38-24/archive/org.apache.wink/wink-assembly-dist/0.2-incubating-SNAPSHOT/wink-assembly-dist-0.2-incubating-SNAPSHOT.pom
[INFO] ------------------------------------------------------------------------
[INFO] Building Apache Wink Integration Tests
[INFO]    task-segment: [clean, install]
[INFO] ------------------------------------------------------------------------
[INFO] [clean:clean {execution: default-clean}]
[INFO] Deleting file set: <http://hudson.zones.apache.org/hudson/job/Wink-Trunk-JDK1.5-itests/ws/trunk/wink-itests/target>
(included: [**], excluded: [])
[INFO] [remote-resources:process {execution: default}]
[INFO] [site:attach-descriptor {execution: default-attach-descriptor}]
[INFO] [ianal:verify-legal-files {execution: default}]
[INFO] [install:install {execution: default-install}]
[INFO] Installing <http://hudson.zones.apache.org/hudson/job/Wink-Trunk-JDK1.5-itests/ws/trunk/wink-itests/pom.xml>
to /export/home/hudson/.m2/repository/org/apache/wink/wink-itests/0.2-incubating-SNAPSHOT/wink-itests-0.2-incubating-SNAPSHOT.pom
[HUDSON] Archiving <http://hudson.zones.apache.org/hudson/job/Wink-Trunk-JDK1.5-itests/ws/trunk/wink-itests/pom.xml>
to /export/home/hudson/hudson/jobs/Wink-Trunk-JDK1.5-itests/modules/org.apache.wink$wink-itests/builds/2009-11-17_12-38-24/archive/org.apache.wink/wink-itests/0.2-incubating-SNAPSHOT/pom.xml
[HUDSON] Archiving /export/home/hudson/.m2/repository/org/apache/wink/wink-itests/0.2-incubating-SNAPSHOT/wink-itests-0.2-incubating-SNAPSHOT.pom
to /export/home/hudson/hudson/jobs/Wink-Trunk-JDK1.5-itests/modules/org.apache.wink$wink-itests/builds/2009-11-17_12-38-24/archive/org.apache.wink/wink-itests/0.2-incubating-SNAPSHOT/wink-itests-0.2-incubating-SNAPSHOT.pom
[INFO] ------------------------------------------------------------------------
[INFO] Building Apache Wink Integration Test Support
[INFO]    task-segment: [clean, install]
[INFO] ------------------------------------------------------------------------
[INFO] [clean:clean {execution: default-clean}]
[INFO] Deleting file set: <http://hudson.zones.apache.org/hudson/job/Wink-Trunk-JDK1.5-itests/ws/trunk/wink-itests/wink-itest-support/target>
(included: [**], excluded: [])
[INFO] [remote-resources:process {execution: default}]
[INFO] [resources:resources {execution: default-resources}]
[INFO] Using 'UTF-8' encoding to copy filtered resources.
[INFO] skip non existing resourceDirectory <http://hudson.zones.apache.org/hudson/job/Wink-Trunk-JDK1.5-itests/ws/trunk/wink-itests/wink-itest-support/src/main/resources>
[INFO] Copying 4 resources
[INFO] [compiler:compile {execution: default-compile}]
[INFO] Compiling 2 source files to <http://hudson.zones.apache.org/hudson/job/Wink-Trunk-JDK1.5-itests/ws/trunk/wink-itests/wink-itest-support/target/classes>
[INFO] [resources:testResources {execution: default-testResources}]
[INFO] Using 'UTF-8' encoding to copy filtered resources.
[INFO] skip non existing resourceDirectory <http://hudson.zones.apache.org/hudson/job/Wink-Trunk-JDK1.5-itests/ws/trunk/wink-itests/wink-itest-support/src/test/resources>
[INFO] Copying 4 resources
[INFO] [compiler:testCompile {execution: default-testCompile}]
[INFO] No sources to compile
[INFO] [surefire:test {execution: default-test}]
[INFO] Surefire report directory: <http://hudson.zones.apache.org/hudson/job/Wink-Trunk-JDK1.5-itests/ws/trunk/wink-itests/wink-itest-support/target/surefire-reports>

-------------------------------------------------------
 T E S T S
-------------------------------------------------------
There are no tests to run.

Results :

Tests run: 0, Failures: 0, Errors: 0, Skipped: 0

[HUDSON] Recording test results
[INFO] [jar:jar {execution: default-jar}]
[INFO] Building jar: <http://hudson.zones.apache.org/hudson/job/Wink-Trunk-JDK1.5-itests/ws/trunk/wink-itests/wink-itest-support/target/wink-itest-support-0.2-incubating-SNAPSHOT.jar>
[INFO] [ianal:verify-legal-files {execution: default}]
[INFO] Checking legal files in: wink-itest-support-0.2-incubating-SNAPSHOT.jar
[INFO] [install:install {execution: default-install}]
[INFO] Installing <http://hudson.zones.apache.org/hudson/job/Wink-Trunk-JDK1.5-itests/ws/trunk/wink-itests/wink-itest-support/target/wink-itest-support-0.2-incubating-SNAPSHOT.jar>
to /export/home/hudson/.m2/repository/org/apache/wink/wink-itest-support/0.2-incubating-SNAPSHOT/wink-itest-support-0.2-incubating-SNAPSHOT.jar
[HUDSON] Archiving <http://hudson.zones.apache.org/hudson/job/Wink-Trunk-JDK1.5-itests/ws/trunk/wink-itests/wink-itest-support/pom.xml>
to /export/home/hudson/hudson/jobs/Wink-Trunk-JDK1.5-itests/modules/org.apache.wink$wink-itest-support/builds/2009-11-17_12-38-24/archive/org.apache.wink/wink-itest-support/0.2-incubating-SNAPSHOT/pom.xml
[HUDSON] Archiving <http://hudson.zones.apache.org/hudson/job/Wink-Trunk-JDK1.5-itests/ws/trunk/wink-itests/wink-itest-support/target/wink-itest-support-0.2-incubating-SNAPSHOT.jar>
to /export/home/hudson/hudson/jobs/Wink-Trunk-JDK1.5-itests/modules/org.apache.wink$wink-itest-support/builds/2009-11-17_12-38-24/archive/org.apache.wink/wink-itest-support/0.2-incubating-SNAPSHOT/wink-itest-support-0.2-incubating-SNAPSHOT.jar
[INFO] ------------------------------------------------------------------------
[INFO] Building Apache Wink Integration Test Logging Support
[INFO]    task-segment: [clean, install]
[INFO] ------------------------------------------------------------------------
[INFO] [clean:clean {execution: default-clean}]
[INFO] Deleting file set: <http://hudson.zones.apache.org/hudson/job/Wink-Trunk-JDK1.5-itests/ws/trunk/wink-itests/wink-itest-logging/target>
(included: [**], excluded: [])
[INFO] [remote-resources:process {execution: default}]
[INFO] [resources:resources {execution: default-resources}]
[INFO] Using 'UTF-8' encoding to copy filtered resources.
[INFO] Copying 2 resources
[INFO] Copying 4 resources
[INFO] [compiler:compile {execution: default-compile}]
[INFO] No sources to compile
[INFO] [resources:testResources {execution: default-testResources}]
[INFO] Using 'UTF-8' encoding to copy filtered resources.
[INFO] skip non existing resourceDirectory <http://hudson.zones.apache.org/hudson/job/Wink-Trunk-JDK1.5-itests/ws/trunk/wink-itests/wink-itest-logging/src/test/resources>
[INFO] Copying 4 resources
[INFO] [compiler:testCompile {execution: default-testCompile}]
[INFO] No sources to compile
[INFO] [surefire:test {execution: default-test}]
[INFO] Surefire report directory: <http://hudson.zones.apache.org/hudson/job/Wink-Trunk-JDK1.5-itests/ws/trunk/wink-itests/wink-itest-logging/target/surefire-reports>

-------------------------------------------------------
 T E S T S
-------------------------------------------------------
There are no tests to run.

Results :

Tests run: 0, Failures: 0, Errors: 0, Skipped: 0

[HUDSON] Recording test results
[INFO] [jar:jar {execution: default-jar}]
[INFO] Building jar: <http://hudson.zones.apache.org/hudson/job/Wink-Trunk-JDK1.5-itests/ws/trunk/wink-itests/wink-itest-logging/target/wink-itest-logging-0.2-incubating-SNAPSHOT.jar>
[INFO] [ianal:verify-legal-files {execution: default}]
[INFO] Checking legal files in: wink-itest-logging-0.2-incubating-SNAPSHOT.jar
[INFO] [install:install {execution: default-install}]
[INFO] Installing <http://hudson.zones.apache.org/hudson/job/Wink-Trunk-JDK1.5-itests/ws/trunk/wink-itests/wink-itest-logging/target/wink-itest-logging-0.2-incubating-SNAPSHOT.jar>
to /export/home/hudson/.m2/repository/org/apache/wink/wink-itest-logging/0.2-incubating-SNAPSHOT/wink-itest-logging-0.2-incubating-SNAPSHOT.jar
[HUDSON] Archiving <http://hudson.zones.apache.org/hudson/job/Wink-Trunk-JDK1.5-itests/ws/trunk/wink-itests/wink-itest-logging/pom.xml>
to /export/home/hudson/hudson/jobs/Wink-Trunk-JDK1.5-itests/modules/org.apache.wink$wink-itest-logging/builds/2009-11-17_12-38-24/archive/org.apache.wink/wink-itest-logging/0.2-incubating-SNAPSHOT/pom.xml
[HUDSON] Archiving <http://hudson.zones.apache.org/hudson/job/Wink-Trunk-JDK1.5-itests/ws/trunk/wink-itests/wink-itest-logging/target/wink-itest-logging-0.2-incubating-SNAPSHOT.jar>
to /export/home/hudson/hudson/jobs/Wink-Trunk-JDK1.5-itests/modules/org.apache.wink$wink-itest-logging/builds/2009-11-17_12-38-24/archive/org.apache.wink/wink-itest-logging/0.2-incubating-SNAPSHOT/wink-itest-logging-0.2-incubating-SNAPSHOT.jar
[INFO] ------------------------------------------------------------------------
[INFO] Building Apache Wink Integration Test
[INFO]    task-segment: [clean, install]
[INFO] ------------------------------------------------------------------------
[INFO] [clean:clean {execution: default-clean}]
[INFO] Deleting file set: <http://hudson.zones.apache.org/hudson/job/Wink-Trunk-JDK1.5-itests/ws/trunk/wink-itests/wink-itest/target>
(included: [**], excluded: [])
[INFO] [dependency:unpack {execution: unpack-logging-dependencies}]
[INFO] Configured Artifact: org.apache.wink:wink-itest-logging:0.2-incubating-SNAPSHOT:jar
[INFO] Unpacking /export/home/hudson/.m2/repository/org/apache/wink/wink-itest-logging/0.2-incubating-SNAPSHOT/wink-itest-logging-0.2-incubating-SNAPSHOT.jarto
 <http://hudson.zones.apache.org/hudson/job/Wink-Trunk-JDK1.5-itests/ws/trunk/wink-itests/wink-itest/target/logdependencies>
with Includes **/* and excludes:null
[INFO] [remote-resources:process {execution: default}]
[INFO] [site:attach-descriptor {execution: default-attach-descriptor}]
Downloading: http://people.apache.org/repo/m2-incubating-repository//woodstox/wstx-asl/3.2.1/wstx-asl-3.2.1.pom
[INFO] Unable to find resource 'woodstox:wstx-asl:pom:3.2.1' in repository apache-incubator
(http://people.apache.org/repo/m2-incubating-repository/)
Downloading: http://repo1.maven.org/maven2/woodstox/wstx-asl/3.2.1/wstx-asl-3.2.1.pom
[INFO] Unable to find resource 'woodstox:wstx-asl:pom:3.2.1' in repository central (http://repo1.maven.org/maven2)
[INFO] [geronimo:deploy-module {execution: deploy-wars}]
[INFO] Using non-artifact based module archive: <http://hudson.zones.apache.org/hudson/job/Wink-Trunk-JDK1.5-itests/ws/trunk/wink-itests/wink-itest/target/wink-itest-0.2-incubating-SNAPSHOT.war>
[INFO] Distributing module artifact: <http://hudson.zones.apache.org/hudson/job/Wink-Trunk-JDK1.5-itests/ws/trunk/wink-itests/wink-itest/target/wink-itest-0.2-incubating-SNAPSHOT.war>
log4j:WARN No appenders could be found for logger (org.apache.geronimo.deployment.plugin.factories.BaseDeploymentFactory).
log4j:WARN Please initialize the log4j system properly.
[WARNING] Ignoring failure !
[INFO] [geronimo:start-server {execution: start}]
[INFO] Using assembly configuration: tomcat
[INFO] Using assembly artifact: org.apache.geronimo.assemblies:geronimo-tomcat6-javaee5:zip:bin:2.1.4:provided
[INFO] Using geronimoHome: /zonestorage/hudson/home/hudson/hudson/jobs/Wink-Trunk-JDK1.5-itests/workspace/trunk/wink-itests/wink-itest/target/geronimo-tomcat6-javaee5-2.1.4
[INFO] Installing assembly...
[INFO] Expanding: /export/home/hudson/.m2/repository/org/apache/geronimo/assemblies/geronimo-tomcat6-javaee5/2.1.4/geronimo-tomcat6-javaee5-2.1.4-bin.zip
into /zonestorage/hudson/home/hudson/hudson/jobs/Wink-Trunk-JDK1.5-itests/workspace/trunk/wink-itests/wink-itest/target
[INFO] Starting Geronimo server...
[INFO] Selected option set: default
[INFO] Redirecting output to: <http://hudson.zones.apache.org/hudson/job/Wink-Trunk-JDK1.5-itests/ws/trunk/wink-itests/wink-itest/target/geronimo-logs/org.apache.geronimo.mavenplugins.geronimo.server.StartServerMojo.log>
[INFO] Waiting for Geronimo server...
Nov 17, 2009 12:47:32 PM ClientCommunicatorAdmin restart
WARNING: Failed to restart: java.io.IOException: Failed to get a RMI stub: javax.naming.CommunicationException
[Root exception is java.rmi.ConnectIOException: Exception creating connection to: localhost;
nested exception is: 
	java.io.InterruptedIOException: operation interrupted]
Nov 17, 2009 12:47:32 PM ClientCommunicatorAdmin Checker-run
WARNING: Failed to check connection: java.net.ConnectException: Connection refused
Nov 17, 2009 12:47:32 PM ClientCommunicatorAdmin Checker-run
WARNING: stopping
[HUDSON] Archiving <http://hudson.zones.apache.org/hudson/job/Wink-Trunk-JDK1.5-itests/ws/trunk/wink-itests/wink-itest/pom.xml>
to /export/home/hudson/hudson/jobs/Wink-Trunk-JDK1.5-itests/modules/org.apache.wink$wink-itest/builds/2009-11-17_12-38-24/archive/org.apache.wink/wink-itest/0.2-incubating-SNAPSHOT/pom.xml
[INFO] ------------------------------------------------------------------------
[ERROR] BUILD ERROR
[INFO] ------------------------------------------------------------------------
[INFO] Failed to start Geronimo server

Java returned: 1
[INFO] ------------------------------------------------------------------------
[INFO] For more information, run Maven with the -e switch
[INFO] ------------------------------------------------------------------------
[INFO] Total time: 8 minutes 59 seconds
[INFO] Finished at: Tue Nov 17 12:47:35 UTC 2009
[INFO] Final Memory: 52M/330M
[INFO] ------------------------------------------------------------------------
Waiting for Hudson to finish collecting data
Sending e-mails to: wink-dev@incubator.apache.org
channel stopped


Mime
View raw message