incubator-wave-dev mailing list archives

Site index · List index
Message view « Date » · « Thread »
Top « Date » · « Thread »
From Apache Jenkins Server <jenk...@builds.apache.org>
Subject Build failed in Jenkins: wave-small_tests #2161
Date Tue, 18 Apr 2017 17:49:53 GMT
See <https://builds.apache.org/job/wave-small_tests/2161/display/redirect?page=changes>

Changes:

[yurize] WAVE-440 - updates oauth jars version and adds Atlassion repo.

------------------------------------------
Started by an SCM change
[EnvInject] - Loading node environment variables.
Building remotely on ubuntu-4 (ubuntu trusty) in workspace <https://builds.apache.org/job/wave-small_tests/ws/>
Cloning the remote Git repository
Cloning repository git://git.apache.org/incubator-wave.git
 > git init <https://builds.apache.org/job/wave-small_tests/ws/> # timeout=10
Fetching upstream changes from git://git.apache.org/incubator-wave.git
 > git --version # timeout=10
 > git fetch --tags --progress git://git.apache.org/incubator-wave.git +refs/heads/*:refs/remotes/origin/*
 > git config remote.origin.url git://git.apache.org/incubator-wave.git # timeout=10
 > git config --add remote.origin.fetch +refs/heads/*:refs/remotes/origin/* # timeout=10
 > git config remote.origin.url git://git.apache.org/incubator-wave.git # timeout=10
Fetching upstream changes from git://git.apache.org/incubator-wave.git
 > git fetch --tags --progress git://git.apache.org/incubator-wave.git +refs/heads/*:refs/remotes/origin/*
 > git rev-parse refs/remotes/origin/master^{commit} # timeout=10
 > git rev-parse refs/remotes/origin/origin/master^{commit} # timeout=10
Checking out Revision 19783bca9f9071ac7a0645ed742784a63f63739a (refs/remotes/origin/master)
 > git config core.sparsecheckout # timeout=10
 > git checkout -f 19783bca9f9071ac7a0645ed742784a63f63739a
 > git rev-list 3dc20d6ac46e65be91002eb8db8dc1b3085405ce # timeout=10
FATAL: Unable to generate release notes for JIRA version /WAVE: java.lang.IllegalArgumentException:
No version specified
java.lang.IllegalArgumentException: No version specified
	at hudson.plugins.jira.JiraCreateReleaseNotes.setUp(JiraCreateReleaseNotes.java:127)
	at jenkins.tasks.SimpleBuildWrapper.setUp(SimpleBuildWrapper.java:145)
	at hudson.model.Build$BuildExecution.doRun(Build.java:156)
	at hudson.model.AbstractBuild$AbstractBuildExecution.run(AbstractBuild.java:534)
	at hudson.model.Run.execute(Run.java:1728)
	at hudson.model.FreeStyleBuild.run(FreeStyleBuild.java:43)
	at hudson.model.ResourceController.execute(ResourceController.java:98)
	at hudson.model.Executor.run(Executor.java:404)
Finished: FAILURE
[Gradle] - Launching build.
[wave-small_tests] $ <https://builds.apache.org/job/wave-small_tests/ws/gradlew> clean
Downloading https://services.gradle.org/distributions/gradle-2.11-all.zip
.........................................................................................................................................................................................................................................................................................................................................................................................................................................................................................................................................................................................................................................................................................................................................................................................................................................................................................................................................................................................................................................................................................................................................................................................................................................................................................................................................................................................................................................................................................................................................................................................................................................................................................................................................................................................................................................................................................................................................................................................................................................................................................................................................................................................................................................................................................................................................................................................................................................................................................................................................................................................................................................................................................................................................................................................................................................................................................................................................................................................................................................................................................................................................................................................................................................................................................................................................................................................................................................................................................................................................................................................................
Unzipping /home/jenkins/.gradle/wrapper/dists/gradle-2.11-all/ace7yl0a7udokebb27mt9s3qr/gradle-2.11-all.zip
to /home/jenkins/.gradle/wrapper/dists/gradle-2.11-all/ace7yl0a7udokebb27mt9s3qr
Set executable permissions for: /home/jenkins/.gradle/wrapper/dists/gradle-2.11-all/ace7yl0a7udokebb27mt9s3qr/gradle-2.11/bin/gradle
Download https://repo1.maven.org/maven2/com/google/protobuf/protobuf-gradle-plugin/0.7.3/protobuf-gradle-plugin-0.7.3.pom
Download https://plugins.gradle.org/m2/gradle/plugin/org/nosphere/apache/creadur-rat-gradle/0.2.0/creadur-rat-gradle-0.2.0.pom
Download https://repo1.maven.org/maven2/com/google/gradle/osdetector-gradle-plugin/1.2.1/osdetector-gradle-plugin-1.2.1.pom
Download https://repo1.maven.org/maven2/kr/motd/maven/os-maven-plugin/1.2.3.Final/os-maven-plugin-1.2.3.Final.pom
Download https://repo1.maven.org/maven2/com/google/protobuf/protobuf-gradle-plugin/0.7.3/protobuf-gradle-plugin-0.7.3.jar
Download https://plugins.gradle.org/m2/gradle/plugin/org/nosphere/apache/creadur-rat-gradle/0.2.0/creadur-rat-gradle-0.2.0.jar
Download https://repo1.maven.org/maven2/com/google/gradle/osdetector-gradle-plugin/1.2.1/osdetector-gradle-plugin-1.2.1.jar
Download https://repo1.maven.org/maven2/kr/motd/maven/os-maven-plugin/1.2.3.Final/os-maven-plugin-1.2.3.Final.jar
Download https://repo1.maven.org/maven2/org/apache/maven/maven-plugin-api/3.2.1/maven-plugin-api-3.2.1.jar
Download https://repo1.maven.org/maven2/org/apache/maven/maven-model/3.2.1/maven-model-3.2.1.jar
Download https://repo1.maven.org/maven2/org/apache/maven/maven-artifact/3.2.1/maven-artifact-3.2.1.jar
Download https://plugins.gradle.org/m2/com/github/jengelman/gradle/plugins/shadow/1.2.3/shadow-1.2.3.pom
Download https://plugins.gradle.org/m2/com/github/jengelman/gradle/plugins/shadow/1.2.3/shadow-1.2.3.jar
Download https://repo1.maven.org/maven2/com/google/protobuf/protoc/2.6.1/protoc-2.6.1.pom
Download https://repo1.maven.org/maven2/com/google/protobuf/protoc/2.6.1/protoc-2.6.1-linux-x86_64.exe
Incremental java compilation is an incubating feature.
Download https://repo1.maven.org/maven2/com/google/gwt/gwt-dev/2.8.0/gwt-dev-2.8.0.pom
Download https://repo1.maven.org/maven2/com/google/gwt/gwt/2.8.0/gwt-2.8.0.pom
Download https://repo1.maven.org/maven2/com/google/web/bindery/requestfactory/2.8.0/requestfactory-2.8.0.pom
Download https://repo1.maven.org/maven2/com/google/jsinterop/jsinterop/1.0.1/jsinterop-1.0.1.pom
Download https://repo1.maven.org/maven2/com/google/gwt/gwt-user/2.8.0/gwt-user-2.8.0.pom
Download https://repo1.maven.org/maven2/com/google/gwt/gwt-codeserver/2.8.0/gwt-codeserver-2.8.0.pom
Download http://archiva.comunes.org/repository/comunes-snapshots/cc/kune/gwt-initials-avatars-shared/1.0-SNAPSHOT/gwt-initials-avatars-shared-1.0-20140325.224853-17.pom
Download http://archiva.comunes.org/repository/comunes-snapshots/cc/kune/gwt-initials-avatars/1.0-SNAPSHOT/gwt-initials-avatars-1.0-20140325.224845-19.pom
Download https://repo1.maven.org/maven2/com/google/guava/guava-gwt/20.0/guava-gwt-20.0.pom
Download https://repo1.maven.org/maven2/com/google/gxp/google-gxp/0.2.4-beta/google-gxp-0.2.4-beta.pom
Download https://repo1.maven.org/maven2/com/googlecode/protobuf-java-format/protobuf-java-format/1.2/protobuf-java-format-1.2.pom
Download https://repo1.maven.org/maven2/eu/infomas/annotation-detector/3.0.0/annotation-detector-3.0.0.pom
Download https://repo1.maven.org/maven2/eu/infomas/infomas-asl/3.0.0/infomas-asl-3.0.0.pom
Download https://repo1.maven.org/maven2/org/antlr/antlr/3.2/antlr-3.2.pom
Download https://repo1.maven.org/maven2/org/antlr/antlr-master/3.2/antlr-master-3.2.pom
Download https://repo1.maven.org/maven2/org/apache/lucene/lucene-core/3.5.0/lucene-core-3.5.0.pom
Download https://repo1.maven.org/maven2/org/apache/lucene/lucene-parent/3.5.0/lucene-parent-3.5.0.pom
Download https://repo1.maven.org/maven2/org/apache/lucene/lucene-solr-grandparent/3.5.0/lucene-solr-grandparent-3.5.0.pom
Download https://repo1.maven.org/maven2/org/atmosphere/atmosphere-guice/0.8.3/atmosphere-guice-0.8.3.pom
Download https://repo1.maven.org/maven2/org/atmosphere/atmosphere-project/0.8.3/atmosphere-project-0.8.3.pom
Download https://repo1.maven.org/maven2/org/atmosphere/atmosphere-runtime/2.1.0/atmosphere-runtime-2.1.0.pom
Download https://repo1.maven.org/maven2/org/atmosphere/atmosphere-project/2.1.0/atmosphere-project-2.1.0.pom
Download https://repo1.maven.org/maven2/org/bouncycastle/bcprov-jdk16/1.45/bcprov-jdk16-1.45.pom
Download https://repo1.maven.org/maven2/org/eclipse/jetty/jetty-client/9.2.14.v20151106/jetty-client-9.2.14.v20151106.pom
Download https://repo1.maven.org/maven2/org/eclipse/jetty/jetty-proxy/9.2.14.v20151106/jetty-proxy-9.2.14.v20151106.pom
Download https://repo1.maven.org/maven2/org/mongodb/mongo-java-driver/2.11.2/mongo-java-driver-2.11.2.pom
Download https://repo1.maven.org/maven2/org/slf4j/slf4j-simple/1.6.1/slf4j-simple-1.6.1.pom
Download https://repo1.maven.org/maven2/javax/jdo/jdo2-api/2.1/jdo2-api-2.1.pom
Download https://maven.atlassian.com/3rdparty/net/oauth/core/oauth-provider/20100601-atlassian-2/oauth-provider-20100601-atlassian-2.pom
Download https://maven.atlassian.com/3rdparty/net/oauth/core/oauth-core-parent/20100601-atlassian-2/oauth-core-parent-20100601-atlassian-2.pom
Download https://maven.atlassian.com/3rdparty/net/oauth/oauth-parent/20100601-atlassian-2/oauth-parent-20100601-atlassian-2.pom
Download https://maven.atlassian.com/3rdparty/net/oauth/core/oauth/20100601-atlassian-2/oauth-20100601-atlassian-2.pom
Download https://maven.atlassian.com/3rdparty/net/oauth/core/oauth-consumer/20100601-atlassian-2/oauth-consumer-20100601-atlassian-2.pom
Download https://repo1.maven.org/maven2/xpp3/xpp3_xpath/1.1.4c/xpp3_xpath-1.1.4c.pom
Download https://repo1.maven.org/maven2/com/ibm/icu/icu4j/50.1.1/icu4j-50.1.1.pom
Download https://repo1.maven.org/maven2/tapestry/tapestry/4.0.2/tapestry-4.0.2.pom
Download https://repo1.maven.org/maven2/net/sourceforge/htmlunit/htmlunit/2.19/htmlunit-2.19.pom
Download https://repo1.maven.org/maven2/org/eclipse/jetty/apache-jsp/9.2.14.v20151106/apache-jsp-9.2.14.v20151106.pom
Download https://repo1.maven.org/maven2/com/google/jsinterop/jsinterop-annotations/1.0.1/jsinterop-annotations-1.0.1.pom
Download https://repo1.maven.org/maven2/com/google/errorprone/error_prone_annotations/2.0.12/error_prone_annotations-2.0.12.pom
Download https://repo1.maven.org/maven2/com/google/errorprone/error_prone_parent/2.0.12/error_prone_parent-2.0.12.pom
Download https://repo1.maven.org/maven2/com/google/j2objc/j2objc-annotations/1.1/j2objc-annotations-1.1.pom
Download https://repo1.maven.org/maven2/org/antlr/antlr-runtime/3.2/antlr-runtime-3.2.pom
Download https://repo1.maven.org/maven2/org/atmosphere/atmosphere-jersey/0.8.3/atmosphere-jersey-0.8.3.pom
Download https://repo1.maven.org/maven2/com/sun/jersey/contribs/jersey-guice/1.9.1/jersey-guice-1.9.1.pom
Download https://repo1.maven.org/maven2/com/sun/jersey/contribs/jersey-contribs/1.9.1/jersey-contribs-1.9.1.pom
Download https://repo1.maven.org/maven2/com/sun/jersey/jersey-project/1.9.1/jersey-project-1.9.1.pom
Download https://repo1.maven.org/maven2/org/apache/geronimo/specs/geronimo-jpa_3.0_spec/1.0/geronimo-jpa_3.0_spec-1.0.pom
Download https://repo1.maven.org/maven2/net/sourceforge/nekohtml/nekohtml/1.9.22/nekohtml-1.9.22.pom
Download https://repo1.maven.org/maven2/org/atmosphere/atmosphere-annotations/0.8.3/atmosphere-annotations-0.8.3.pom
Download https://repo1.maven.org/maven2/com/sun/jersey/jersey-server/1.9.1/jersey-server-1.9.1.pom
Download https://repo1.maven.org/maven2/com/sun/jersey/jersey-core/1.9.1/jersey-core-1.9.1.pom
Download https://repo1.maven.org/maven2/com/google/code/gson/gson/2.6.2/gson-2.6.2.pom
Download https://repo1.maven.org/maven2/com/google/code/gson/gson-parent/2.6.2/gson-parent-2.6.2.pom

FAILURE: Build failed with an exception.

* Where:
Build file '<https://builds.apache.org/job/wave-small_tests/ws/wave/build.gradle'> line:
529

* What went wrong:
A problem occurred evaluating project ':wave'.
> Could not resolve all dependencies for configuration ':wave:compile'.
   > Could not resolve cc.kune:gwt-initials-avatars-server:1.0-SNAPSHOT.
     Required by:
         apache-wave:wave:0.4.2
      > Could not resolve cc.kune:gwt-initials-avatars-server:1.0-SNAPSHOT.
         > Unable to load Maven meta-data from http://archiva.comunes.org/repository/comunes-snapshots/cc/kune/gwt-initials-avatars-server/1.0-SNAPSHOT/maven-metadata.xml.
            > Could not GET 'http://archiva.comunes.org/repository/comunes-snapshots/cc/kune/gwt-initials-avatars-server/1.0-SNAPSHOT/maven-metadata.xml'.
               > archiva.comunes.org:80 failed to respond

* Try:
Run with --stacktrace option to get the stack trace. Run with --info or --debug option to
get more log output.

BUILD FAILED

Total time: 1 mins 1.995 secs
Build step 'Invoke Gradle script' changed build result to FAILURE
Build step 'Invoke Gradle script' marked build as failure

Mime
View raw message