incubator-wave-dev mailing list archives

Site index · List index
Message view « Date » · « Thread »
Top « Date » · « Thread »
From Apache Jenkins Server <jenk...@builds.apache.org>
Subject Build failed in Jenkins: wave-small_tests #2140
Date Tue, 12 Jan 2016 06:49:05 GMT
See <https://builds.apache.org/job/wave-small_tests/2140/changes>

Changes:

[yuri.zelikov] Fixes WAVE-435, Refactoring of PST compiler and general cleanup

------------------------------------------
Started by an SCM change
[EnvInject] - Loading node environment variables.
Building remotely on ubuntu3 (Ubuntu ubuntu legacy-ubuntu) in workspace <https://builds.apache.org/job/wave-small_tests/ws/>
 > git rev-parse --is-inside-work-tree # timeout=10
Fetching changes from the remote Git repository
 > git config remote.origin.url git://git.apache.org/incubator-wave.git # timeout=10
Fetching upstream changes from git://git.apache.org/incubator-wave.git
 > git --version # timeout=10
 > git -c core.askpass=true fetch --tags --progress git://git.apache.org/incubator-wave.git
+refs/heads/*:refs/remotes/origin/*
 > git rev-parse refs/remotes/origin/master^{commit} # timeout=10
 > git rev-parse refs/remotes/origin/origin/master^{commit} # timeout=10
Checking out Revision b15695b9e15f1b68a5a64b1e539a9438e9efcc00 (refs/remotes/origin/master)
 > git config core.sparsecheckout # timeout=10
 > git checkout -f b15695b9e15f1b68a5a64b1e539a9438e9efcc00
 > git rev-list e650c2d8614d929fbeef9c3bf4d378e1c31fd43c # timeout=10
No release version found, skipping Release Notes generation
[Gradle] - Launching build.
[wave-small_tests] $ <https://builds.apache.org/job/wave-small_tests/ws/gradlew> clean
Download https://repo1.maven.org/maven2/com/google/protobuf/protobuf-gradle-plugin/0.7.3/protobuf-gradle-plugin-0.7.3.pom
Download https://repo1.maven.org/maven2/com/google/protobuf/protobuf-gradle-plugin/0.7.3/protobuf-gradle-plugin-0.7.3.jar
Download https://plugins.gradle.org/m2/com/github/jengelman/gradle/plugins/shadow/1.2.2/shadow-1.2.2.pom
Download https://plugins.gradle.org/m2/com/github/jengelman/gradle/plugins/shadow/1.2.2/shadow-1.2.2.jar
Incremental java compilation is an incubating feature.
Download https://repo1.maven.org/maven2/eu/infomas/annotation-detector/3.0.0/annotation-detector-3.0.0.pom
Download https://repo1.maven.org/maven2/eu/infomas/infomas-asl/3.0.0/infomas-asl-3.0.0.pom
Download https://repo1.maven.org/maven2/org/atmosphere/atmosphere-guice/0.8.3/atmosphere-guice-0.8.3.pom
Download https://repo1.maven.org/maven2/org/atmosphere/atmosphere-project/0.8.3/atmosphere-project-0.8.3.pom
Download https://repo1.maven.org/maven2/org/atmosphere/atmosphere-runtime/2.1.0/atmosphere-runtime-2.1.0.pom
Download https://repo1.maven.org/maven2/org/atmosphere/atmosphere-project/2.1.0/atmosphere-project-2.1.0.pom
Download https://repo1.maven.org/maven2/org/igniterealtime/tinder/1.2.3/tinder-1.2.3.pom
Download https://repo1.maven.org/maven2/org/igniterealtime/whack/core/2.0.0/core-2.0.0.pom
Download https://repo1.maven.org/maven2/org/igniterealtime/whack/2.0.0/whack-2.0.0.pom
Download https://repo1.maven.org/maven2/org/atmosphere/atmosphere-jersey/0.8.3/atmosphere-jersey-0.8.3.pom
Download https://repo1.maven.org/maven2/com/sun/jersey/contribs/jersey-guice/1.9.1/jersey-guice-1.9.1.pom
Download https://repo1.maven.org/maven2/com/sun/jersey/contribs/jersey-contribs/1.9.1/jersey-contribs-1.9.1.pom
Download https://repo1.maven.org/maven2/com/sun/jersey/jersey-project/1.9.1/jersey-project-1.9.1.pom
Download https://repo1.maven.org/maven2/com/googlecode/concurrentlinkedhashmap/concurrentlinkedhashmap-lru/1.0_jdk5/concurrentlinkedhashmap-lru-1.0_jdk5.pom
Download https://repo1.maven.org/maven2/org/atmosphere/atmosphere-annotations/0.8.3/atmosphere-annotations-0.8.3.pom
Download https://repo1.maven.org/maven2/com/sun/jersey/jersey-server/1.9.1/jersey-server-1.9.1.pom
Download https://repo1.maven.org/maven2/com/sun/jersey/jersey-core/1.9.1/jersey-core-1.9.1.pom
Download https://repo1.maven.org/maven2/eu/infomas/annotation-detector/3.0.0/annotation-detector-3.0.0.jar
Download https://repo1.maven.org/maven2/org/atmosphere/atmosphere-guice/0.8.3/atmosphere-guice-0.8.3.jar
Download https://repo1.maven.org/maven2/org/atmosphere/atmosphere-runtime/2.1.0/atmosphere-runtime-2.1.0.jar
Download https://repo1.maven.org/maven2/org/igniterealtime/tinder/1.2.3/tinder-1.2.3.jar
Download https://repo1.maven.org/maven2/org/igniterealtime/whack/core/2.0.0/core-2.0.0.jar
Download https://repo1.maven.org/maven2/org/atmosphere/atmosphere-jersey/0.8.3/atmosphere-jersey-0.8.3.jar
Download https://repo1.maven.org/maven2/com/sun/jersey/contribs/jersey-guice/1.9.1/jersey-guice-1.9.1.jar
Download https://repo1.maven.org/maven2/com/googlecode/concurrentlinkedhashmap/concurrentlinkedhashmap-lru/1.0_jdk5/concurrentlinkedhashmap-lru-1.0_jdk5.jar
Download https://repo1.maven.org/maven2/org/atmosphere/atmosphere-annotations/0.8.3/atmosphere-annotations-0.8.3.jar
Download https://repo1.maven.org/maven2/com/sun/jersey/jersey-server/1.9.1/jersey-server-1.9.1.jar
Download https://repo1.maven.org/maven2/com/sun/jersey/jersey-core/1.9.1/jersey-core-1.9.1.jar
:pst:clean
:wave:clean

BUILD SUCCESSFUL

Total time: 35.223 secs

This build could be faster, please consider using the Gradle Daemon: https://docs.gradle.org/2.9/userguide/gradle_daemon.html
Build step 'Invoke Gradle script' changed build result to SUCCESS
[Gradle] - Launching build.
[wave-small_tests] $ <https://builds.apache.org/job/wave-small_tests/ws/gradlew> test
Incremental java compilation is an incubating feature.
Download https://repo1.maven.org/maven2/com/google/guava/guava/19.0/guava-19.0.jar
:pst:extractIncludeProto
:pst:extractProto
:pst:generateProto
:pst:compileJava/x1/jenkins/jenkins-slave/workspace/wave-small_tests/pst/src/main/java/org/waveprotocol/pst/model/Field.java:24:
error: package org.waveprotocol.protobuf does not exist
import org.waveprotocol.protobuf.Extensions;
                                ^
/x1/jenkins/jenkins-slave/workspace/wave-small_tests/pst/src/main/java/org/waveprotocol/pst/model/Field.java:206:
error: cannot find symbol
        && field.getOptions().hasExtension(Extensions.int52)
                                           ^
  symbol:   variable Extensions
  location: class Field
/x1/jenkins/jenkins-slave/workspace/wave-small_tests/pst/src/main/java/org/waveprotocol/pst/model/Field.java:207:
error: cannot find symbol
        && field.getOptions().getExtension(Extensions.int52);
                                           ^
  symbol:   variable Extensions
  location: class Field
Note: /x1/jenkins/jenkins-slave/workspace/wave-small_tests/pst/src/main/java/org/waveprotocol/pst/PstCommandLine.java
uses or overrides a deprecated API.
Note: Recompile with -Xlint:deprecation for details.
3 errors
 FAILED

FAILURE: Build failed with an exception.

* What went wrong:
Execution failed for task ':pst:compileJava'.
> Compilation failed; see the compiler error output for details.

* Try:
Run with --stacktrace option to get the stack trace. Run with --info or --debug option to
get more log output.

BUILD FAILED

Total time: 13.736 secs
Build step 'Invoke Gradle script' changed build result to FAILURE
Build step 'Invoke Gradle script' marked build as failure

Mime
View raw message