incubator-wave-dev mailing list archives

Site index · List index
Message view « Date » · « Thread »
Top « Date » · « Thread »
From Apache Jenkins Server <jenk...@builds.apache.org>
Subject Build failed in Jenkins: wave-small_tests #2132
Date Wed, 16 Dec 2015 21:10:30 GMT
See <https://builds.apache.org/job/wave-small_tests/2132/>

------------------------------------------
Started by user yurize
[EnvInject] - Loading node environment variables.
Building remotely on ubuntu3 (Ubuntu ubuntu legacy-ubuntu) in workspace <https://builds.apache.org/job/wave-small_tests/ws/>
 > git rev-parse --is-inside-work-tree # timeout=10
Fetching changes from the remote Git repository
 > git config remote.origin.url git://git.apache.org/incubator-wave.git # timeout=10
Fetching upstream changes from git://git.apache.org/incubator-wave.git
 > git --version # timeout=10
 > git -c core.askpass=true fetch --tags --progress git://git.apache.org/incubator-wave.git
+refs/heads/*:refs/remotes/origin/*
Seen branch in repository origin/0.4.0-RC7
Seen branch in repository origin/0.4.0-RC9
Seen branch in repository origin/0.4.0-rc10
Seen branch in repository origin/dev
Seen branch in repository origin/feature/WAVE-426-add-sbt
Seen branch in repository origin/fix/WAVE-413
Seen branch in repository origin/fix/WAVE-419
Seen branch in repository origin/fulltextsearch
Seen branch in repository origin/master
Seen branch in repository origin/wave-0.4-rc5
Seen branch in repository origin/wave-0.4-rc6
Seen branch in repository origin/wave-0.4-release
Seen 12 remote branches
Checking out Revision 64ad0273cedd5aff0f068e530c456d644ef68751 (origin/master)
 > git config core.sparsecheckout # timeout=10
 > git checkout -f 64ad0273cedd5aff0f068e530c456d644ef68751
 > git rev-list 64ad0273cedd5aff0f068e530c456d644ef68751 # timeout=10
No release version found, skipping Release Notes generation
[Gradle] - Launching build.
[wave-small_tests] $ gradle clean
FATAL: command execution failed
java.io.IOException: Cannot run program "gradle" (in directory "<https://builds.apache.org/job/wave-small_tests/ws/")>:
error=2, No such file or directory
	at java.lang.ProcessBuilder.start(ProcessBuilder.java:1041)
	at hudson.Proc$LocalProc.<init>(Proc.java:244)
	at hudson.Proc$LocalProc.<init>(Proc.java:216)
	at hudson.Launcher$LocalLauncher.launch(Launcher.java:803)
	at hudson.Launcher$ProcStarter.start(Launcher.java:381)
	at hudson.Launcher$RemoteLaunchCallable.call(Launcher.java:1136)
	at hudson.Launcher$RemoteLaunchCallable.call(Launcher.java:1101)
	at hudson.remoting.UserRequest.perform(UserRequest.java:121)
	at hudson.remoting.UserRequest.perform(UserRequest.java:49)
	at hudson.remoting.Request$2.run(Request.java:326)
	at hudson.remoting.InterceptingExecutorService$1.call(InterceptingExecutorService.java:68)
	at java.util.concurrent.FutureTask.run(FutureTask.java:262)
	at java.util.concurrent.ThreadPoolExecutor.runWorker(ThreadPoolExecutor.java:1145)
	at java.util.concurrent.ThreadPoolExecutor$Worker.run(ThreadPoolExecutor.java:615)
	at java.lang.Thread.run(Thread.java:745)
	at ......remote call to ubuntu3(Native Method)
	at hudson.remoting.Channel.attachCallSiteStackTrace(Channel.java:1413)
	at hudson.remoting.UserResponse.retrieve(UserRequest.java:221)
	at hudson.remoting.Channel.call(Channel.java:778)
	at hudson.Launcher$RemoteLauncher.launch(Launcher.java:916)
	at hudson.Launcher$ProcStarter.start(Launcher.java:381)
	at hudson.Launcher$ProcStarter.join(Launcher.java:388)
	at hudson.plugins.gradle.Gradle.performTask(Gradle.java:262)
	at hudson.plugins.gradle.Gradle.perform(Gradle.java:116)
	at hudson.tasks.BuildStepMonitor$1.perform(BuildStepMonitor.java:20)
	at hudson.model.AbstractBuild$AbstractBuildExecution.perform(AbstractBuild.java:776)
	at hudson.model.Build$BuildExecution.build(Build.java:203)
	at hudson.model.Build$BuildExecution.doRun(Build.java:160)
	at hudson.model.AbstractBuild$AbstractBuildExecution.run(AbstractBuild.java:536)
	at hudson.model.Run.execute(Run.java:1738)
	at hudson.model.FreeStyleBuild.run(FreeStyleBuild.java:43)
	at hudson.model.ResourceController.execute(ResourceController.java:98)
	at hudson.model.Executor.run(Executor.java:381)
Caused by: java.io.IOException: error=2, No such file or directory
	at java.lang.UNIXProcess.forkAndExec(Native Method)
	at java.lang.UNIXProcess.<init>(UNIXProcess.java:186)
	at java.lang.ProcessImpl.start(ProcessImpl.java:130)
	at java.lang.ProcessBuilder.start(ProcessBuilder.java:1022)
	at hudson.Proc$LocalProc.<init>(Proc.java:244)
	at hudson.Proc$LocalProc.<init>(Proc.java:216)
	at hudson.Launcher$LocalLauncher.launch(Launcher.java:803)
	at hudson.Launcher$ProcStarter.start(Launcher.java:381)
	at hudson.Launcher$RemoteLaunchCallable.call(Launcher.java:1136)
	at hudson.Launcher$RemoteLaunchCallable.call(Launcher.java:1101)
	at hudson.remoting.UserRequest.perform(UserRequest.java:121)
	at hudson.remoting.UserRequest.perform(UserRequest.java:49)
	at hudson.remoting.Request$2.run(Request.java:326)
	at hudson.remoting.InterceptingExecutorService$1.call(InterceptingExecutorService.java:68)
	at java.util.concurrent.FutureTask.run(FutureTask.java:262)
	at java.util.concurrent.ThreadPoolExecutor.runWorker(ThreadPoolExecutor.java:1145)
	at java.util.concurrent.ThreadPoolExecutor$Worker.run(ThreadPoolExecutor.java:615)
	at java.lang.Thread.run(Thread.java:745)
Build step 'Invoke Gradle script' changed build result to FAILURE
Build step 'Invoke Gradle script' marked build as failure

Mime
View raw message