incubator-wave-dev mailing list archives

Site index · List index
Message view « Date » · « Thread »
Top « Date » · « Thread »
From Apache Jenkins Server <jenk...@builds.apache.org>
Subject Build failed in Jenkins: wave-small_tests #2134
Date Thu, 17 Dec 2015 18:54:05 GMT
See <https://builds.apache.org/job/wave-small_tests/2134/changes>

Changes:

[yurize] Makes gradlew executable.

------------------------------------------
Started by user yurize
[EnvInject] - Loading node environment variables.
Building remotely on H11 (Ubuntu ubuntu) in workspace <https://builds.apache.org/job/wave-small_tests/ws/>
Cloning the remote Git repository
Cloning repository git://git.apache.org/incubator-wave.git
 > git init <https://builds.apache.org/job/wave-small_tests/ws/> # timeout=10
Fetching upstream changes from git://git.apache.org/incubator-wave.git
 > git --version # timeout=10
 > git -c core.askpass=true fetch --tags --progress git://git.apache.org/incubator-wave.git
+refs/heads/*:refs/remotes/origin/*
 > git config remote.origin.url git://git.apache.org/incubator-wave.git # timeout=10
 > git config --add remote.origin.fetch +refs/heads/*:refs/remotes/origin/* # timeout=10
 > git config remote.origin.url git://git.apache.org/incubator-wave.git # timeout=10
Fetching upstream changes from git://git.apache.org/incubator-wave.git
 > git -c core.askpass=true fetch --tags --progress git://git.apache.org/incubator-wave.git
+refs/heads/*:refs/remotes/origin/*
Seen branch in repository origin/0.4.0-RC7
Seen branch in repository origin/0.4.0-RC9
Seen branch in repository origin/0.4.0-rc10
Seen branch in repository origin/dev
Seen branch in repository origin/feature/WAVE-426-add-sbt
Seen branch in repository origin/fix/WAVE-413
Seen branch in repository origin/fix/WAVE-419
Seen branch in repository origin/fulltextsearch
Seen branch in repository origin/master
Seen branch in repository origin/wave-0.4-rc5
Seen branch in repository origin/wave-0.4-rc6
Seen branch in repository origin/wave-0.4-release
Seen 12 remote branches
Checking out Revision f889e9e49a13b794ef524ae0bbed71cf8d4b6b5f (origin/master)
 > git config core.sparsecheckout # timeout=10
 > git checkout -f f889e9e49a13b794ef524ae0bbed71cf8d4b6b5f
 > git rev-list 3461fc9b3e51a52de77db550777f6a4dd62c11db # timeout=10
No release version found, skipping Release Notes generation
[Gradle] - Launching build.
[wave-small_tests] $ <https://builds.apache.org/job/wave-small_tests/ws/gradlew> clean
Download https://plugins.gradle.org/m2/com/google/protobuf/protobuf-gradle-plugin/0.7.0/protobuf-gradle-plugin-0.7.0.pom
Download https://plugins.gradle.org/m2/gradle/plugin/org/nosphere/apache/creadur-rat-gradle/0.2.0/creadur-rat-gradle-0.2.0.pom
Download https://plugins.gradle.org/m2/com/google/gradle/osdetector-gradle-plugin/1.2.1/osdetector-gradle-plugin-1.2.1.pom
Download https://plugins.gradle.org/m2/kr/motd/maven/os-maven-plugin/1.2.3.Final/os-maven-plugin-1.2.3.Final.pom
Download https://plugins.gradle.org/m2/org/apache/maven/maven-plugin-api/3.2.1/maven-plugin-api-3.2.1.pom
Download https://plugins.gradle.org/m2/org/apache/maven/maven-model/3.2.1/maven-model-3.2.1.pom
Download https://plugins.gradle.org/m2/org/apache/maven/maven-artifact/3.2.1/maven-artifact-3.2.1.pom
Download https://plugins.gradle.org/m2/com/google/protobuf/protobuf-gradle-plugin/0.7.0/protobuf-gradle-plugin-0.7.0.jar
Download https://plugins.gradle.org/m2/gradle/plugin/org/nosphere/apache/creadur-rat-gradle/0.2.0/creadur-rat-gradle-0.2.0.jar
Download https://plugins.gradle.org/m2/com/google/gradle/osdetector-gradle-plugin/1.2.1/osdetector-gradle-plugin-1.2.1.jar
Download https://plugins.gradle.org/m2/kr/motd/maven/os-maven-plugin/1.2.3.Final/os-maven-plugin-1.2.3.Final.jar
Download https://plugins.gradle.org/m2/org/apache/maven/maven-plugin-api/3.2.1/maven-plugin-api-3.2.1.jar
Download https://plugins.gradle.org/m2/org/apache/maven/maven-model/3.2.1/maven-model-3.2.1.jar
Download https://plugins.gradle.org/m2/org/apache/maven/maven-artifact/3.2.1/maven-artifact-3.2.1.jar
Incremental java compilation is an incubating feature.
Download https://repo1.maven.org/maven2/com/google/protobuf/protoc/2.6.1/protoc-2.6.1.pom
Download https://repo1.maven.org/maven2/com/google/protobuf/protoc/2.6.1/protoc-2.6.1-linux-x86_64.exe
Download https://repo1.maven.org/maven2/org/antlr/antlr/3.2/antlr-3.2.pom
Download https://repo1.maven.org/maven2/org/antlr/antlr-master/3.2/antlr-master-3.2.pom
Download https://repo1.maven.org/maven2/org/bouncycastle/bcprov-jdk16/1.45/bcprov-jdk16-1.45.pom
Download https://repo1.maven.org/maven2/commons-fileupload/commons-fileupload/1.2.2/commons-fileupload-1.2.2.pom
Download https://repo1.maven.org/maven2/org/apache/commons/commons-parent/16/commons-parent-16.pom
Download https://repo1.maven.org/maven2/com/google/guava/guava-gwt/15.0/guava-gwt-15.0.pom
Download https://repo1.maven.org/maven2/com/google/gxp/google-gxp/0.2.4-beta/google-gxp-0.2.4-beta.pom
Download https://repo1.maven.org/maven2/javax/jdo/jdo2-api/2.1/jdo2-api-2.1.pom
Download https://repo1.maven.org/maven2/joda-time/joda-time/1.6/joda-time-1.6.pom
Download https://repo1.maven.org/maven2/org/apache/lucene/lucene-core/3.5.0/lucene-core-3.5.0.pom
Download https://repo1.maven.org/maven2/org/apache/lucene/lucene-parent/3.5.0/lucene-parent-3.5.0.pom
Download https://repo1.maven.org/maven2/net/oauth/core/oauth-provider/20100527/oauth-provider-20100527.pom
Download https://repo1.maven.org/maven2/net/oauth/core/oauth-core-parent/20090531/oauth-core-parent-20090531.pom
Download https://repo1.maven.org/maven2/net/oauth/oauth-parent/20090531/oauth-parent-20090531.pom
Download https://repo1.maven.org/maven2/net/oauth/core/oauth/20100527/oauth-20100527.pom
Download https://oauth.googlecode.com/svn/code/maven/net/oauth/core/oauth-consumer/20100527/oauth-consumer-20100527.pom
Download https://repo1.maven.org/maven2/com/googlecode/protobuf-java-format/protobuf-java-format/1.2/protobuf-java-format-1.2.pom
Download https://repo1.maven.org/maven2/org/igniterealtime/tinder/1.2.1/tinder-1.2.1.pom
Download https://repo1.maven.org/maven2/xpp3/xpp3_xpath/1.1.4c/xpp3_xpath-1.1.4c.pom
Download https://repo1.maven.org/maven2/org/gnu/inet/libidn/1.15/libidn-1.15.pom
Download http://archiva.comunes.org/repository/comunes-snapshots/cc/kune/gwt-initials-avatars-shared/1.0-SNAPSHOT/gwt-initials-avatars-shared-1.0-20140325.224853-17.pom
Download http://archiva.comunes.org/repository/comunes-snapshots/cc/kune/gwt-initials-avatars/1.0-SNAPSHOT/gwt-initials-avatars-1.0-20140325.224845-19.pom
Download http://archiva.comunes.org/repository/comunes-snapshots/cc/kune/gwt-initials-avatars-server/1.0-SNAPSHOT/gwt-initials-avatars-server-1.0-20140325.224916-11.pom
Download https://repo1.maven.org/maven2/org/eclipse/jetty/jetty-annotations/9.1.1.v20140108/jetty-annotations-9.1.1.v20140108.pom
Download https://repo1.maven.org/maven2/org/eclipse/jetty/jetty-client/9.1.1.v20140108/jetty-client-9.1.1.v20140108.pom
Download https://repo1.maven.org/maven2/org/eclipse/jetty/jetty-proxy/9.1.1.v20140108/jetty-proxy-9.1.1.v20140108.pom
Download https://repo1.maven.org/maven2/org/eclipse/jetty/jetty-servlets/9.1.1.v20140108/jetty-servlets-9.1.1.v20140108.pom
Download https://repo1.maven.org/maven2/org/eclipse/jetty/websocket/websocket-api/9.1.1.v20140108/websocket-api-9.1.1.v20140108.pom
Download https://repo1.maven.org/maven2/org/eclipse/jetty/websocket/websocket-parent/9.1.1.v20140108/websocket-parent-9.1.1.v20140108.pom
Download https://repo1.maven.org/maven2/org/eclipse/jetty/websocket/websocket-client/9.1.1.v20140108/websocket-client-9.1.1.v20140108.pom
Download https://repo1.maven.org/maven2/org/eclipse/jetty/websocket/websocket-common/9.1.1.v20140108/websocket-common-9.1.1.v20140108.pom
Download https://repo1.maven.org/maven2/org/eclipse/jetty/websocket/websocket-server/9.1.1.v20140108/websocket-server-9.1.1.v20140108.pom
Download https://repo1.maven.org/maven2/org/eclipse/jetty/websocket/websocket-servlet/9.1.1.v20140108/websocket-servlet-9.1.1.v20140108.pom
Download https://repo1.maven.org/maven2/org/antlr/antlr-runtime/3.2/antlr-runtime-3.2.pom
Download https://repo1.maven.org/maven2/javax/transaction/transaction-api/1.1/transaction-api-1.1.pom
Download https://repo1.maven.org/maven2/org/apache/geronimo/specs/geronimo-jpa_3.0_spec/1.0/geronimo-jpa_3.0_spec-1.0.pom
Download http://archiva.comunes.org/repository/comunes-snapshots/cc/kune/gwt-initials-avatars-client/1.0-SNAPSHOT/gwt-initials-avatars-client-1.0-20140325.224906-17.pom
Download https://repo1.maven.org/maven2/com/google/gwt/gwt-servlet/2.6.0/gwt-servlet-2.6.0.pom
Download https://repo1.maven.org/maven2/com/google/gwt/gwt/2.6.0/gwt-2.6.0.pom
Download https://repo1.maven.org/maven2/org/eclipse/jetty/jetty-plus/9.1.1.v20140108/jetty-plus-9.1.1.v20140108.pom
Download https://repo1.maven.org/maven2/org/eclipse/jetty/jetty-jndi/9.1.1.v20140108/jetty-jndi-9.1.1.v20140108.pom
Download https://repo1.maven.org/maven2/com/google/protobuf/protobuf-java/2.6.1/protobuf-java-2.6.1.pom
Download https://repo1.maven.org/maven2/org/antlr/antlr/3.2/antlr-3.2.jar
Download https://repo1.maven.org/maven2/org/bouncycastle/bcprov-jdk16/1.45/bcprov-jdk16-1.45.jar
Download https://repo1.maven.org/maven2/com/google/guava/guava-gwt/15.0/guava-gwt-15.0.jar
Download https://repo1.maven.org/maven2/com/google/gxp/google-gxp/0.2.4-beta/google-gxp-0.2.4-beta.jar
Download https://repo1.maven.org/maven2/javax/jdo/jdo2-api/2.1/jdo2-api-2.1.jar
Download https://repo1.maven.org/maven2/joda-time/joda-time/1.6/joda-time-1.6.jar
Download https://repo1.maven.org/maven2/org/apache/lucene/lucene-core/3.5.0/lucene-core-3.5.0.jar
Download https://repo1.maven.org/maven2/net/oauth/core/oauth-provider/20100527/oauth-provider-20100527.jar
Download https://repo1.maven.org/maven2/net/oauth/core/oauth/20100527/oauth-20100527.jar
Download https://oauth.googlecode.com/svn/code/maven/net/oauth/core/oauth-consumer/20100527/oauth-consumer-20100527.jar
Download https://repo1.maven.org/maven2/com/googlecode/protobuf-java-format/protobuf-java-format/1.2/protobuf-java-format-1.2.jar
Download https://repo1.maven.org/maven2/org/igniterealtime/tinder/1.2.1/tinder-1.2.1.jar
Download https://repo1.maven.org/maven2/xpp3/xpp3_xpath/1.1.4c/xpp3_xpath-1.1.4c.jar
Download https://repo1.maven.org/maven2/org/gnu/inet/libidn/1.15/libidn-1.15.jar
Download http://archiva.comunes.org/repository/comunes-snapshots/cc/kune/gwt-initials-avatars-shared/1.0-SNAPSHOT/gwt-initials-avatars-shared-1.0-20140325.224853-17.jar
Download http://archiva.comunes.org/repository/comunes-snapshots/cc/kune/gwt-initials-avatars-server/1.0-SNAPSHOT/gwt-initials-avatars-server-1.0-20140325.224916-11.jar
Download https://repo1.maven.org/maven2/xerces/xerces/2.4.0/xerces-2.4.0.jar
Download https://repo1.maven.org/maven2/org/eclipse/jetty/jetty-annotations/9.1.1.v20140108/jetty-annotations-9.1.1.v20140108.jar
Download https://repo1.maven.org/maven2/org/eclipse/jetty/jetty-client/9.1.1.v20140108/jetty-client-9.1.1.v20140108.jar
Download https://repo1.maven.org/maven2/org/eclipse/jetty/jetty-http/9.1.1.v20140108/jetty-http-9.1.1.v20140108.jar
Download https://repo1.maven.org/maven2/org/eclipse/jetty/jetty-io/9.1.1.v20140108/jetty-io-9.1.1.v20140108.jar
Download https://repo1.maven.org/maven2/org/eclipse/jetty/jetty-proxy/9.1.1.v20140108/jetty-proxy-9.1.1.v20140108.jar
Download https://repo1.maven.org/maven2/org/eclipse/jetty/jetty-security/9.1.1.v20140108/jetty-security-9.1.1.v20140108.jar
Download https://repo1.maven.org/maven2/org/eclipse/jetty/jetty-server/9.1.1.v20140108/jetty-server-9.1.1.v20140108.jar
Download https://repo1.maven.org/maven2/org/eclipse/jetty/jetty-servlet/9.1.1.v20140108/jetty-servlet-9.1.1.v20140108.jar
Download https://repo1.maven.org/maven2/org/eclipse/jetty/jetty-servlets/9.1.1.v20140108/jetty-servlets-9.1.1.v20140108.jar
Download https://repo1.maven.org/maven2/org/eclipse/jetty/jetty-util/9.1.1.v20140108/jetty-util-9.1.1.v20140108.jar
Download https://repo1.maven.org/maven2/org/eclipse/jetty/websocket/websocket-api/9.1.1.v20140108/websocket-api-9.1.1.v20140108.jar
Download https://repo1.maven.org/maven2/org/eclipse/jetty/websocket/websocket-client/9.1.1.v20140108/websocket-client-9.1.1.v20140108.jar
Download https://repo1.maven.org/maven2/org/eclipse/jetty/websocket/websocket-common/9.1.1.v20140108/websocket-common-9.1.1.v20140108.jar
Download https://repo1.maven.org/maven2/org/eclipse/jetty/websocket/websocket-server/9.1.1.v20140108/websocket-server-9.1.1.v20140108.jar
Download https://repo1.maven.org/maven2/org/eclipse/jetty/websocket/websocket-servlet/9.1.1.v20140108/websocket-servlet-9.1.1.v20140108.jar
Download https://repo1.maven.org/maven2/org/antlr/antlr-runtime/3.2/antlr-runtime-3.2.jar
Download https://repo1.maven.org/maven2/javax/transaction/transaction-api/1.1/transaction-api-1.1.jar
Download https://repo1.maven.org/maven2/org/apache/geronimo/specs/geronimo-jpa_3.0_spec/1.0/geronimo-jpa_3.0_spec-1.0.jar
Download http://archiva.comunes.org/repository/comunes-snapshots/cc/kune/gwt-initials-avatars-client/1.0-SNAPSHOT/gwt-initials-avatars-client-1.0-20140325.224906-17.jar
Download https://repo1.maven.org/maven2/com/google/gwt/gwt-servlet/2.6.0/gwt-servlet-2.6.0.jar
Download https://repo1.maven.org/maven2/org/eclipse/jetty/jetty-plus/9.1.1.v20140108/jetty-plus-9.1.1.v20140108.jar
Download https://repo1.maven.org/maven2/org/eclipse/jetty/jetty-jndi/9.1.1.v20140108/jetty-jndi-9.1.1.v20140108.jar
Download https://repo1.maven.org/maven2/com/google/protobuf/protobuf-java/2.6.1/protobuf-java-2.6.1.jar
:pst:clean UP-TO-DATE
:wave:clean UP-TO-DATE
:wave-proto:clean UP-TO-DATE

BUILD SUCCESSFUL

Total time: 1 mins 2.174 secs

This build could be faster, please consider using the Gradle Daemon: https://docs.gradle.org/2.9/userguide/gradle_daemon.html
Build step 'Invoke Gradle script' changed build result to SUCCESS
[Gradle] - Launching build.
[wave-small_tests] $ <https://builds.apache.org/job/wave-small_tests/ws/gradlew> compileGwt
Incremental java compilation is an incubating feature.
:wave:compileGwt
Download https://repo1.maven.org/maven2/javax/validation/validation-api/1.1.0.Final/validation-api-1.1.0.Final-sources.jar
Compiling module org.waveprotocol.box.webclient.WebClientProd
   Ignored 26 units with compilation errors in first pass.
Compile with -strict or with -logLevel set to TRACE or DEBUG to see all errors.
   Finding entry point classes
      Tracing compile failure path for type 'org.waveprotocol.box.webclient.client.WebClient'
         [ERROR] Errors in '<https://builds.apache.org/job/wave-small_tests/ws/wave/src/main/java/org/waveprotocol/box/webclient/client/WebClient.java'>
            [ERROR] org.waveprotocol.box.webclient.client.RemoteViewServiceMultiplexer cannot
be resolved to a type
         [ERROR] Errors in '<https://builds.apache.org/job/wave-small_tests/ws/wave/src/main/java/org/waveprotocol/box/webclient/client/RemoteViewServiceMultiplexer.java'>
            [ERROR] Line 159: ProtocolSubmitRequestJsoImpl cannot be resolved to a type
            [ERROR] Line 123: ProtocolOpenRequestJsoImpl cannot be resolved to a type
            [ERROR] Line 83: ProtocolWaveletUpdate cannot be resolved to a type
            [ERROR] Line 39: The type RemoteViewServiceMultiplexer must implement the inherited
abstract method WaveWebSocketCallback.onWaveletUpdate(ProtocolWaveletUpdate)
            [ERROR] Line 24: The import org.waveprotocol.box.common.comms.jso cannot be resolved
            [ERROR] Line 22: The import org.waveprotocol.box.common.comms.ProtocolWaveletUpdate
cannot be resolved
            [ERROR] Line 123: ProtocolOpenRequestJsoImpl cannot be resolved
            [ERROR] Line 23: The import org.waveprotocol.box.common.comms.jso cannot be resolved
         [ERROR] Errors in '<https://builds.apache.org/job/wave-small_tests/ws/wave/src/main/java/org/waveprotocol/box/webclient/client/WaveWebSocketClient.java'>
            [ERROR] Line 206: ProtocolWaveletUpdateJsoImpl cannot be resolved to a type
            [ERROR] Line 224: ProtocolOpenRequestJsoImpl cannot be resolved to a type
            [ERROR] Line 206: Bound mismatch: The generic method getPayload() of type WaveWebSocketClient.MessageWrapper
is not applicable for the arguments (). The inferred type ProtocolWaveletUpdateJsoImpl is
not a valid substitute for the bounded parameter <T extends JsonMessage>
            [ERROR] Line 171: ProtocolAuthenticateJsoImpl cannot be resolved
            [ERROR] Line 38: The import org.waveprotocol.box.common.comms.jso cannot be resolved
            [ERROR] Line 218: ProtocolSubmitRequestJsoImpl cannot be resolved to a type
            [ERROR] Line 34: The import org.waveprotocol.box.common.comms.jso cannot be resolved
            [ERROR] Line 35: The import org.waveprotocol.box.common.comms.jso cannot be resolved
            [ERROR] Line 37: The import org.waveprotocol.box.common.comms.jso cannot be resolved
            [ERROR] Line 171: ProtocolAuthenticateJsoImpl cannot be resolved to a type
            [ERROR] Line 213: Bound mismatch: The generic method getPayload() of type WaveWebSocketClient.MessageWrapper
is not applicable for the arguments (). The inferred type ProtocolSubmitResponseJsoImpl is
not a valid substitute for the bounded parameter <T extends JsonMessage>
            [ERROR] Line 36: The import org.waveprotocol.box.common.comms.jso cannot be resolved
            [ERROR] Line 213: ProtocolSubmitResponseJsoImpl cannot be resolved to a type
         [ERROR] Errors in '<https://builds.apache.org/job/wave-small_tests/ws/wave/src/main/java/org/waveprotocol/box/webclient/client/StagesProvider.java'>
            [ERROR] org.waveprotocol.box.webclient.client.RemoteViewServiceMultiplexer cannot
be resolved to a type
:wave:compileGwt FAILED

FAILURE: Build failed with an exception.

* Where:
Build file '<https://builds.apache.org/job/wave-small_tests/ws/wave/build.gradle'> line:
250

* What went wrong:
Execution failed for task ':wave:compileGwt'.
> Process 'command '/home/jenkins/jenkins-slave/tools/hudson.model.JDK/JDK_1.7_latest_/bin/java''
finished with non-zero exit value 1

* Try:
Run with --stacktrace option to get the stack trace. Run with --info or --debug option to
get more log output.

BUILD FAILED

Total time: 45.999 secs
Build step 'Invoke Gradle script' changed build result to FAILURE
Build step 'Invoke Gradle script' marked build as failure

Mime
View raw message