incubator-wave-commits mailing list archives

Site index · List index
Message view « Date » · « Thread »
Top « Date » · « Thread »
From Apache Jenkins Server <jenk...@builds.apache.org>
Subject Build failed in Jenkins: wave-small_tests #1800
Date Thu, 21 Jul 2011 22:02:39 GMT
See <https://builds.apache.org/job/wave-small_tests/1800/>

------------------------------------------
[...truncated 623 lines...]
    [junit] Tests run: 4, Failures: 0, Errors: 0, Time elapsed: 0.002 sec
    [junit] Running org.waveprotocol.wave.model.document.util.TextLocatorTest
    [junit] Tests run: 2, Failures: 0, Errors: 0, Time elapsed: 0.004 sec
    [junit] Running org.waveprotocol.wave.model.document.util.UndoManagerTest
    [junit] Tests run: 7, Failures: 0, Errors: 0, Time elapsed: 0.015 sec
    [junit] Running org.waveprotocol.wave.model.document.util.XmlStringBuilderTest
    [junit] Tests run: 11, Failures: 0, Errors: 0, Time elapsed: 0.006 sec
    [junit] Running org.waveprotocol.wave.model.experimental.schema.AttributesValidatorTest
    [junit] Tests run: 3, Failures: 0, Errors: 0, Time elapsed: 0.004 sec
    [junit] Running org.waveprotocol.wave.model.experimental.schema.CharacterValidatorTest
    [junit] Tests run: 2, Failures: 0, Errors: 0, Time elapsed: 0.003 sec
    [junit] Running org.waveprotocol.wave.model.experimental.schema.RegularExpressionCheckerTest
    [junit] Tests run: 2, Failures: 0, Errors: 0, Time elapsed: 0.003 sec
    [junit] Running org.waveprotocol.wave.model.experimental.schema.SchemaFactoryTest
    [junit] Tests run: 40, Failures: 0, Errors: 0, Time elapsed: 0.056 sec
    [junit] Running org.waveprotocol.wave.model.id.IdAndNameJavaIoSerializationTest
    [junit] Tests run: 3, Failures: 0, Errors: 0, Time elapsed: 0.006 sec
    [junit] Running org.waveprotocol.wave.model.id.IdFilterTest
    [junit] Tests run: 12, Failures: 0, Errors: 0, Time elapsed: 0.002 sec
    [junit] Running org.waveprotocol.wave.model.id.IdGeneratorTest
    [junit] Tests run: 11, Failures: 0, Errors: 0, Time elapsed: 0.003 sec
    [junit] Running org.waveprotocol.wave.model.id.IdUtilTest
    [junit] Tests run: 15, Failures: 0, Errors: 0, Time elapsed: 0.003 sec
    [junit] Running org.waveprotocol.wave.model.id.LegacyIdSerialiserTest
    [junit] Tests run: 1, Failures: 0, Errors: 0, Time elapsed: 0.001 sec
    [junit] Running org.waveprotocol.wave.model.id.ModernIdSerialiserTest
    [junit] Tests run: 3, Failures: 0, Errors: 0, Time elapsed: 0.001 sec
    [junit] Running org.waveprotocol.wave.model.id.SimplePrefixEscaperTest
    [junit] Tests run: 6, Failures: 0, Errors: 0, Time elapsed: 0.002 sec
    [junit] Running org.waveprotocol.wave.model.id.TokenGeneratorImplTest
    [junit] Tests run: 4, Failures: 0, Errors: 0, Time elapsed: 0.04 sec
    [junit] Running org.waveprotocol.wave.model.id.WaveAndWaveletIdTest
    [junit] Tests run: 6, Failures: 0, Errors: 0, Time elapsed: 0.002 sec
    [junit] Running org.waveprotocol.wave.model.id.WaveIdentifiersTest
    [junit] Tests run: 12, Failures: 0, Errors: 0, Time elapsed: 0.003 sec
    [junit] Running org.waveprotocol.wave.model.id.WaveletNameTest
    [junit] Tests run: 2, Failures: 0, Errors: 0, Time elapsed: 0.001 sec
    [junit] Running org.waveprotocol.wave.model.operation.SilentOperationSinkTest
    [junit] Tests run: 2, Failures: 0, Errors: 0, Time elapsed: 0.001 sec
    [junit] Running org.waveprotocol.wave.model.operation.core.CoreWaveletOperationEqualsTest
    [junit] Tests run: 5, Failures: 0, Errors: 0, Time elapsed: 0.003 sec
    [junit] Running org.waveprotocol.wave.model.operation.core.CoreWaveletOperationTest
    [junit] Tests run: 10, Failures: 0, Errors: 0, Time elapsed: 0.004 sec
    [junit] Running org.waveprotocol.wave.model.operation.testing.RandomTesterTest
    [junit] Tests run: 4, Failures: 0, Errors: 0, Time elapsed: 0.213 sec
    [junit] Running org.waveprotocol.wave.model.operation.testing.StringDomainTest
    [junit] Tests run: 3, Failures: 0, Errors: 0, Time elapsed: 0.121 sec
    [junit] Running org.waveprotocol.wave.model.operation.wave.AddParticipantTest
    [junit] Tests run: 5, Failures: 0, Errors: 0, Time elapsed: 0.002 sec
    [junit] Running org.waveprotocol.wave.model.operation.wave.BlipContentOperationTest
    [junit] Tests run: 2, Failures: 0, Errors: 0, Time elapsed: 0.002 sec
    [junit] Running org.waveprotocol.wave.model.operation.wave.BlipOperationTest
    [junit] Tests run: 7, Failures: 0, Errors: 0, Time elapsed: 0.003 sec
    [junit] Running org.waveprotocol.wave.model.operation.wave.BlipOperationVisitorTest
    [junit] Tests run: 2, Failures: 0, Errors: 0, Time elapsed: 0.001 sec
    [junit] Running org.waveprotocol.wave.model.operation.wave.OperationEqualityTest
    [junit] Tests run: 1, Failures: 0, Errors: 0, Time elapsed: 0.003 sec
    [junit] Running org.waveprotocol.wave.model.operation.wave.ParticipantTransformTest
    [junit] Tests run: 5, Failures: 0, Errors: 0, Time elapsed: 0.001 sec
    [junit] Running org.waveprotocol.wave.model.operation.wave.VersionUpdateOpTest
    [junit] Tests run: 6, Failures: 0, Errors: 0, Time elapsed: 0.002 sec
    [junit] Running org.waveprotocol.wave.model.operation.wave.WaveletOperationTest
    [junit] Tests run: 6, Failures: 0, Errors: 0, Time elapsed: 0.002 sec
    [junit] Running org.waveprotocol.wave.model.operation.wave.WorthyChangeCheckerTest
    [junit] Tests run: 1, Failures: 0, Errors: 0, Time elapsed: 0.002 sec
    [junit] Running org.waveprotocol.wave.model.richtext.RichTextMutationBuilderTest
    [junit] Tests run: 11, Failures: 0, Errors: 0, Time elapsed: 0.012 sec
    [junit] Running org.waveprotocol.wave.model.richtext.RichTextTokenizerImplFirefoxTest
    [junit] Tests run: 22, Failures: 0, Errors: 0, Time elapsed: 0.009 sec
    [junit] Running org.waveprotocol.wave.model.richtext.RichTextTokenizerImplTest
    [junit] Tests run: 18, Failures: 0, Errors: 0, Time elapsed: 0.007 sec
    [junit] Running org.waveprotocol.wave.model.supplement.GadgetStateCollectionTest
    [junit] Tests run: 2, Failures: 0, Errors: 0, Time elapsed: 0.009 sec
    [junit] Running org.waveprotocol.wave.model.supplement.LiveSupplementedWaveImplAbuseTest
    [junit] Tests run: 4, Failures: 0, Errors: 0, Time elapsed: 0.007 sec
    [junit] Running org.waveprotocol.wave.model.supplement.PrimitiveSupplementWithPrimitiveSupplementImplTest
    [junit] Tests run: 8, Failures: 0, Errors: 0, Time elapsed: 0.004 sec
    [junit] Running org.waveprotocol.wave.model.supplement.PrimitiveSupplementWithWaveletBasedSupplementTest
    [junit] Tests run: 8, Failures: 0, Errors: 0, Time elapsed: 0.013 sec
    [junit] Running org.waveprotocol.wave.model.supplement.SimpleWantedEvaluationSetTest
    [junit] Tests run: 1, Failures: 0, Errors: 0, Time elapsed: 0.001 sec
    [junit] Running org.waveprotocol.wave.model.supplement.SupplementedWaveImplTest
    [junit] Tests run: 44, Failures: 0, Errors: 0, Time elapsed: 0.034 sec
    [junit] Running org.waveprotocol.wave.model.supplement.WaveletBasedSupplementTest
    [junit] Tests run: 2, Failures: 0, Errors: 0, Time elapsed: 0.003 sec
    [junit] Running org.waveprotocol.wave.model.testing.RandomProviderImplTest
    [junit] Tests run: 4, Failures: 0, Errors: 0, Time elapsed: 0.008 sec
    [junit] Running org.waveprotocol.wave.model.util.ChainedDataTest
    [junit] Tests run: 5, Failures: 0, Errors: 0, Time elapsed: 0.001 sec
    [junit] Running org.waveprotocol.wave.model.util.CharBase64Test
    [junit] Tests run: 8, Failures: 0, Errors: 0, Time elapsed: 0.005 sec
    [junit] Running org.waveprotocol.wave.model.util.ConcurrentListTest
    [junit] Tests run: 7, Failures: 0, Errors: 0, Time elapsed: 0.002 sec
    [junit] Running org.waveprotocol.wave.model.util.ConcurrentSetTest
    [junit] Tests run: 7, Failures: 0, Errors: 0, Time elapsed: 0.002 sec
    [junit] Running org.waveprotocol.wave.model.util.CopyOnWriteSetTest
    [junit] Tests run: 6, Failures: 0, Errors: 0, Time elapsed: 0.002 sec
    [junit] Running org.waveprotocol.wave.model.util.DefaultDocumentEventRouterTest
    [junit] Tests run: 7, Failures: 0, Errors: 0, Time elapsed: 0.053 sec
    [junit] Running org.waveprotocol.wave.model.util.EvaluableOffsetListTest
    [junit] Tests run: 2, Failures: 0, Errors: 0, Time elapsed: 0.002 sec
    [junit] Running org.waveprotocol.wave.model.util.FilteredViewTest
    [junit] Tests run: 9, Failures: 0, Errors: 0, Time elapsed: 0.003 sec
    [junit] Running org.waveprotocol.wave.model.util.FuzzingBackOffGeneratorTest
    [junit] Tests run: 5, Failures: 0, Errors: 0, Time elapsed: 0.002 sec
    [junit] Running org.waveprotocol.wave.model.util.FuzzingBackOffSchedulerTest
    [junit] Tests run: 4, Failures: 0, Errors: 0, Time elapsed: 0.002 sec
    [junit] Running org.waveprotocol.wave.model.util.ObservableMapImplTest
    [junit] Tests run: 14, Failures: 0, Errors: 0, Time elapsed: 0.003 sec
    [junit] Running org.waveprotocol.wave.model.util.PairTest
    [junit] Tests run: 3, Failures: 0, Errors: 0, Time elapsed: 0.001 sec
    [junit] Running org.waveprotocol.wave.model.util.TitleExtractorTest
    [junit] Tests run: 3, Failures: 0, Errors: 0, Time elapsed: 0.003 sec
    [junit] Running org.waveprotocol.wave.model.util.Utf16UtilTest
    [junit] Tests run: 6, Failures: 0, Errors: 0, Time elapsed: 0.003 sec
    [junit] Running org.waveprotocol.wave.model.util.ValueUtilsTest
    [junit] Tests run: 5, Failures: 0, Errors: 0, Time elapsed: 0.001 sec
    [junit] Running org.waveprotocol.wave.model.version.HashedVersionSerializerTest
    [junit] Tests run: 1, Failures: 0, Errors: 0, Time elapsed: 0.001 sec
    [junit] Running org.waveprotocol.wave.model.version.HashedVersionTest
    [junit] Tests run: 4, Failures: 0, Errors: 0, Time elapsed: 0.001 sec
    [junit] Running org.waveprotocol.wave.model.wave.ParticipantIdTest
    [junit] Tests run: 8, Failures: 0, Errors: 0, Time elapsed: 0.002 sec
    [junit] Running org.waveprotocol.wave.model.wave.ParticipantIdUtilTest
    [junit] Tests run: 8, Failures: 0, Errors: 0, Time elapsed: 0.002 sec
    [junit] Running org.waveprotocol.wave.model.wave.data.impl.DataUtilTest
    [junit] Tests run: 1, Failures: 0, Errors: 0, Time elapsed: 0.005 sec
    [junit] Running org.waveprotocol.wave.model.wave.data.impl.WaveViewDataImplTest
    [junit] Tests run: 5, Failures: 0, Errors: 0, Time elapsed: 0.002 sec
    [junit] Running org.waveprotocol.wave.model.wave.opbased.BlipDataWithBlipDataImplTest
    [junit] Tests run: 10, Failures: 0, Errors: 0, Time elapsed: 0.003 sec
    [junit] Running org.waveprotocol.wave.model.wave.opbased.ObservableWaveletDataWithWaveletDataImplTest
    [junit] Tests run: 12, Failures: 0, Errors: 0, Time elapsed: 0.003 sec
    [junit] Running org.waveprotocol.wave.model.wave.opbased.ObservableWaveletWithOpBasedWaveletTest
    [junit] Tests run: 3, Failures: 0, Errors: 0, Time elapsed: 0.001 sec
    [junit] Running org.waveprotocol.wave.model.wave.opbased.OpBasedWaveletWaveletTest
    [junit] Tests run: 5, Failures: 0, Errors: 0, Time elapsed: 0.002 sec
    [junit] Running org.waveprotocol.wave.model.wave.opbased.OpBasedWaveletWithWaveletDataImplTest
    [junit] Tests run: 7, Failures: 0, Errors: 0, Time elapsed: 0.003 sec
    [junit] Running org.waveprotocol.wave.model.wave.opbased.WaveletDataWithWaveletDataImplTest
    [junit] Tests run: 17, Failures: 0, Errors: 0, Time elapsed: 0.004 sec
    [junit] Running org.waveprotocol.wave.model.wave.undo.UndoManagerFactoryTest
    [junit] Tests run: 9, Failures: 0, Errors: 0, Time elapsed: 0.019 sec
    [junit] Running org.waveprotocol.wave.model.wave.undo.WaveAggregateOpTest
    [junit] Tests run: 2, Failures: 0, Errors: 0, Time elapsed: 0.003 sec
    [junit] Running org.waveprotocol.wave.model.waveref.WaveRefTest
    [junit] Tests run: 4, Failures: 0, Errors: 0, Time elapsed: 0.002 sec
    [junit] Running org.waveprotocol.wave.model.waveref.WaverefEncoderTest
    [junit] Tests run: 10, Failures: 0, Errors: 0, Time elapsed: 0.002 sec
    [junit] Running org.waveprotocol.wave.util.escapers.jvm.JavaUrlCodecTest
    [junit] Tests run: 6, Failures: 0, Errors: 0, Time elapsed: 0.002 sec
    [junit] Running org.waveprotocol.wave.util.logging.LogTest
    [junit] Tests run: 3, Failures: 0, Errors: 0, Time elapsed: 0.005 sec
    [junit] Running org.waveprotocol.box.server.persistence.file.AccountStoreTest
    [junit] Tests run: 7, Failures: 0, Errors: 0, Time elapsed: 0.02 sec
    [junit] Running org.waveprotocol.box.server.persistence.file.AttachmentStoreTest
    [junit] Tests run: 8, Failures: 0, Errors: 0, Time elapsed: 0.006 sec
    [junit] Running org.waveprotocol.box.server.persistence.file.CertPathStoreTest
    [junit] Tests run: 2, Failures: 0, Errors: 0, Time elapsed: 0.003 sec
    [junit] Running org.waveprotocol.box.server.persistence.file.DeltaStoreTest
    [junit] Tests run: 11, Failures: 0, Errors: 0, Time elapsed: 0.249 sec
    [junit] Running org.waveprotocol.box.server.persistence.memory.AccountStoreTest
    [junit] Tests run: 7, Failures: 0, Errors: 0, Time elapsed: 0.002 sec
    [junit] Running org.waveprotocol.box.server.persistence.memory.CertPathStoreTest
    [junit] Tests run: 2, Failures: 0, Errors: 0, Time elapsed: 0.001 sec
    [junit] Running org.waveprotocol.box.server.persistence.memory.DeltaStoreTest
    [junit] Tests run: 10, Failures: 0, Errors: 0, Time elapsed: 0.003 sec
[junitreport] Processing /x1/jenkins/jenkins-slave/workspace/wave-small_tests/test_out/TESTS-TestSuites.xml
to /tmp/null705521047
[junitreport] Loading stylesheet jar:file:/home/hudson/tools/ant/latest/lib/ant-junit.jar!/org/apache/tools/ant/taskdefs/optional/junit/xsl/junit-frames.xsl
[junitreport] Transform time: 11114ms
[junitreport] Deleting: /tmp/null705521047
   [report] 2 file(s) read and merged in 65 ms
   [report] writing [html] report to [/x1/jenkins/jenkins-slave/workspace/wave-small_tests/build/coverage/coverage.html]
...
     [echo] Test results: file:///x1/jenkins/jenkins-slave/workspace/wave-small_tests/test_out/index.html
     [echo] Coverage results: file:///x1/jenkins/jenkins-slave/workspace/wave-small_tests/build/coverage/coverage.html

BUILD SUCCESSFUL
Total time: 55 seconds
[wave-small_tests] $ /home/hudson/tools/ant/latest/bin/ant compile-gwt-dev
Buildfile: /x1/jenkins/jenkins-slave/workspace/wave-small_tests/build.xml

init-logging:
     [echo] Logging to /x1/jenkins/jenkins-slave/workspace/wave-small_tests/build/logs/build_2011-07-21_21-55-30.log

init:

compile-proto-dep:

compile-proto:

gen-gxp-dep:

gen-gxp:

compile-gxp-dep:

compile-gxp:

dist-pst-dep:

dist-pst:

gen-messages-dep:

gen-messages:

compile-messages-dep:

compile-messages:

compile-dep:

compile:

compile-gwt-dev-dep:

compile-gwt-dev:
     [java] Compiling module org.waveprotocol.box.webclient.WebClientDev
     [java] [ERROR] Unexpected
     [java] java.lang.RuntimeException: Unable to write to byte cache
     [java] 	at com.google.gwt.dev.util.DiskCache.writeByteArray(DiskCache.java:202)
     [java] 	at com.google.gwt.dev.javac.CompiledClass.<init>(CompiledClass.java:71)
     [java] 	at com.google.gwt.dev.javac.JdtCompiler$CompilerImpl.createCompiledClass(JdtCompiler.java:214)
     [java] 	at com.google.gwt.dev.javac.JdtCompiler$CompilerImpl.process(JdtCompiler.java:186)
     [java] 	at org.eclipse.jdt.internal.compiler.Compiler.compile(Compiler.java:444)
     [java] 	at com.google.gwt.dev.javac.JdtCompiler.doCompile(JdtCompiler.java:617)
     [java] 	at com.google.gwt.dev.javac.CompilationStateBuilder$CompileMoreLater.compile(CompilationStateBuilder.java:193)
     [java] 	at com.google.gwt.dev.javac.CompilationStateBuilder.doBuildFrom(CompilationStateBuilder.java:390)
     [java] 	at com.google.gwt.dev.javac.CompilationStateBuilder.buildFrom(CompilationStateBuilder.java:275)
     [java] 	at com.google.gwt.dev.cfg.ModuleDef.getCompilationState(ModuleDef.java:299)
     [java] 	at com.google.gwt.dev.Precompile.precompile(Precompile.java:529)
     [java] 	at com.google.gwt.dev.Precompile.precompile(Precompile.java:466)
     [java] 	at com.google.gwt.dev.Compiler.run(Compiler.java:205)
     [java] 	at com.google.gwt.dev.Compiler.run(Compiler.java:177)
     [java] 	at com.google.gwt.dev.Compiler$1.run(Compiler.java:149)
     [java] 	at com.google.gwt.dev.CompileTaskRunner.doRun(CompileTaskRunner.java:87)
     [java] 	at com.google.gwt.dev.CompileTaskRunner.runWithAppropriateLogger(CompileTaskRunner.java:81)
     [java] 	at com.google.gwt.dev.Compiler.main(Compiler.java:156)
     [java] Caused by: java.io.IOException: No space left on device
     [java] 	at java.io.RandomAccessFile.writeBytes(Native Method)
     [java] 	at java.io.RandomAccessFile.write(RandomAccessFile.java:453)
     [java] 	at com.google.gwt.dev.util.DiskCache.writeByteArray(DiskCache.java:199)
     [java] 	... 17 more

BUILD FAILED
/x1/jenkins/jenkins-slave/workspace/wave-small_tests/build.xml:392: Java returned: 1

Total time: 11 seconds
Recording test results


Mime
View raw message