incubator-wave-commits mailing list archives

Site index · List index
Message view « Date » · « Thread »
Top « Date » · « Thread »
From Apache Hudson Server <hud...@hudson.apache.org>
Subject Build failed in Jenkins: wave-small_tests #115
Date Wed, 06 Apr 2011 21:08:54 GMT
See <https://hudson.apache.org/hudson/job/wave-small_tests/115/>

------------------------------------------
[...truncated 551 lines...]
    [junit] Running org.waveprotocol.wave.model.document.indexed.IndexedDocumentImplTest
    [junit] Tests run: 34, Failures: 0, Errors: 0, Time elapsed: 0.149 sec
    [junit] Running org.waveprotocol.wave.model.document.indexed.LocationMapperTest
    [junit] Tests run: 1, Failures: 0, Errors: 0, Time elapsed: 0.001 sec
    [junit] Running org.waveprotocol.wave.model.document.indexed.ObservableIndexedDocumentTest
    [junit] Tests run: 5, Failures: 0, Errors: 0, Time elapsed: 0.011 sec
    [junit] Running org.waveprotocol.wave.model.document.indexed.SimpleAnnotationSetTest
    [junit] Tests run: 18, Failures: 0, Errors: 0, Time elapsed: 0.008 sec
    [junit] Running org.waveprotocol.wave.model.document.operation.CapturingOperationSinkTest
    [junit] Tests run: 4, Failures: 0, Errors: 0, Time elapsed: 0.001 sec
    [junit] Running org.waveprotocol.wave.model.document.operation.DocumentCostFunctionTest
    [junit] Tests run: 4, Failures: 0, Errors: 0, Time elapsed: 0.002 sec
    [junit] Running org.waveprotocol.wave.model.document.operation.algorithm.AnnotationsNormalizerTest
    [junit] Tests run: 7, Failures: 0, Errors: 0, Time elapsed: 0.003 sec
    [junit] Running org.waveprotocol.wave.model.document.operation.algorithm.ComposerTest
    [junit] Tests run: 2, Failures: 0, Errors: 0, Time elapsed: 0.005 sec
    [junit] Running org.waveprotocol.wave.model.document.operation.algorithm.DocOpCollectorTest
    [junit] Tests run: 2, Failures: 0, Errors: 0, Time elapsed: 0.004 sec
    [junit] Running org.waveprotocol.wave.model.document.operation.algorithm.DocOpTransformerTest
    [junit] Tests run: 21, Failures: 0, Errors: 0, Time elapsed: 0.05 sec
    [junit] Running org.waveprotocol.wave.model.document.operation.algorithm.RangeNormalizerTest
    [junit] Tests run: 6, Failures: 0, Errors: 0, Time elapsed: 0.002 sec
    [junit] Running org.waveprotocol.wave.model.document.operation.algorithm.TransformerTest
    [junit] Tests run: 1, Failures: 0, Errors: 0, Time elapsed: 0.001 sec
    [junit] Running org.waveprotocol.wave.model.document.operation.impl.DocOpUtilTest
    [junit] Tests run: 1, Failures: 0, Errors: 0, Time elapsed: 0.002 sec
    [junit] Running org.waveprotocol.wave.model.document.operation.impl.DocOpValidatorTest
    [junit] Tests run: 16, Failures: 0, Errors: 0, Time elapsed: 0.01 sec
    [junit] Running org.waveprotocol.wave.model.document.operation.util.ImmutableStateMapTest
    [junit] Tests run: 4, Failures: 0, Errors: 0, Time elapsed: 0.002 sec
    [junit] Running org.waveprotocol.wave.model.document.operation.util.ImmutableUpdateMapTest
    [junit] Tests run: 1, Failures: 0, Errors: 0, Time elapsed: 0.001 sec
    [junit] Running org.waveprotocol.wave.model.document.parser.AnnotationParserTest
    [junit] Tests run: 2, Failures: 0, Errors: 0, Time elapsed: 0.003 sec
    [junit] Running org.waveprotocol.wave.model.document.parser.ParserTest
    [junit] Tests run: 10, Failures: 0, Errors: 0, Time elapsed: 0.005 sec
    [junit] Running org.waveprotocol.wave.model.document.util.AnnotationRegistryTest
    [junit] Tests run: 5, Failures: 0, Errors: 0, Time elapsed: 0.002 sec
    [junit] Running org.waveprotocol.wave.model.document.util.AnnotationsTest
    [junit] Tests run: 3, Failures: 0, Errors: 0, Time elapsed: 0.004 sec
    [junit] Running org.waveprotocol.wave.model.document.util.DocCompareTest
    [junit] Tests run: 2, Failures: 0, Errors: 0, Time elapsed: 0.009 sec
    [junit] Running org.waveprotocol.wave.model.document.util.DocHelperTest
    [junit] Tests run: 27, Failures: 0, Errors: 0, Time elapsed: 0.037 sec
    [junit] Running org.waveprotocol.wave.model.document.util.DocIterateTest
    [junit] Tests run: 5, Failures: 0, Errors: 0, Time elapsed: 0.006 sec
    [junit] Running org.waveprotocol.wave.model.document.util.DocOpScrubTest
    [junit] Tests run: 1, Failures: 0, Errors: 0, Time elapsed: 0.003 sec
    [junit] Running org.waveprotocol.wave.model.document.util.DomOperationUtilTest
    [junit] Tests run: 4, Failures: 0, Errors: 0, Time elapsed: 0.002 sec
    [junit] Running org.waveprotocol.wave.model.document.util.ElementHandlerRegistryTest
    [junit] Tests run: 4, Failures: 0, Errors: 0, Time elapsed: 0.007 sec
    [junit] Running org.waveprotocol.wave.model.document.util.GenericAnnotationIntervalIterableTest
    [junit] Tests run: 2, Failures: 0, Errors: 0, Time elapsed: 0.003 sec
    [junit] Running org.waveprotocol.wave.model.document.util.GenericRangedAnnotationIterableTest
    [junit] Tests run: 2, Failures: 0, Errors: 0, Time elapsed: 0.002 sec
    [junit] Running org.waveprotocol.wave.model.document.util.LineContainersTest
    [junit] Tests run: 17, Failures: 0, Errors: 0, Time elapsed: 0.032 sec
    [junit] Running org.waveprotocol.wave.model.document.util.RangeTrackerTest
    [junit] Tests run: 7, Failures: 0, Errors: 0, Time elapsed: 0.005 sec
    [junit] Running org.waveprotocol.wave.model.document.util.RawElementStyleViewTest
    [junit] Tests run: 4, Failures: 0, Errors: 0, Time elapsed: 0.002 sec
    [junit] Running org.waveprotocol.wave.model.document.util.ReadableTreeWalkerTest
    [junit] Tests run: 8, Failures: 0, Errors: 0, Time elapsed: 0.004 sec
    [junit] Running org.waveprotocol.wave.model.document.util.TextExtractorTest
    [junit] Tests run: 4, Failures: 0, Errors: 0, Time elapsed: 0.002 sec
    [junit] Running org.waveprotocol.wave.model.document.util.TextLocatorTest
    [junit] Tests run: 2, Failures: 0, Errors: 0, Time elapsed: 0.004 sec
    [junit] Running org.waveprotocol.wave.model.document.util.UndoManagerTest
    [junit] Tests run: 7, Failures: 0, Errors: 0, Time elapsed: 0.021 sec
    [junit] Running org.waveprotocol.wave.model.document.util.XmlStringBuilderTest
    [junit] Tests run: 11, Failures: 0, Errors: 0, Time elapsed: 0.008 sec
    [junit] Running org.waveprotocol.wave.model.experimental.schema.AttributesValidatorTest
    [junit] Tests run: 3, Failures: 0, Errors: 0, Time elapsed: 0.005 sec
    [junit] Running org.waveprotocol.wave.model.experimental.schema.CharacterValidatorTest
    [junit] Tests run: 2, Failures: 0, Errors: 0, Time elapsed: 0.003 sec
    [junit] Running org.waveprotocol.wave.model.experimental.schema.RegularExpressionCheckerTest
    [junit] Tests run: 2, Failures: 0, Errors: 0, Time elapsed: 0.004 sec
    [junit] Running org.waveprotocol.wave.model.experimental.schema.SchemaFactoryTest
    [junit] Tests run: 40, Failures: 0, Errors: 0, Time elapsed: 0.072 sec
    [junit] Running org.waveprotocol.wave.model.id.IdAndNameJavaIoSerializationTest
    [junit] Tests run: 3, Failures: 0, Errors: 0, Time elapsed: 0.007 sec
    [junit] Running org.waveprotocol.wave.model.id.IdFilterTest
    [junit] Tests run: 12, Failures: 0, Errors: 0, Time elapsed: 0.004 sec
    [junit] Running org.waveprotocol.wave.model.id.IdGeneratorTest
    [junit] Tests run: 11, Failures: 0, Errors: 0, Time elapsed: 0.003 sec
    [junit] Running org.waveprotocol.wave.model.id.IdUtilTest
    [junit] Tests run: 15, Failures: 0, Errors: 0, Time elapsed: 0.004 sec
    [junit] Running org.waveprotocol.wave.model.id.LegacyIdSerialiserTest
    [junit] Tests run: 1, Failures: 0, Errors: 0, Time elapsed: 0.001 sec
    [junit] Running org.waveprotocol.wave.model.id.ModernIdSerialiserTest
    [junit] Tests run: 3, Failures: 0, Errors: 0, Time elapsed: 0.002 sec
    [junit] Running org.waveprotocol.wave.model.id.SimplePrefixEscaperTest
    [junit] Tests run: 6, Failures: 0, Errors: 0, Time elapsed: 0.002 sec
    [junit] Running org.waveprotocol.wave.model.id.TokenGeneratorImplTest
    [junit] Tests run: 4, Failures: 1, Errors: 0, Time elapsed: 0.057 sec
    [junit] TEST org.waveprotocol.wave.model.id.TokenGeneratorImplTest FAILED
    [junit] Running org.waveprotocol.wave.model.id.WaveAndWaveletIdTest
    [junit] Tests run: 6, Failures: 0, Errors: 0, Time elapsed: 0.002 sec
    [junit] Running org.waveprotocol.wave.model.id.WaveIdentifiersTest
    [junit] Tests run: 12, Failures: 0, Errors: 0, Time elapsed: 0.004 sec
    [junit] Running org.waveprotocol.wave.model.id.WaveletNameTest
    [junit] Tests run: 2, Failures: 0, Errors: 0, Time elapsed: 0.002 sec
    [junit] Running org.waveprotocol.wave.model.operation.SilentOperationSinkTest
    [junit] Tests run: 2, Failures: 0, Errors: 0, Time elapsed: 0.002 sec
    [junit] Running org.waveprotocol.wave.model.operation.core.CoreWaveletOperationEqualsTest
    [junit] Tests run: 5, Failures: 0, Errors: 0, Time elapsed: 0.004 sec
    [junit] Running org.waveprotocol.wave.model.operation.core.CoreWaveletOperationTest
    [junit] Tests run: 10, Failures: 0, Errors: 0, Time elapsed: 0.005 sec
    [junit] Running org.waveprotocol.wave.model.operation.testing.RandomTesterTest
    [junit] Tests run: 4, Failures: 0, Errors: 0, Time elapsed: 0.286 sec
    [junit] Running org.waveprotocol.wave.model.operation.testing.StringDomainTest
    [junit] Tests run: 3, Failures: 0, Errors: 0, Time elapsed: 0.17 sec
    [junit] Running org.waveprotocol.wave.model.operation.wave.AddParticipantTest
    [junit] Tests run: 5, Failures: 0, Errors: 0, Time elapsed: 0.003 sec
    [junit] Running org.waveprotocol.wave.model.operation.wave.BlipContentOperationTest
    [junit] Tests run: 2, Failures: 0, Errors: 0, Time elapsed: 0.002 sec
    [junit] Running org.waveprotocol.wave.model.operation.wave.BlipOperationTest
    [junit] Tests run: 7, Failures: 0, Errors: 0, Time elapsed: 0.004 sec
    [junit] Running org.waveprotocol.wave.model.operation.wave.BlipOperationVisitorTest
    [junit] Tests run: 2, Failures: 0, Errors: 0, Time elapsed: 0.002 sec
    [junit] Running org.waveprotocol.wave.model.operation.wave.OperationEqualityTest
    [junit] Tests run: 1, Failures: 0, Errors: 0, Time elapsed: 0.004 sec
    [junit] Running org.waveprotocol.wave.model.operation.wave.ParticipantTransformTest
    [junit] Tests run: 5, Failures: 0, Errors: 0, Time elapsed: 0.002 sec
    [junit] Running org.waveprotocol.wave.model.operation.wave.VersionUpdateOpTest
    [junit] Tests run: 6, Failures: 0, Errors: 0, Time elapsed: 0.003 sec
    [junit] Running org.waveprotocol.wave.model.operation.wave.WaveletOperationTest
    [junit] Tests run: 6, Failures: 0, Errors: 0, Time elapsed: 0.002 sec
    [junit] Running org.waveprotocol.wave.model.operation.wave.WorthyChangeCheckerTest
    [junit] Tests run: 1, Failures: 0, Errors: 0, Time elapsed: 0.002 sec
    [junit] Running org.waveprotocol.wave.model.richtext.RichTextMutationBuilderTest
    [junit] Tests run: 11, Failures: 0, Errors: 0, Time elapsed: 0.016 sec
    [junit] Running org.waveprotocol.wave.model.richtext.RichTextTokenizerImplFirefoxTest
    [junit] Tests run: 22, Failures: 0, Errors: 0, Time elapsed: 0.011 sec
    [junit] Running org.waveprotocol.wave.model.richtext.RichTextTokenizerImplTest
    [junit] Tests run: 18, Failures: 0, Errors: 0, Time elapsed: 0.008 sec
    [junit] Running org.waveprotocol.wave.model.supplement.GadgetStateCollectionTest
    [junit] Tests run: 2, Failures: 0, Errors: 0, Time elapsed: 0.011 sec
    [junit] Running org.waveprotocol.wave.model.supplement.LiveSupplementedWaveImplAbuseTest
    [junit] Tests run: 4, Failures: 0, Errors: 0, Time elapsed: 0.01 sec
    [junit] Running org.waveprotocol.wave.model.supplement.PrimitiveSupplementWithPrimitiveSupplementImplTest
    [junit] Tests run: 8, Failures: 0, Errors: 0, Time elapsed: 0.005 sec
    [junit] Running org.waveprotocol.wave.model.supplement.PrimitiveSupplementWithWaveletBasedSupplementTest
    [junit] Tests run: 8, Failures: 0, Errors: 0, Time elapsed: 0.016 sec
    [junit] Running org.waveprotocol.wave.model.supplement.SimpleWantedEvaluationSetTest
    [junit] Tests run: 1, Failures: 0, Errors: 0, Time elapsed: 0.001 sec
    [junit] Running org.waveprotocol.wave.model.supplement.SupplementedWaveImplTest
    [junit] Tests run: 44, Failures: 0, Errors: 0, Time elapsed: 0.041 sec
    [junit] Running org.waveprotocol.wave.model.supplement.WaveletBasedSupplementTest
    [junit] Tests run: 2, Failures: 0, Errors: 0, Time elapsed: 0.005 sec
    [junit] Running org.waveprotocol.wave.model.testing.RandomProviderImplTest
    [junit] Tests run: 4, Failures: 0, Errors: 0, Time elapsed: 0.012 sec
    [junit] Running org.waveprotocol.wave.model.util.ChainedDataTest
    [junit] Tests run: 5, Failures: 0, Errors: 0, Time elapsed: 0.003 sec
    [junit] Running org.waveprotocol.wave.model.util.CharBase64Test
    [junit] Tests run: 8, Failures: 0, Errors: 0, Time elapsed: 0.006 sec
    [junit] Running org.waveprotocol.wave.model.util.ConcurrentListTest
    [junit] Tests run: 7, Failures: 0, Errors: 0, Time elapsed: 0.003 sec
    [junit] Running org.waveprotocol.wave.model.util.ConcurrentSetTest
    [junit] Tests run: 7, Failures: 0, Errors: 0, Time elapsed: 0.002 sec
    [junit] Running org.waveprotocol.wave.model.util.CopyOnWriteSetTest
    [junit] Tests run: 6, Failures: 0, Errors: 0, Time elapsed: 0.002 sec
    [junit] Running org.waveprotocol.wave.model.util.DefaultDocumentEventRouterTest
    [junit] Tests run: 7, Failures: 0, Errors: 0, Time elapsed: 0.066 sec
    [junit] Running org.waveprotocol.wave.model.util.EvaluableOffsetListTest
    [junit] Tests run: 2, Failures: 0, Errors: 0, Time elapsed: 0.002 sec
    [junit] Running org.waveprotocol.wave.model.util.FilteredViewTest
    [junit] Tests run: 9, Failures: 0, Errors: 0, Time elapsed: 0.005 sec
    [junit] Running org.waveprotocol.wave.model.util.FuzzingBackOffGeneratorTest
    [junit] Tests run: 5, Failures: 0, Errors: 0, Time elapsed: 0.003 sec
    [junit] Running org.waveprotocol.wave.model.util.FuzzingBackOffSchedulerTest
    [junit] Tests run: 4, Failures: 0, Errors: 0, Time elapsed: 0.004 sec
    [junit] Running org.waveprotocol.wave.model.util.ObservableMapImplTest
    [junit] Tests run: 14, Failures: 0, Errors: 0, Time elapsed: 0.004 sec
    [junit] Running org.waveprotocol.wave.model.util.PairTest
    [junit] Tests run: 3, Failures: 0, Errors: 0, Time elapsed: 0.002 sec
    [junit] Running org.waveprotocol.wave.model.util.TitleExtractorTest
    [junit] Tests run: 3, Failures: 0, Errors: 0, Time elapsed: 0.004 sec
    [junit] Running org.waveprotocol.wave.model.util.Utf16UtilTest
    [junit] Tests run: 6, Failures: 0, Errors: 0, Time elapsed: 0.003 sec
    [junit] Running org.waveprotocol.wave.model.util.ValueUtilsTest
    [junit] Tests run: 5, Failures: 0, Errors: 0, Time elapsed: 0.002 sec
    [junit] Running org.waveprotocol.wave.model.version.HashedVersionSerializerTest
    [junit] Tests run: 1, Failures: 0, Errors: 0, Time elapsed: 0.001 sec
    [junit] Running org.waveprotocol.wave.model.version.HashedVersionTest
    [junit] Tests run: 4, Failures: 0, Errors: 0, Time elapsed: 0.001 sec
    [junit] Running org.waveprotocol.wave.model.wave.ParticipantIdTest
    [junit] Tests run: 8, Failures: 0, Errors: 0, Time elapsed: 0.003 sec
    [junit] Running org.waveprotocol.wave.model.wave.ParticipantIdUtilTest
    [junit] Tests run: 8, Failures: 0, Errors: 0, Time elapsed: 0.002 sec
    [junit] Running org.waveprotocol.wave.model.wave.data.impl.DataUtilTest
    [junit] Tests run: 1, Failures: 0, Errors: 0, Time elapsed: 0.008 sec
    [junit] Running org.waveprotocol.wave.model.wave.data.impl.WaveViewDataImplTest
    [junit] Tests run: 5, Failures: 0, Errors: 0, Time elapsed: 0.002 sec
    [junit] Running org.waveprotocol.wave.model.wave.opbased.BlipDataWithBlipDataImplTest
    [junit] Tests run: 10, Failures: 0, Errors: 0, Time elapsed: 0.003 sec
    [junit] Running org.waveprotocol.wave.model.wave.opbased.ObservableWaveletDataWithWaveletDataImplTest
    [junit] Tests run: 12, Failures: 0, Errors: 0, Time elapsed: 0.005 sec
    [junit] Running org.waveprotocol.wave.model.wave.opbased.ObservableWaveletWithOpBasedWaveletTest
    [junit] Tests run: 3, Failures: 0, Errors: 0, Time elapsed: 0.002 sec
    [junit] Running org.waveprotocol.wave.model.wave.opbased.OpBasedWaveletWaveletTest
    [junit] Tests run: 5, Failures: 0, Errors: 0, Time elapsed: 0.003 sec
    [junit] Running org.waveprotocol.wave.model.wave.opbased.OpBasedWaveletWithWaveletDataImplTest
    [junit] Tests run: 7, Failures: 0, Errors: 0, Time elapsed: 0.006 sec
    [junit] Running org.waveprotocol.wave.model.wave.opbased.WaveletDataWithWaveletDataImplTest
    [junit] Tests run: 17, Failures: 0, Errors: 0, Time elapsed: 0.005 sec
    [junit] Running org.waveprotocol.wave.model.wave.undo.UndoManagerFactoryTest
    [junit] Tests run: 9, Failures: 0, Errors: 0, Time elapsed: 0.021 sec
    [junit] Running org.waveprotocol.wave.model.wave.undo.WaveAggregateOpTest
    [junit] Tests run: 2, Failures: 0, Errors: 0, Time elapsed: 0.003 sec
    [junit] Running org.waveprotocol.wave.model.waveref.WaveRefTest
    [junit] Tests run: 4, Failures: 0, Errors: 0, Time elapsed: 0.002 sec
    [junit] Running org.waveprotocol.wave.model.waveref.WaverefEncoderTest
    [junit] Tests run: 10, Failures: 0, Errors: 0, Time elapsed: 0.004 sec
    [junit] Running org.waveprotocol.wave.util.escapers.jvm.JavaUrlCodecTest
    [junit] Tests run: 6, Failures: 0, Errors: 0, Time elapsed: 0.003 sec
    [junit] Running org.waveprotocol.wave.util.logging.LogTest
    [junit] Tests run: 3, Failures: 0, Errors: 0, Time elapsed: 0.008 sec
    [junit] Running org.waveprotocol.box.server.persistence.file.AccountStoreTest
    [junit] Tests run: 7, Failures: 0, Errors: 0, Time elapsed: 0.026 sec
    [junit] Running org.waveprotocol.box.server.persistence.file.AttachmentStoreTest
    [junit] Tests run: 8, Failures: 0, Errors: 0, Time elapsed: 0.008 sec
    [junit] Running org.waveprotocol.box.server.persistence.file.CertPathStoreTest
    [junit] Tests run: 2, Failures: 0, Errors: 0, Time elapsed: 0.004 sec
    [junit] Running org.waveprotocol.box.server.persistence.file.DeltaStoreTest
    [junit] Tests run: 11, Failures: 0, Errors: 0, Time elapsed: 0.334 sec
    [junit] Running org.waveprotocol.box.server.persistence.memory.AccountStoreTest
    [junit] Tests run: 7, Failures: 0, Errors: 0, Time elapsed: 0.003 sec
    [junit] Running org.waveprotocol.box.server.persistence.memory.CertPathStoreTest
    [junit] Tests run: 2, Failures: 0, Errors: 0, Time elapsed: 0.002 sec
    [junit] Running org.waveprotocol.box.server.persistence.memory.DeltaStoreTest
    [junit] Tests run: 10, Failures: 0, Errors: 0, Time elapsed: 0.004 sec
    [junit] Tests FAILED
[junitreport] Processing <https://hudson.apache.org/hudson/job/wave-small_tests/ws/test_out/TESTS-TestSuites.xml>
to /tmp/null76525549
[junitreport] Loading stylesheet jar:file:/home/hudson/tools/ant/latest/lib/ant-junit.jar!/org/apache/tools/ant/taskdefs/optional/junit/xsl/junit-frames.xsl
[junitreport] Transform time: 17107ms
[junitreport] Deleting: /tmp/null76525549
   [report] 2 file(s) read and merged in 85 ms
   [report] writing [html] report to [<https://hudson.apache.org/hudson/job/wave-small_tests/ws/build/coverage/coverage.html]>
...
     [echo] Test results: file://<https://hudson.apache.org/hudson/job/wave-small_tests/ws/test_out/index.html>
     [echo] Coverage results: file://<https://hudson.apache.org/hudson/job/wave-small_tests/ws/build/coverage/coverage.html>

BUILD FAILED
<https://hudson.apache.org/hudson/job/wave-small_tests/ws/build.xml>:281: The following
error occurred while executing this line:
<https://hudson.apache.org/hudson/job/wave-small_tests/ws/build-macros.xml>:165: Tests
failed. Check log and/or reports: <https://hudson.apache.org/hudson/job/wave-small_tests/ws/test_out/index.html>

Total time: 1 minute 6 seconds
Recording test results


Mime
View raw message