incubator-vxquery-dev mailing list archives

Site index · List index
Message view « Date » · « Thread »
Top « Date » · « Thread »
From Vinayak Borkar <vbo...@yahoo.com>
Subject Re: build failure
Date Sun, 08 Jul 2012 06:12:10 GMT
Oops, sorry. Done.


On 7/7/12 10:28 PM, Till Westmann wrote:
> Hi Vinayak,
>
> it seems that r1358647 uses 2 new methods in ArrayBackedValueStorage that are not yet
available in the Hyracks svn:
>
> [ERROR] Failed to execute goal org.apache.maven.plugins:maven-compiler-plugin:2.3.2:compile
(default-compile) on project vxquery-core: Compilation failure: Compilation failure:
> [ERROR] /Users/tillw/code/vxquery/branches/vxquery_algebricks/vxquery-core/src/main/java/org/apache/vxquery/context/DynamicContextImplFactory.java:[65,16]
cannot find symbol
> [ERROR] symbol  : method append(edu.uci.ics.hyracks.dataflow.common.data.accessors.ArrayBackedValueStorage)
> [ERROR] location: class edu.uci.ics.hyracks.dataflow.common.data.accessors.ArrayBackedValueStorage
> [ERROR] /Users/tillw/code/vxquery/branches/vxquery_algebricks/vxquery-core/src/main/java/org/apache/vxquery/context/DynamicContextImpl.java:[52,23]
cannot find symbol
> [ERROR] symbol  : method assign(edu.uci.ics.hyracks.data.std.api.IValueReference)
> [ERROR] location: class edu.uci.ics.hyracks.dataflow.common.data.accessors.ArrayBackedValueStorage
> [ERROR] /Users/tillw/code/vxquery/branches/vxquery_algebricks/vxquery-core/src/main/java/org/apache/vxquery/context/DynamicContextImpl.java:[67,12]
cannot find symbol
> [ERROR] symbol  : method assign(edu.uci.ics.hyracks.data.std.api.IValueReference)
> [ERROR] location: class edu.uci.ics.hyracks.dataflow.common.data.accessors.ArrayBackedValueStorage
> [ERROR] -> [Help 1]
>
> Could you submit those to Hyracks?
>
> Thanks,
> Till
>



Mime
View raw message