incubator-stdcxx-dev mailing list archives

Site index · List index
Message view « Date » · « Thread »
Top « Date » · « Thread »
From "Jeremy Dean" <Jeremy.D...@roguewave.com>
Subject Problem installing/configuration
Date Wed, 17 Sep 2008 14:45:58 GMT
Hi team,
 
I have a customer that is trying to build with the Apache Standard
library on HPUX and is getting the follow error:
 
I can't even build the makefiles for the standard library.  Here's the
tail end of the make clean and then the configuring for the standard
library:
 

gmake[1]: Leaving directory `/home/kr3948/rw/0902/stdcxx/12d/examples'
gmake: Leaving directory `/home/kr3948/rw/0902/stdcxx/12d'
### Configuring
gmake: Entering directory `/home/kr3948/rw/0902/stdcxx/12d'
gmake[1]: Entering directory `/home/kr3948/rw/0902/stdcxx/12d/include'
gmake config
gmake[2]: Entering directory `/home/kr3948/rw/0902/stdcxx/12d/include'
/bin/sh: Syntax error at line 1 : `)' is not expected.
gmake[2]: *** [sane] Error 2
gmake[2]: Leaving directory `/home/kr3948/rw/0902/stdcxx/12d/include'
gmake[1]: *** [config.h] Error 2
gmake[1]: Leaving directory `/home/kr3948/rw/0902/stdcxx/12d/include'
gmake: *** [config] Error 2
gmake: Leaving directory `/home/kr3948/rw/0902/stdcxx/12d'
done building library 'stdlib-library'

 
Any suggestions as to what might the problem, what we would need to
further diagnose the problem?
 
Thanks,
 
Jeremy
 
Jeremy Dean 
Rogue Wave Software, Inc.
Technical Support 
Phone: 303-545-3205 -- 1-800-404-4767 
E-mail: support@roguewave.com 
Web: http://www.roguewave.com/support 
Knowledge Base entries: 
http://www.roguewave.com/kbdocs/search.html 
View issues online at: 
http://www.roguewave.com/youraccount/login/

Mime
  • Unnamed multipart/alternative (inline, None, 0 bytes)
View raw message