incubator-stdcxx-dev mailing list archives

Site index · List index
Message view « Date » · « Thread »
Top « Date » · « Thread »
From "Martin Sebor (JIRA)" <j...@apache.org>
Subject [jira] Created: (STDCXX-614) [gcc 4.1/Linux] error on size_t in 27.stringbuf.xsputn.stdcxx-515.cpp
Date Wed, 24 Oct 2007 20:13:51 GMT
[gcc 4.1/Linux] error on size_t in 27.stringbuf.xsputn.stdcxx-515.cpp
---------------------------------------------------------------------

                 Key: STDCXX-614
                 URL: https://issues.apache.org/jira/browse/STDCXX-614
             Project: C++ Standard Library
          Issue Type: Bug
          Components: Tests
    Affects Versions: 4.2
         Environment: gcc 4.1.1 on Red Hat Enterprise Linux Server release 5 (Tikanga)
            Reporter: Martin Sebor
            Priority: Minor
             Fix For: 4.2.1


The 27.stringbuf.xsputn.stdcxx-515.cpp fails to compile with gcc 4.1.1 on  Red Hat Enterprise
Linux Server release 5 with the error below:

gcc -c -I$(TOPDIR)/include/ansi -D_RWSTDDEBUG    -I$(TOPDIR)/include -I$(BUILDDIR)/include
-I$(TOPDIR)/tests/include  -pedantic -nostdinc++ -g   -W -Wall -Wcast-qual -Winline -Wshadow
-Wwrite-strings -Wno-long-long -Wcast-align   $(TOPDIR)/tests/regress/27.stringbuf.xsputn.stdcxx-515.cpp
$(TOPDIR)/tests/regress/27.stringbuf.xsputn.stdcxx-515.cpp: In function 'int main()':
$(TOPDIR)/tests/regress/27.stringbuf.xsputn.stdcxx-515.cpp:33: error: 'size_t' was not declared
in this scope
$(TOPDIR)/tests/regress/27.stringbuf.xsputn.stdcxx-515.cpp:33: error: expected `;' before
'i'
$(TOPDIR)/tests/regress/27.stringbuf.xsputn.stdcxx-515.cpp:33: error: 'i' was not declared
in this scope
gmake: *** [27.stringbuf.xsputn.stdcxx-515.o] Error 1


-- 
This message is automatically generated by JIRA.
-
You can reply to this email to add a comment to the issue online.


Mime
View raw message