incubator-stdcxx-dev mailing list archives

Site index · List index
Message view « Date » · « Thread »
Top « Date » · « Thread »
From "Farid Zaripov (JIRA)" <j...@apache.org>
Subject [jira] Commented: (STDCXX-353) [Cygwin] localedef errors: UCS value of symbolic character out of range
Date Tue, 05 Jun 2007 18:46:26 GMT

    [ https://issues.apache.org/jira/browse/STDCXX-353?page=com.atlassian.jira.plugin.system.issuetabpanels:comment-tabpanel#action_12501653
] 

Farid Zaripov commented on STDCXX-353:
--------------------------------------

zh_CN.GB18030 and zh_TW.EUC-TW are built successfully, but now ar_IN.UTF-8, de_DE.UTF-8 and
en_IN.UTF-8 locales are failed:

   5437 [main] localedef 3260 d:\_projects\stdcxx_working\cygwin_15s\bin\localedef.exe: ***
fatal error - could not load shell32, Win32 error 487
/bin/sh: line 5:  3260 Hangup                  ./localedef -w -c -f /cygdrive/d/_projects/stdcxx_working/etc/nls/charmaps/$cname
-i /cygdrive/d/_projects/stdcxx_working/etc/nls/src/$lname /cygdrive/d/_projects/stdcxx_working/cygwin_15s/nls/ar_IN.UTF-8
make: *** [ar_IN.UTF-8] Error 129
      5 [main] localedef 3444 d:\_projects\stdcxx_working\cygwin_15s\bin\localedef.exe: ***
fatal error - could not load shell32, Win32 error 487
/bin/sh: line 5:  3444 Hangup                  ./localedef -w -c -f /cygdrive/d/_projects/stdcxx_working/etc/nls/charmaps/$cname
-i /cygdrive/d/_projects/stdcxx_working/etc/nls/src/$lname /cygdrive/d/_projects/stdcxx_working/cygwin_15s/nls/de_DE.UTF-8
make: *** [de_DE.UTF-8] Error 129
      5 [main] localedef 3952 d:\_projects\stdcxx_working\cygwin_15s\bin\localedef.exe: ***
fatal error - could not load shell32, Win32 error 487
/bin/sh: line 5:  3952 Hangup                  ./localedef -w -c -f /cygdrive/d/_projects/stdcxx_working/etc/nls/charmaps/$cname
-i /cygdrive/d/_projects/stdcxx_working/etc/nls/src/$lname /cygdrive/d/_projects/stdcxx_working/cygwin_15s/nls/en_IN.UTF-8
make: *** [en_IN.UTF-8] Error 129


> [Cygwin] localedef errors: UCS value of symbolic character out of range
> -----------------------------------------------------------------------
>
>                 Key: STDCXX-353
>                 URL: https://issues.apache.org/jira/browse/STDCXX-353
>             Project: C++ Standard Library
>          Issue Type: Bug
>          Components: Locales
>    Affects Versions: 4.1.3
>         Environment: Cygwin
>            Reporter: Mark Brown
>            Assignee: Farid Zaripov
>
> On Cygwin, locale successfully builds all locales except zh_CN.GB18030 and zh_TW.EUC-TW:
> $ nice make -C../bin locales -k
> make: Entering directory `/home/mbrown/stdcxx-gcc-4.1.1-15s/bin'
> ./localedef -w -c -f /home/mbrown/stdcxx/etc/nls/charmaps/GB18030 -i /home/mbrown/stdcxx/etc/nls/src/zh_CN
/home/mbrown/stdcxx-gcc-4.1.1-15s/nls/zh_CN.GB18030
> Error 315: UCS value 66304 of symbolic character <U00010300> out of range.
> make: *** [zh_CN.GB18030] Error 4
> ./localedef -w -c -f /home/mbrown/stdcxx/etc/nls/charmaps/EUC-TW -i /home/mbrown/stdcxx/etc/nls/src/zh_TW
/home/mbrown/stdcxx-gcc-4.1.1-15s/nls/zh_TW.EUC-TW
> Error 315: UCS value 131083 of symbolic character <U0002000B> out of range.
> make: *** [zh_TW.EUC-TW] Error 4
> make: Target `locales' not remade because of errors.
> make: Leaving directory `/home/mbrown/stdcxx-gcc-4.1.1-15s/bin'

-- 
This message is automatically generated by JIRA.
-
You can reply to this email to add a comment to the issue online.


Mime
View raw message