incubator-stdcxx-dev mailing list archives

Site index · List index
Message view « Date » · « Thread »
Top « Date » · « Thread »
From "Martin Sebor (JIRA)" <j...@apache.org>
Subject [jira] Assigned: (STDCXX-393) [eccp 3.9/Linux] error on incomplete struct lconv in <locale.h>
Date Tue, 10 Apr 2007 23:00:32 GMT

     [ https://issues.apache.org/jira/browse/STDCXX-393?page=com.atlassian.jira.plugin.system.issuetabpanels:all-tabpanel
]

Martin Sebor reassigned STDCXX-393:
-----------------------------------

    Assignee: Martin Sebor

> [eccp 3.9/Linux] error on incomplete struct lconv in <locale.h>
> ---------------------------------------------------------------
>
>                 Key: STDCXX-393
>                 URL: https://issues.apache.org/jira/browse/STDCXX-393
>             Project: C++ Standard Library
>          Issue Type: Bug
>          Components: Build
>    Affects Versions: 4.2
>         Environment: eccp 3.9/Fedora Core 6
>            Reporter: Martin Sebor
>         Assigned To: Martin Sebor
>            Priority: Critical
>
> After fixing STDCXX-392 the latest trunk now fails to compile with EDG eccp 3.9 on Fedora
Core 6 (gcc 4.1.1 back end) with the error below:
> $ nice make BUILDTYPE=11s BUILDDIR=/build/sebor/stdcxx-eccp-3.9-11s CONFIG=eccp.config
> creating BUILDDIR=/build/sebor/stdcxx-eccp-3.9-11s
> generating /build/sebor/stdcxx-eccp-3.9-11s/makefile.in from /home/sebor/stdcxx-trunk/etc/config/eccp.config
> make[1]: Entering directory `/build/sebor/stdcxx-eccp-3.9-11s'
> make[2]: Entering directory `/build/sebor/stdcxx-eccp-3.9-11s/include'
> make config
> make[3]: Entering directory `/build/sebor/stdcxx-eccp-3.9-11s/include'
> configuring for eccp-3.9 on linux-2.6.18-1.2798.fc6-x86_64
> checking if the compiler is sane ok (invoked with eccp)
> checking if the linker is sane ok (invoked with eccp)
> checking system architecture ILP32 little endian
> ...
> make[2]: Leaving directory `/build/sebor/stdcxx-eccp-3.9-11s/lib'
> make[2]: Entering directory `/build/sebor/stdcxx-eccp-3.9-11s/lib' 
> ...
> eccp -c -I/home/sebor/stdcxx-trunk/include/ansi -D_RWSTDDEBUG    -I/home/sebor/stdcxx-trunk/include
-I/build/sebor/stdcxx-eccp-3.9-11s/include  -A -x --template_directory=/build/sebor/stdcxx-eccp-3.9-11s/lib
-g   --display_error_number --remarks --diag_suppress 193,236,340,401,261,479,487,678,679,815
   /home/sebor/stdcxx-trunk/src/codecvt.cpp
> "/home/sebor/stdcxx-trunk/include/ansi/_clocale.h", line 64: error #70: 
>           incomplete type is not allowed
>   struct lconv _RWSTD_LCONV;
>                ^
> 1 error detected in the compilation of "/home/sebor/stdcxx-trunk/src/codecvt.cpp".
> make: *** [codecvt.o] Error 2
> make[2]: Leaving directory `/build/sebor/stdcxx-eccp-3.9-11s/lib'
> make[1]: *** [lib] Error 2
> make[1]: Leaving directory `/build/sebor/stdcxx-eccp-3.9-11s'
> make: *** [libstd] Error 2

-- 
This message is automatically generated by JIRA.
-
You can reply to this email to add a comment to the issue online.


Mime
View raw message