incubator-sling-commits mailing list archives

Site index · List index
Message view « Date » · « Thread »
Top « Date » · « Thread »
From bdelacre...@apache.org
Subject svn commit: r1553094 [3/5] - in /sling/trunk/samples/mail-archive: ./ docs/ server/ server/src/ server/src/main/ server/src/main/java/ server/src/main/java/org/ server/src/main/java/org/apache/ server/src/main/java/org/apache/sling/ server/src/main/jav...
Date Mon, 23 Dec 2013 11:11:17 GMT
Added: sling/trunk/samples/mail-archive/server/test_files/singlepart_headers.txt
URL: http://svn.apache.org/viewvc/sling/trunk/samples/mail-archive/server/test_files/singlepart_headers.txt?rev=1553094&view=auto
==============================================================================
--- sling/trunk/samples/mail-archive/server/test_files/singlepart_headers.txt (added)
+++ sling/trunk/samples/mail-archive/server/test_files/singlepart_headers.txt Mon Dec 23 11:11:15 2013
@@ -0,0 +1,37 @@
+// this is a comment, no blank lines please
+// name/value separator should be equals to MessageStoreImplRepositoryTest.TEST_FILE_FIELD_SEPARATOR
+Return-Path : <common-dev-return-77583-apmail-hadoop-common-dev-archive=hadoop.apache.org@hadoop.apache.org>
+X-Original-To : apmail-hadoop-common-dev-archive@www.apache.org
+Delivered-To : apmail-hadoop-common-dev-archive@www.apache.org
+Received : from mail.apache.org (hermes.apache.org [140.211.11.3])	by minotaur.apache.org (Postfix) with SMTP id 04D6296E1	for <apmail-hadoop-common-dev-archive@www.apache.org>; Wed,  1 Feb 2012 00:23:25 +0000 (UTC)
+Received : (qmail 97997 invoked by uid 500); 1 Feb 2012 00:23:21 -0000
+Delivered-To : apmail-hadoop-common-dev-archive@hadoop.apache.org
+Received : (qmail 97504 invoked by uid 500); 1 Feb 2012 00:23:20 -0000
+Mailing-List : contact common-dev-help@hadoop.apache.org; run by ezmlm
+Precedence : bulk
+List-Help : <mailto:common-dev-help@hadoop.apache.org>
+List-Unsubscribe : <mailto:common-dev-unsubscribe@hadoop.apache.org>
+List-Post : <mailto:common-dev@hadoop.apache.org>
+List-Id : <common-dev.hadoop.apache.org>
+Reply-To : common-dev@hadoop.apache.org
+Delivered-To : mailing list common-dev@hadoop.apache.org
+Received : (qmail 97483 invoked by uid 99); 1 Feb 2012 00:23:20 -0000
+Received : from nike.apache.org (HELO nike.apache.org) (192.87.106.230)    by apache.org (qpsmtpd/0.29) with ESMTP; Wed, 01 Feb 2012 00:23:20 +0000
+X-ASF-Spam-Status : No, hits=-2000.0 required=5.0	tests=ALL_TRUSTED,T_RP_MATCHES_RCVD
+X-Spam-Check-By : apache.org
+Received : from [140.211.11.116] (HELO hel.zones.apache.org) (140.211.11.116)    by apache.org (qpsmtpd/0.29) with ESMTP; Wed, 01 Feb 2012 00:23:17 +0000
+Received : from hel.zones.apache.org (hel.zones.apache.org [140.211.11.116])	by hel.zones.apache.org (Postfix) with ESMTP id CF2F31679FA	for <common-dev@hadoop.apache.org>; Wed,  1 Feb 2012 00:22:56 +0000 (UTC)
+Date : Wed, 1 Feb 2012 00:22:56 +0000 (UTC)
+From : "Roman Shaposhnik (Created) (JIRA)" <jira@apache.org>
+To : common-dev@hadoop.apache.org
+Message-ID : <250130243.649.1328055776849.JavaMail.tomcat@hel.zones.apache.org>
+Subject : [jira] [Created] (HADOOP-8010) hadoop-config.sh spews error message when HADOOP_HOME_WARN_SUPPRESS is set to true and HADOOP_HOME is present
+MIME-Version : 1.0
+Content-Type : text/plain; charset=utf-8
+Content-Transfer-Encoding : 7bit
+X-JIRA-FingerPrint : 30527f35849b9dde25b450d4833f0394
+X-Virus-Checked : Checked by ClamAV on apache.org
+jcr:primaryType : nt:unstructured
+jcr:text : 250130243.649.1328055776849.JavaMail.tomcat@hel.zones.apache.org
+// sling_resourceType instead of sling:resourceType beacause of javax.jcr.NamespaceException otherwise
+sling_resourceType : mailarchiveserver/message
\ No newline at end of file

Added: sling/trunk/samples/mail-archive/server/test_files/three_messages.mbox
URL: http://svn.apache.org/viewvc/sling/trunk/samples/mail-archive/server/test_files/three_messages.mbox?rev=1553094&view=auto
==============================================================================
--- sling/trunk/samples/mail-archive/server/test_files/three_messages.mbox (added)
+++ sling/trunk/samples/mail-archive/server/test_files/three_messages.mbox Mon Dec 23 11:11:15 2013
@@ -0,0 +1,250 @@
+From common-dev-return-77881-apmail-hadoop-common-dev-archive=hadoop.apache.org@hadoop.apache.org  Thu Mar  1 02:57:25 2012
+Return-Path: <common-dev-return-77881-apmail-hadoop-common-dev-archive=hadoop.apache.org@hadoop.apache.org>
+X-Original-To: apmail-hadoop-common-dev-archive@www.apache.org
+Delivered-To: apmail-hadoop-common-dev-archive@www.apache.org
+Received: from mail.apache.org (hermes.apache.org [140.211.11.3])
+	by minotaur.apache.org (Postfix) with SMTP id 8C416925D
+	for <apmail-hadoop-common-dev-archive@www.apache.org>; Thu,  1 Mar 2012 02:57:25 +0000 (UTC)
+Received: (qmail 9815 invoked by uid 500); 1 Mar 2012 02:57:24 -0000
+Delivered-To: apmail-hadoop-common-dev-archive@hadoop.apache.org
+Received: (qmail 9089 invoked by uid 500); 1 Mar 2012 02:57:22 -0000
+Mailing-List: contact common-dev-help@hadoop.apache.org; run by ezmlm
+Precedence: bulk
+List-Help: <mailto:common-dev-help@hadoop.apache.org>
+List-Unsubscribe: <mailto:common-dev-unsubscribe@hadoop.apache.org>
+List-Post: <mailto:common-dev@hadoop.apache.org>
+List-Id: <common-dev.hadoop.apache.org>
+Reply-To: common-dev@hadoop.apache.org
+Delivered-To: mailing list common-dev@hadoop.apache.org
+Received: (qmail 9040 invoked by uid 99); 1 Mar 2012 02:57:20 -0000
+Received: from athena.apache.org (HELO athena.apache.org) (140.211.11.136)
+    by apache.org (qpsmtpd/0.29) with ESMTP; Thu, 01 Mar 2012 02:57:20 +0000
+X-ASF-Spam-Status: No, hits=1.5 required=5.0
+	tests=HTML_MESSAGE,RCVD_IN_DNSWL_LOW,SPF_PASS
+X-Spam-Check-By: apache.org
+Received-SPF: pass (athena.apache.org: domain of masmertoz@gmail.com designates 209.85.210.176 as permitted sender)
+Received: from [209.85.210.176] (HELO mail-iy0-f176.google.com) (209.85.210.176)
+    by apache.org (qpsmtpd/0.29) with ESMTP; Thu, 01 Mar 2012 02:57:14 +0000
+Received: by iagw33 with SMTP id w33so272974iag.35
+        for <common-dev@hadoop.apache.org>; Wed, 29 Feb 2012 18:56:53 -0800 (PST)
+Received-SPF: pass (google.com: domain of masmertoz@gmail.com designates 10.42.147.199 as permitted sender) client-ip=10.42.147.199;
+Authentication-Results: mr.google.com; spf=pass (google.com: domain of masmertoz@gmail.com designates 10.42.147.199 as permitted sender) smtp.mail=masmertoz@gmail.com; dkim=pass header.i=masmertoz@gmail.com
+Received: from mr.google.com ([10.42.147.199])
+        by 10.42.147.199 with SMTP id o7mr2309493icv.50.1330570613677 (num_hops = 1);
+        Wed, 29 Feb 2012 18:56:53 -0800 (PST)
+DKIM-Signature: v=1; a=rsa-sha256; c=relaxed/relaxed;
+        d=gmail.com; s=gamma;
+        h=mime-version:in-reply-to:references:date:message-id:subject:from:to
+         :content-type;
+        bh=ca6tWWewYqZQb+wuqEDo3x908P9XiZM0DtWMOMrehQ4=;
+        b=CF9YqcgV+7bycKErB/pbmhFQldN1wxWkybLoH3+W9Oek4/FwP6kaZxPRuO5KeyLamw
+         eFmk3EBAa16qxEX0tul8Ik3BxFC72fK8JmZti78aTmdREjtet/C4a52ho8/bAaSkOCry
+         +eJqQtx2fh0Kn6ZaoMIgZiRbGaj9zXftmWexM=
+MIME-Version: 1.0
+Received: by 10.42.147.199 with SMTP id o7mr1907969icv.50.1330570613623; Wed,
+ 29 Feb 2012 18:56:53 -0800 (PST)
+Received: by 10.42.241.132 with HTTP; Wed, 29 Feb 2012 18:56:53 -0800 (PST)
+In-Reply-To: <CAENBeZZYO8sTZcQjWQ8aUndBJo3mcQKbxJiL2S47qryM8KN7tw@mail.gmail.com>
+References: <CAENBeZZYO8sTZcQjWQ8aUndBJo3mcQKbxJiL2S47qryM8KN7tw@mail.gmail.com>
+Date: Thu, 1 Mar 2012 03:56:53 +0100
+Message-ID: <CAENBeZbtbnESj6s0Bgkv5h7uSRUEQnZ+aWZm6z6pxGjxaSFiqg@mail.gmail.com>
+Subject: Re: Developing and deploying hadoop
+From: Merto Mertek <masmertoz@gmail.com>
+To: common-dev@hadoop.apache.org
+Content-Type: multipart/alternative; boundary=90e6ba6e8c04c60cb804ba259c76
+X-Virus-Checked: Checked by ClamAV on apache.org
+
+--90e6ba6e8c04c60cb804ba259c76
+Content-Type: text/plain; charset=ISO-8859-1
+
+I would be glad to hear what is your development cycle and how you deploy
+new features to production cluster...  How do you deploy them to the
+production cluster? With bash scripts and rsync, ant, maven or any other
+automation tool? I would be thankfull if you could point me to any resource
+describing best practices in developing, deploying and automatization of
+java project in unix/linux environment..
+
+thanks..
+
+
+On 13 February 2012 11:26, Merto Mertek <masmertoz@gmail.com> wrote:
+
+> I am interested in some general tips on how to develop and deploy new
+> versions of hadoop. I've been trying to compile a new version of  hadoop
+> and place the new jar to the cluster in the lib folder, however it was not
+> picked despite the classpath was explicitly set to the lib folder. I am
+> interested in the following questions:
+>
+> a) How to deploy a new version? Just copy the new compiled jar file to all
+> lib folders on all nodes?
+> b) Should I make just a new compile or a new release ('ant' vs 'ant tar')?
+> c) How do you develop and deploy hadoop locally and how remotely?  For
+> deploying builds are you using your own sh scripts or are you using any
+> tools like ant/maven?
+> d) What is the purpose of the folder $HADOOP_HOME/share/hadoop?
+>
+>
+> Any other tips are welcomed..
+>
+> Thank you
+>
+
+--90e6ba6e8c04c60cb804ba259c76--
+
+From dev-return-126904-apmail-tomcat-dev-archive=tomcat.apache.org@tomcat.apache.org  Mon Apr  2 02:59:53 2012
+Return-Path: <dev-return-126904-apmail-tomcat-dev-archive=tomcat.apache.org@tomcat.apache.org>
+X-Original-To: apmail-tomcat-dev-archive@www.apache.org
+Delivered-To: apmail-tomcat-dev-archive@www.apache.org
+Received: from mail.apache.org (hermes.apache.org [140.211.11.3])
+    by minotaur.apache.org (Postfix) with SMTP id 334159308
+    for <apmail-tomcat-dev-archive@www.apache.org>; Mon,  2 Apr 2012 02:59:53 +0000 (UTC)
+Received: (qmail 36894 invoked by uid 500); 2 Apr 2012 02:59:51 -0000
+Delivered-To: apmail-tomcat-dev-archive@tomcat.apache.org
+Received: (qmail 36800 invoked by uid 500); 2 Apr 2012 02:59:51 -0000
+Mailing-List: contact dev-help@tomcat.apache.org; run by ezmlm
+Precedence: bulk
+List-Help: <mailto:dev-help@tomcat.apache.org>
+List-Unsubscribe: <mailto:dev-unsubscribe@tomcat.apache.org>
+List-Post: <mailto:dev@tomcat.apache.org>
+List-Id: <dev.tomcat.apache.org>
+Reply-To: "Tomcat Developers List" <dev@tomcat.apache.org>
+Delivered-To: mailing list dev@tomcat.apache.org
+Received: (qmail 36740 invoked by uid 99); 2 Apr 2012 02:59:51 -0000
+Received: from nike.apache.org (HELO nike.apache.org) (192.87.106.230)
+    by apache.org (qpsmtpd/0.29) with ESMTP; Mon, 02 Apr 2012 02:59:50 +0000
+X-ASF-Spam-Status: No, hits=-1996.0 required=5.0
+    tests=ALL_TRUSTED,DCC_CHECK
+X-Spam-Check-By: apache.org
+Received: from [140.211.11.115] (HELO eir.zones.apache.org) (140.211.11.115)
+    by apache.org (qpsmtpd/0.29) with ESMTP; Mon, 02 Apr 2012 02:59:48 +0000
+Received: by eir.zones.apache.org (Postfix, from userid 80)
+    id EE2AA3D94; Mon,  2 Apr 2012 02:59:27 +0000 (UTC)
+From: bugzilla@apache.org
+To: dev@tomcat.apache.org
+Subject: DO NOT REPLY [Bug 53022] session is expired/removed/not found by
+ unknown reason
+Date: Mon, 02 Apr 2012 02:59:27 +0000
+X-Bugzilla-Reason: AssignedTo
+X-Bugzilla-Type: changed
+X-Bugzilla-Watch-Reason: None
+X-Bugzilla-Product: Tomcat 7
+X-Bugzilla-Component: Catalina
+X-Bugzilla-Keywords: 
+X-Bugzilla-Severity: critical
+X-Bugzilla-Who: lu4242@apache.org
+X-Bugzilla-Status: NEW
+X-Bugzilla-Priority: P2
+X-Bugzilla-Assigned-To: dev@tomcat.apache.org
+X-Bugzilla-Target-Milestone: ---
+X-Bugzilla-Changed-Fields: CC
+In-Reply-To: <bug-53022-78@https.issues.apache.org/bugzilla/>
+References: <bug-53022-78@https.issues.apache.org/bugzilla/>
+X-Bugzilla-URL: https://issues.apache.org/bugzilla/
+Auto-Submitted: auto-generated
+Content-Type: text/plain; charset="UTF-8"
+MIME-Version: 1.0
+
+https://issues.apache.org/bugzilla/show_bug.cgi?id=53022
+
+Leonardo Uribe <lu4242@apache.org> changed:
+
+           What    |Removed                     |Added
+----------------------------------------------------------------------------
+                 CC|                            |lu4242@apache.org
+
+-- 
+Configure bugmail: https://issues.apache.org/bugzilla/userprefs.cgi?tab=email
+------- You are receiving this mail because: -------
+You are the assignee for the bug.
+
+---------------------------------------------------------------------
+To unsubscribe, e-mail: dev-unsubscribe@tomcat.apache.org
+For additional commands, e-mail: dev-help@tomcat.apache.org
+
+
+From dev-return-33924-apmail-jackrabbit-dev-archive=jackrabbit.apache.org@jackrabbit.apache.org  Wed Jan 25 17:04:43 2012
+Return-Path: <dev-return-33924-apmail-jackrabbit-dev-archive=jackrabbit.apache.org@jackrabbit.apache.org>
+X-Original-To: apmail-jackrabbit-dev-archive@www.apache.org
+Delivered-To: apmail-jackrabbit-dev-archive@www.apache.org
+Received: from mail.apache.org (hermes.apache.org [140.211.11.3])
+    by minotaur.apache.org (Postfix) with SMTP id A60F99C19
+    for <apmail-jackrabbit-dev-archive@www.apache.org>; Wed, 25 Jan 2012 17:04:43 +0000 (UTC)
+Received: (qmail 52953 invoked by uid 500); 25 Jan 2012 17:04:43 -0000
+Delivered-To: apmail-jackrabbit-dev-archive@jackrabbit.apache.org
+Received: (qmail 52911 invoked by uid 500); 25 Jan 2012 17:04:42 -0000
+Mailing-List: contact dev-help@jackrabbit.apache.org; run by ezmlm
+Precedence: bulk
+List-Help: <mailto:dev-help@jackrabbit.apache.org>
+List-Unsubscribe: <mailto:dev-unsubscribe@jackrabbit.apache.org>
+List-Post: <mailto:dev@jackrabbit.apache.org>
+List-Id: <dev.jackrabbit.apache.org>
+Reply-To: dev@jackrabbit.apache.org
+Delivered-To: mailing list dev@jackrabbit.apache.org
+Received: (qmail 52903 invoked by uid 99); 25 Jan 2012 17:04:42 -0000
+Received: from athena.apache.org (HELO athena.apache.org) (140.211.11.136)
+    by apache.org (qpsmtpd/0.29) with ESMTP; Wed, 25 Jan 2012 17:04:42 +0000
+X-ASF-Spam-Status: No, hits=-1.6 required=5.0
+    tests=RCVD_IN_DNSWL_MED,SPF_NEUTRAL
+X-Spam-Check-By: apache.org
+Received-SPF: neutral (athena.apache.org: local policy)
+Received: from [64.18.1.31] (HELO exprod6og113.obsmtp.com) (64.18.1.31)
+    by apache.org (qpsmtpd/0.29) with ESMTP; Wed, 25 Jan 2012 17:04:33 +0000
+Received: from outbound-smtp-2.corp.adobe.com ([193.104.215.16]) by exprod6ob113.postini.com ([64.18.5.12]) with SMTP
+    ID DSNKTyA2DGVL/RbMVKoAyiWEtOdqxaX7p0B0@postini.com; Wed, 25 Jan 2012 09:04:13 PST
+Received: from inner-relay-1.corp.adobe.com (inner-relay-1.corp.adobe.com [153.32.1.51])
+    by outbound-smtp-2.corp.adobe.com (8.12.10/8.12.10) with ESMTP id q0PH4A2U021951
+    for <dev@jackrabbit.apache.org>; Wed, 25 Jan 2012 09:04:11 -0800 (PST)
+Received: from nacas02.corp.adobe.com (nacas02.corp.adobe.com [10.8.189.100])
+    by inner-relay-1.corp.adobe.com (8.12.10/8.12.10) with ESMTP id q0PH49MN015128
+    for <dev@jackrabbit.apache.org>; Wed, 25 Jan 2012 09:04:10 -0800 (PST)
+Received: from eurcas01.eur.adobe.com (10.128.4.27) by nacas02.corp.adobe.com
+ (10.8.189.100) with Microsoft SMTP Server (TLS) id 8.3.192.1; Wed, 25 Jan
+ 2012 09:04:09 -0800
+Received: from susi.local (10.136.140.49) by eurcas01.eur.adobe.com
+ (10.128.4.111) with Microsoft SMTP Server id 8.3.192.1; Wed, 25 Jan 2012
+ 17:04:08 +0000
+Message-ID: <4F203608.3050200@apache.org>
+Date: Wed, 25 Jan 2012 17:04:08 +0000
+From: =?ISO-8859-1?Q?Michael_D=FCrig?= <mduerig@apache.org>
+User-Agent: Mozilla/5.0 (Macintosh; Intel Mac OS X 10.6; rv:9.0) Gecko/20111222 Thunderbird/9.0.1
+MIME-Version: 1.0
+To: <dev@jackrabbit.apache.org>
+Subject: [jr3 Microkernel] how should we handle failed save operations?
+Content-Type: text/plain; charset="ISO-8859-1"; format=flowed
+Content-Transfer-Encoding: 7bit
+
+
+Hi,
+
+In an earlier discussion (probably offline), we decided to not implement 
+Item.refresh() since it doesn't go well with the MVCC model jr3 is based 
+on. Furthermore, JCR doesn't have an Item.undo() method for undoing changes.
+
+This may lead to problems when a Session.save() fails due to the 
+underlying Microkernel.commit failing because it detected a conflict. 
+Now there might be some transient changes (like deletions) which can't 
+be selectively undone by the user. So the user is left with a transient 
+space containing his changes but he can only discard them as a whole. 
+Not very satisfactory.
+
+Possible solutions:
+
+1) The Microkernel makes as much effort as possible to three way merge 
+changes.
+
+2) The user needs to do a session refresh with keep changes = true and 
+save again.
+
+3) Introduce a Item.undo method on the JCR API.
+
+
+1) Mitigates the problem such that it only occurs rarely.
+
+2) Is really nothing more than moving the problem of the failed commit 
+due to a conflict from the Microkernel to the transient space: now the 
+transient space needs to do conflict resolution.
+
+3) Is what I think we should do. This enable the user to resolve his 
+conflicts selectively.
+
+Michael

Added: sling/trunk/samples/mail-archive/server/test_files/wrongbody.mbox
URL: http://svn.apache.org/viewvc/sling/trunk/samples/mail-archive/server/test_files/wrongbody.mbox?rev=1553094&view=auto
==============================================================================
--- sling/trunk/samples/mail-archive/server/test_files/wrongbody.mbox (added)
+++ sling/trunk/samples/mail-archive/server/test_files/wrongbody.mbox Mon Dec 23 11:11:15 2013
@@ -0,0 +1,883 @@
+From dev-return-26289-apmail-sling-dev-archive=sling.apache.org@sling.apache.org  Thu Mar 29 20:49:50 2012
+Return-Path: <dev-return-26289-apmail-sling-dev-archive=sling.apache.org@sling.apache.org>
+X-Original-To: apmail-sling-dev-archive@www.apache.org
+Delivered-To: apmail-sling-dev-archive@www.apache.org
+Received: from mail.apache.org (hermes.apache.org [140.211.11.3])
+	by minotaur.apache.org (Postfix) with SMTP id 266239F8E
+	for <apmail-sling-dev-archive@www.apache.org>; Thu, 29 Mar 2012 20:49:50 +0000 (UTC)
+Received: (qmail 13616 invoked by uid 500); 29 Mar 2012 20:49:49 -0000
+Delivered-To: apmail-sling-dev-archive@sling.apache.org
+Received: (qmail 13515 invoked by uid 500); 29 Mar 2012 20:49:49 -0000
+Mailing-List: contact dev-help@sling.apache.org; run by ezmlm
+Precedence: bulk
+List-Help: <mailto:dev-help@sling.apache.org>
+List-Unsubscribe: <mailto:dev-unsubscribe@sling.apache.org>
+List-Post: <mailto:dev@sling.apache.org>
+List-Id: <dev.sling.apache.org>
+Reply-To: dev@sling.apache.org
+Delivered-To: mailing list dev@sling.apache.org
+Received: (qmail 13297 invoked by uid 99); 29 Mar 2012 20:49:49 -0000
+Received: from nike.apache.org (HELO nike.apache.org) (192.87.106.230)
+    by apache.org (qpsmtpd/0.29) with ESMTP; Thu, 29 Mar 2012 20:49:49 +0000
+X-ASF-Spam-Status: No, hits=-2000.0 required=5.0
+	tests=ALL_TRUSTED,T_RP_MATCHES_RCVD
+X-Spam-Check-By: apache.org
+Received: from [140.211.11.116] (HELO hel.zones.apache.org) (140.211.11.116)
+    by apache.org (qpsmtpd/0.29) with ESMTP; Thu, 29 Mar 2012 20:49:46 +0000
+Received: from hel.zones.apache.org (hel.zones.apache.org [140.211.11.116])
+	by hel.zones.apache.org (Postfix) with ESMTP id A00E934B3A6
+	for <dev@sling.apache.org>; Thu, 29 Mar 2012 20:49:25 +0000 (UTC)
+Date: Thu, 29 Mar 2012 20:49:25 +0000 (UTC)
+From: "Carsten Ziegeler (Commented) (JIRA)" <jira@apache.org>
+To: dev@sling.apache.org
+Message-ID: <1997318514.34674.1333054165672.JavaMail.tomcat@hel.zones.apache.org>
+In-Reply-To: <1651017606.30866.1322744801989.JavaMail.tomcat@hel.zones.apache.org>
+Subject: [jira] [Commented] (SLING-2311) Sling Performance Testing tool
+MIME-Version: 1.0
+Content-Type: text/plain; charset=utf-8
+Content-Transfer-Encoding: 7bit
+X-JIRA-FingerPrint: 30527f35849b9dde25b450d4833f0394
+
+
+    [ https://issues.apache.org/jira/browse/SLING-2311?page=com.atlassian.jira.plugin.system.issuetabpanels:comment-tabpanel&focusedCommentId=13241609#comment-13241609 ] 
+
+Carsten Ziegeler commented on SLING-2311:
+-----------------------------------------
+
+Great stuff - I think we should definitely have something like this, not sure whether we should start a new module or add it to commons testing or could just test
+junit-perf for this?
+                
+> Sling Performance Testing tool
+> ------------------------------
+>
+>                 Key: SLING-2311
+>                 URL: https://issues.apache.org/jira/browse/SLING-2311
+>             Project: Sling
+>          Issue Type: New Feature
+>          Components: Testing
+>            Reporter: Antonio Sanso
+>            Assignee: Carsten Ziegeler
+>            Priority: Minor
+>         Attachments: ResolveWithManyAliasTest.java, SLING-2311-patch.txt
+>
+>
+> As described/discussed in [0] it would be nice to have a performance test tool in Sling .
+> This can be useful in different situations (e.g. micro benchmarks of a feature and so on).
+> Patch to follow
+> [0] http://sling.markmail.org/message/bz44im7aqeae4r57
+
+--
+This message is automatically generated by JIRA.
+If you think it was sent incorrectly, please contact your JIRA administrators: https://issues.apache.org/jira/secure/ContactAdministrators!default.jspa
+For more information on JIRA, see: http://www.atlassian.com/software/jira
+
+        
+
+From dev-return-26290-apmail-sling-dev-archive=sling.apache.org@sling.apache.org  Fri Mar 30 00:11:52 2012
+Return-Path: <dev-return-26290-apmail-sling-dev-archive=sling.apache.org@sling.apache.org>
+X-Original-To: apmail-sling-dev-archive@www.apache.org
+Delivered-To: apmail-sling-dev-archive@www.apache.org
+Received: from mail.apache.org (hermes.apache.org [140.211.11.3])
+	by minotaur.apache.org (Postfix) with SMTP id B5CD39755
+	for <apmail-sling-dev-archive@www.apache.org>; Fri, 30 Mar 2012 00:11:52 +0000 (UTC)
+Received: (qmail 52185 invoked by uid 500); 30 Mar 2012 00:11:52 -0000
+Delivered-To: apmail-sling-dev-archive@sling.apache.org
+Received: (qmail 52143 invoked by uid 500); 30 Mar 2012 00:11:52 -0000
+Mailing-List: contact dev-help@sling.apache.org; run by ezmlm
+Precedence: bulk
+List-Help: <mailto:dev-help@sling.apache.org>
+List-Unsubscribe: <mailto:dev-unsubscribe@sling.apache.org>
+List-Post: <mailto:dev@sling.apache.org>
+List-Id: <dev.sling.apache.org>
+Reply-To: dev@sling.apache.org
+Delivered-To: mailing list dev@sling.apache.org
+Received: (qmail 52130 invoked by uid 99); 30 Mar 2012 00:11:52 -0000
+Received: from nike.apache.org (HELO nike.apache.org) (192.87.106.230)
+    by apache.org (qpsmtpd/0.29) with ESMTP; Fri, 30 Mar 2012 00:11:52 +0000
+X-ASF-Spam-Status: No, hits=-2000.0 required=5.0
+	tests=ALL_TRUSTED,T_RP_MATCHES_RCVD
+X-Spam-Check-By: apache.org
+Received: from [140.211.11.116] (HELO hel.zones.apache.org) (140.211.11.116)
+    by apache.org (qpsmtpd/0.29) with ESMTP; Fri, 30 Mar 2012 00:11:49 +0000
+Received: from hel.zones.apache.org (hel.zones.apache.org [140.211.11.116])
+	by hel.zones.apache.org (Postfix) with ESMTP id 0120E34DB88
+	for <dev@sling.apache.org>; Fri, 30 Mar 2012 00:11:29 +0000 (UTC)
+Date: Fri, 30 Mar 2012 00:11:29 +0000 (UTC)
+From: "Carsten Ziegeler (Updated) (JIRA)" <jira@apache.org>
+To: dev@sling.apache.org
+Message-ID: <338053853.35872.1333066289015.JavaMail.tomcat@hel.zones.apache.org>
+In-Reply-To: <1269013084.29325.1332957568495.JavaMail.tomcat@hel.zones.apache.org>
+Subject: [jira] [Updated] (SLING-2450) JcrInstaller generates incorrect node
+ name in /apps/system/config (or else the installer doesn't process the
+ nodename properly)
+MIME-Version: 1.0
+Content-Type: text/plain; charset=utf-8
+Content-Transfer-Encoding: 7bit
+X-JIRA-FingerPrint: 30527f35849b9dde25b450d4833f0394
+
+
+     [ https://issues.apache.org/jira/browse/SLING-2450?page=com.atlassian.jira.plugin.system.issuetabpanels:all-tabpanel ]
+
+Carsten Ziegeler updated SLING-2450:
+------------------------------------
+
+    Affects Version/s: Installer Core 3.3.4
+                       Installer Configuration Factory 1.0.4
+        Fix Version/s: Installer Configuration Factory 1.0.6
+                       JCR Installer 3.1.4
+                       Installer Core 3.3.6
+    
+> JcrInstaller generates incorrect node name in /apps/system/config (or else the installer doesn't process the nodename properly)
+> -------------------------------------------------------------------------------------------------------------------------------
+>
+>                 Key: SLING-2450
+>                 URL: https://issues.apache.org/jira/browse/SLING-2450
+>             Project: Sling
+>          Issue Type: Bug
+>          Components: Installer
+>    Affects Versions: Installer Core 3.3.4, JCR Installer 3.1.2, Installer Configuration Factory 1.0.4
+>            Reporter: Tyson Norris
+>            Assignee: Carsten Ziegeler
+>             Fix For: Installer Core 3.3.6, JCR Installer 3.1.4, Installer Configuration Factory 1.0.6
+>
+>
+> when using ConfigurationAdmin or osgi web console to create a config for a ManagedServiceFactory, a nt:file node is created in /apps/system/config with a node name like:
+> com.adobe.granite.auth.oauth.provider.com.adobe.granite.auth.oauth.provider.99bd39e3-4367-47b0-a5a2-b4e1a0f8a5b9.config
+> The installer, however will not process the node (and create the managed service propertly) unless the node name is formatted like:
+> com.adobe.granite.auth.oauth.provider-99bd39e3-4367-47b0-a5a2-b4e1a0f8a5b9.config
+> Note that:
+> - "com.adobe.granite.auth.oauth.provider" string only occurs once
+> - there is a dash "-" after "provider"
+> I'm not sure which problem it is, but it may be one of:
+> - the JcrInstaller generates the wrong node name
+> - OR the JcrInstaller does not process the node name properly
+
+--
+This message is automatically generated by JIRA.
+If you think it was sent incorrectly, please contact your JIRA administrators: https://issues.apache.org/jira/secure/ContactAdministrators!default.jspa
+For more information on JIRA, see: http://www.atlassian.com/software/jira
+
+        
+
+From dev-return-26291-apmail-sling-dev-archive=sling.apache.org@sling.apache.org  Fri Mar 30 00:11:53 2012
+Return-Path: <dev-return-26291-apmail-sling-dev-archive=sling.apache.org@sling.apache.org>
+X-Original-To: apmail-sling-dev-archive@www.apache.org
+Delivered-To: apmail-sling-dev-archive@www.apache.org
+Received: from mail.apache.org (hermes.apache.org [140.211.11.3])
+	by minotaur.apache.org (Postfix) with SMTP id 11EDE9792
+	for <apmail-sling-dev-archive@www.apache.org>; Fri, 30 Mar 2012 00:11:53 +0000 (UTC)
+Received: (qmail 52478 invoked by uid 500); 30 Mar 2012 00:11:52 -0000
+Delivered-To: apmail-sling-dev-archive@sling.apache.org
+Received: (qmail 52403 invoked by uid 500); 30 Mar 2012 00:11:52 -0000
+Mailing-List: contact dev-help@sling.apache.org; run by ezmlm
+Precedence: bulk
+List-Help: <mailto:dev-help@sling.apache.org>
+List-Unsubscribe: <mailto:dev-unsubscribe@sling.apache.org>
+List-Post: <mailto:dev@sling.apache.org>
+List-Id: <dev.sling.apache.org>
+Reply-To: dev@sling.apache.org
+Delivered-To: mailing list dev@sling.apache.org
+Received: (qmail 52393 invoked by uid 99); 30 Mar 2012 00:11:52 -0000
+Received: from nike.apache.org (HELO nike.apache.org) (192.87.106.230)
+    by apache.org (qpsmtpd/0.29) with ESMTP; Fri, 30 Mar 2012 00:11:52 +0000
+X-ASF-Spam-Status: No, hits=-2000.0 required=5.0
+	tests=ALL_TRUSTED,T_RP_MATCHES_RCVD
+X-Spam-Check-By: apache.org
+Received: from [140.211.11.116] (HELO hel.zones.apache.org) (140.211.11.116)
+    by apache.org (qpsmtpd/0.29) with ESMTP; Fri, 30 Mar 2012 00:11:50 +0000
+Received: from hel.zones.apache.org (hel.zones.apache.org [140.211.11.116])
+	by hel.zones.apache.org (Postfix) with ESMTP id 36D9F34DB8B
+	for <dev@sling.apache.org>; Fri, 30 Mar 2012 00:11:29 +0000 (UTC)
+Date: Fri, 30 Mar 2012 00:11:29 +0000 (UTC)
+From: "Carsten Ziegeler (Resolved) (JIRA)" <jira@apache.org>
+To: dev@sling.apache.org
+Message-ID: <1662610421.35874.1333066289235.JavaMail.tomcat@hel.zones.apache.org>
+In-Reply-To: <1269013084.29325.1332957568495.JavaMail.tomcat@hel.zones.apache.org>
+Subject: [jira] [Resolved] (SLING-2450) JcrInstaller generates incorrect
+ node name in /apps/system/config (or else the installer doesn't process the
+ nodename properly)
+MIME-Version: 1.0
+Content-Type: text/plain; charset=utf-8
+Content-Transfer-Encoding: 7bit
+X-JIRA-FingerPrint: 30527f35849b9dde25b450d4833f0394
+
+
+     [ https://issues.apache.org/jira/browse/SLING-2450?page=com.atlassian.jira.plugin.system.issuetabpanels:all-tabpanel ]
+
+Carsten Ziegeler resolved SLING-2450.
+-------------------------------------
+
+    Resolution: Fixed
+
+Actually this was a serious of smaller bugs in all three components. I've fixed the factory configuration handling in revision 1307172. In addition it now uses the alias name when writing back an overwritten configuration
+                
+> JcrInstaller generates incorrect node name in /apps/system/config (or else the installer doesn't process the nodename properly)
+> -------------------------------------------------------------------------------------------------------------------------------
+>
+>                 Key: SLING-2450
+>                 URL: https://issues.apache.org/jira/browse/SLING-2450
+>             Project: Sling
+>          Issue Type: Bug
+>          Components: Installer
+>    Affects Versions: Installer Core 3.3.4, JCR Installer 3.1.2, Installer Configuration Factory 1.0.4
+>            Reporter: Tyson Norris
+>            Assignee: Carsten Ziegeler
+>             Fix For: Installer Core 3.3.6, JCR Installer 3.1.4, Installer Configuration Factory 1.0.6
+>
+>
+> when using ConfigurationAdmin or osgi web console to create a config for a ManagedServiceFactory, a nt:file node is created in /apps/system/config with a node name like:
+> com.adobe.granite.auth.oauth.provider.com.adobe.granite.auth.oauth.provider.99bd39e3-4367-47b0-a5a2-b4e1a0f8a5b9.config
+> The installer, however will not process the node (and create the managed service propertly) unless the node name is formatted like:
+> com.adobe.granite.auth.oauth.provider-99bd39e3-4367-47b0-a5a2-b4e1a0f8a5b9.config
+> Note that:
+> - "com.adobe.granite.auth.oauth.provider" string only occurs once
+> - there is a dash "-" after "provider"
+> I'm not sure which problem it is, but it may be one of:
+> - the JcrInstaller generates the wrong node name
+> - OR the JcrInstaller does not process the node name properly
+
+--
+This message is automatically generated by JIRA.
+If you think it was sent incorrectly, please contact your JIRA administrators: https://issues.apache.org/jira/secure/ContactAdministrators!default.jspa
+For more information on JIRA, see: http://www.atlassian.com/software/jira
+
+        
+
+From dev-return-26292-apmail-sling-dev-archive=sling.apache.org@sling.apache.org  Fri Mar 30 03:14:05 2012
+Return-Path: <dev-return-26292-apmail-sling-dev-archive=sling.apache.org@sling.apache.org>
+X-Original-To: apmail-sling-dev-archive@www.apache.org
+Delivered-To: apmail-sling-dev-archive@www.apache.org
+Received: from mail.apache.org (hermes.apache.org [140.211.11.3])
+	by minotaur.apache.org (Postfix) with SMTP id 01B7B9203
+	for <apmail-sling-dev-archive@www.apache.org>; Fri, 30 Mar 2012 03:14:05 +0000 (UTC)
+Received: (qmail 7358 invoked by uid 500); 30 Mar 2012 03:14:04 -0000
+Delivered-To: apmail-sling-dev-archive@sling.apache.org
+Received: (qmail 7108 invoked by uid 500); 30 Mar 2012 03:14:03 -0000
+Mailing-List: contact dev-help@sling.apache.org; run by ezmlm
+Precedence: bulk
+List-Help: <mailto:dev-help@sling.apache.org>
+List-Unsubscribe: <mailto:dev-unsubscribe@sling.apache.org>
+List-Post: <mailto:dev@sling.apache.org>
+List-Id: <dev.sling.apache.org>
+Reply-To: dev@sling.apache.org
+Delivered-To: mailing list dev@sling.apache.org
+Received: (qmail 7064 invoked by uid 99); 30 Mar 2012 03:14:01 -0000
+Received: from nike.apache.org (HELO nike.apache.org) (192.87.106.230)
+    by apache.org (qpsmtpd/0.29) with ESMTP; Fri, 30 Mar 2012 03:14:01 +0000
+X-ASF-Spam-Status: No, hits=-2000.0 required=5.0
+	tests=ALL_TRUSTED
+X-Spam-Check-By: apache.org
+Received: from [140.211.11.8] (HELO aegis.apache.org) (140.211.11.8)
+    by apache.org (qpsmtpd/0.29) with ESMTP; Fri, 30 Mar 2012 03:13:58 +0000
+Received: from aegis.apache.org (localhost [127.0.0.1])
+	by aegis.apache.org (Postfix) with ESMTP id BCBCEC00A0;
+	Fri, 30 Mar 2012 03:13:37 +0000 (UTC)
+Date: Fri, 30 Mar 2012 03:12:56 +0000 (UTC)
+From: Apache Jenkins Server <jenkins@builds.apache.org>
+To: dev@sling.apache.org, cziegeler@googlemail.com
+Message-ID: <2121048278.104.1333077217756.JavaMail.hudson@aegis>
+In-Reply-To: <1732558901.1278.1332988865440.JavaMail.hudson@aegis>
+References: <1732558901.1278.1332988865440.JavaMail.hudson@aegis>
+Subject: Jenkins build is back to normal : sling-trunk-1.6 #1288
+MIME-Version: 1.0
+Content-Type: text/plain; charset=UTF-8
+Content-Transfer-Encoding: 7bit
+X-Jenkins-Job: sling-trunk-1.6
+X-Jenkins-Result: SUCCESS
+
+See <https://builds.apache.org/job/sling-trunk-1.6/1288/changes>
+
+
+From dev-return-26293-apmail-sling-dev-archive=sling.apache.org@sling.apache.org  Fri Mar 30 03:16:33 2012
+Return-Path: <dev-return-26293-apmail-sling-dev-archive=sling.apache.org@sling.apache.org>
+X-Original-To: apmail-sling-dev-archive@www.apache.org
+Delivered-To: apmail-sling-dev-archive@www.apache.org
+Received: from mail.apache.org (hermes.apache.org [140.211.11.3])
+	by minotaur.apache.org (Postfix) with SMTP id C03AA926F
+	for <apmail-sling-dev-archive@www.apache.org>; Fri, 30 Mar 2012 03:16:33 +0000 (UTC)
+Received: (qmail 11978 invoked by uid 500); 30 Mar 2012 03:16:33 -0000
+Delivered-To: apmail-sling-dev-archive@sling.apache.org
+Received: (qmail 11936 invoked by uid 500); 30 Mar 2012 03:16:33 -0000
+Mailing-List: contact dev-help@sling.apache.org; run by ezmlm
+Precedence: bulk
+List-Help: <mailto:dev-help@sling.apache.org>
+List-Unsubscribe: <mailto:dev-unsubscribe@sling.apache.org>
+List-Post: <mailto:dev@sling.apache.org>
+List-Id: <dev.sling.apache.org>
+Reply-To: dev@sling.apache.org
+Delivered-To: mailing list dev@sling.apache.org
+Received: (qmail 11912 invoked by uid 99); 30 Mar 2012 03:16:32 -0000
+Received: from nike.apache.org (HELO nike.apache.org) (192.87.106.230)
+    by apache.org (qpsmtpd/0.29) with ESMTP; Fri, 30 Mar 2012 03:16:32 +0000
+X-ASF-Spam-Status: No, hits=-2000.0 required=5.0
+	tests=ALL_TRUSTED
+X-Spam-Check-By: apache.org
+Received: from [140.211.11.8] (HELO aegis.apache.org) (140.211.11.8)
+    by apache.org (qpsmtpd/0.29) with ESMTP; Fri, 30 Mar 2012 03:16:26 +0000
+Received: from aegis.apache.org (localhost [127.0.0.1])
+	by aegis.apache.org (Postfix) with ESMTP id 3E8CBC00A0
+	for <dev@sling.apache.org>; Fri, 30 Mar 2012 03:16:05 +0000 (UTC)
+Date: Fri, 30 Mar 2012 03:16:05 +0000 (UTC)
+From: Apache Jenkins Server <jenkins@builds.apache.org>
+To: dev@sling.apache.org
+Message-ID: <1937985321.105.1333077365240.JavaMail.hudson@aegis>
+In-Reply-To: <1953604574.1290.1332996985382.JavaMail.hudson@aegis>
+References: <1953604574.1290.1332996985382.JavaMail.hudson@aegis>
+Subject: Build failed in Jenkins: sling-samples-1.5 #298
+MIME-Version: 1.0
+Content-Type: text/plain; charset=UTF-8
+Content-Transfer-Encoding: 7bit
+X-Jenkins-Job: sling-samples-1.5
+X-Jenkins-Result: FAILURE
+
+See <https://builds.apache.org/job/sling-samples-1.5/298/>
+
+------------------------------------------
+[...truncated 946 lines...]
+[INFO] Preparing source:jar
+[WARNING] Removing: jar from forked lifecycle, to prevent recursive invocation.
+[JENKINS] Archiving <https://builds.apache.org/job/sling-samples-1.5/ws/contrib-1.5/framework-fragment/pom.xml> to /home/hudson/hudson/jobs/sling-samples-1.5/modules/org.apache.sling$org.apache.sling.samples.frameworkfragment/builds/2012-03-30_03-13-43/archive/org.apache.sling/org.apache.sling.samples.frameworkfragment/0.9.9-SNAPSHOT/org.apache.sling.samples.frameworkfragment-0.9.9-SNAPSHOT.pom
+[JENKINS] Archiving <https://builds.apache.org/job/sling-samples-1.5/ws/contrib-1.5/framework-fragment/target/org.apache.sling.samples.frameworkfragment-0.9.9-SNAPSHOT.jar> to /home/hudson/hudson/jobs/sling-samples-1.5/modules/org.apache.sling$org.apache.sling.samples.frameworkfragment/builds/2012-03-30_03-13-43/archive/org.apache.sling/org.apache.sling.samples.frameworkfragment/0.9.9-SNAPSHOT/org.apache.sling.samples.frameworkfragment-0.9.9-SNAPSHOT.jar
+[INFO] [enforcer:enforce {execution: enforce-java}]
+[INFO] [source:jar {execution: attach-sources}]
+[INFO] META-INF already added, skipping
+[INFO] META-INF/LICENSE already added, skipping
+[INFO] META-INF/NOTICE already added, skipping
+[INFO] META-INF/DEPENDENCIES already added, skipping
+[INFO] Building jar: <https://builds.apache.org/job/sling-samples-1.5/ws/contrib-1.5/framework-fragment/target/org.apache.sling.samples.frameworkfragment-0.9.9-SNAPSHOT-sources.jar>
+[INFO] META-INF already added, skipping
+[INFO] META-INF/LICENSE already added, skipping
+[INFO] META-INF/NOTICE already added, skipping
+[INFO] META-INF/DEPENDENCIES already added, skipping
+[INFO] [ianal:verify-legal-files {execution: default}]
+[INFO] Checking legal files in: org.apache.sling.samples.frameworkfragment-0.9.9-SNAPSHOT.jar
+[INFO] Checking legal files in: org.apache.sling.samples.frameworkfragment-0.9.9-SNAPSHOT-sources.jar
+[INFO] [install:install {execution: default-install}]
+[INFO] Installing <https://builds.apache.org/job/sling-samples-1.5/ws/contrib-1.5/framework-fragment/target/org.apache.sling.samples.frameworkfragment-0.9.9-SNAPSHOT.jar> to /home/jenkins/jenkins-slave/maven-repositories/0/org/apache/sling/org.apache.sling.samples.frameworkfragment/0.9.9-SNAPSHOT/org.apache.sling.samples.frameworkfragment-0.9.9-SNAPSHOT.jar
+[INFO] Installing <https://builds.apache.org/job/sling-samples-1.5/ws/contrib-1.5/framework-fragment/target/org.apache.sling.samples.frameworkfragment-0.9.9-SNAPSHOT-sources.jar> to /home/jenkins/jenkins-slave/maven-repositories/0/org/apache/sling/org.apache.sling.samples.frameworkfragment/0.9.9-SNAPSHOT/org.apache.sling.samples.frameworkfragment-0.9.9-SNAPSHOT-sources.jar
+[JENKINS] Archiving <https://builds.apache.org/job/sling-samples-1.5/ws/contrib-1.5/framework-fragment/target/org.apache.sling.samples.frameworkfragment-0.9.9-SNAPSHOT-sources.jar> to /home/hudson/hudson/jobs/sling-samples-1.5/modules/org.apache.sling$org.apache.sling.samples.frameworkfragment/builds/2012-03-30_03-13-43/archive/org.apache.sling/org.apache.sling.samples.frameworkfragment/0.9.9-SNAPSHOT/org.apache.sling.samples.frameworkfragment-0.9.9-SNAPSHOT-sources.jar
+[INFO] ------------------------------------------------------------------------
+[INFO] Building Apache Sling User Manager UI sample
+[INFO]    task-segment: [clean, install]
+[INFO] ------------------------------------------------------------------------
+[INFO] artifact net.alchim31.maven:yuicompressor-maven-plugin: checking for updates from oss.sonatype.org
+[INFO] [clean:clean {execution: default-clean}]
+[INFO] Deleting <https://builds.apache.org/job/sling-samples-1.5/ws/contrib-1.5/usermanager-ui/target>
+[INFO] [enforcer:enforce {execution: enforce-java}]
+[INFO] [remote-resources:process {execution: default}]
+[INFO] [resources:resources {execution: default-resources}]
+[INFO] Using 'UTF-8' encoding to copy filtered resources.
+[INFO] Copying 28 resources
+[INFO] Copying 3 resources
+[WARNING] DEPRECATED [tasks]: Use target instead
+[INFO] [antrun:run {execution: default}]
+[WARNING] Parameter tasks is deprecated, use target instead
+[INFO] Executing tasks
+
+main:
+     [echo] **************** WARNING (SLING-443/SLING-1782) ******************************
+     [echo] On most platforms, you'll get OutOfMemoryErrors when building unless you set
+     [echo] on 32bit platforms: MAVEN_OPTS="-Xmx256M -XX:MaxPermSize=256M", see SLING-443
+     [echo] on 64bit platforms: MAVEN_OPTS="-Xmx512M -XX:MaxPermSize=512M", see SLING-1782
+     [echo] ******************************************************************************
+[INFO] Executed tasks
+[INFO] [yuicompressor:compress {execution: default}]
+[INFO] nothing to do, <https://builds.apache.org/job/sling-samples-1.5/ws/contrib-1.5/usermanager-ui/src/main/resources/js/usermanager/usermanager.min.js> is younger than original, use 'force' option or clean your target
+[INFO] nothing to do, <https://builds.apache.org/job/sling-samples-1.5/ws/contrib-1.5/usermanager-ui/src/main/resources/css/usermanager/usermanager.min.css> is younger than original, use 'force' option or clean your target
+[INFO] nothing to do, <https://builds.apache.org/job/sling-samples-1.5/ws/contrib-1.5/usermanager-ui/src/main/resources/js/usermanager/usermanager.min.js> is younger than original, use 'force' option or clean your target
+[INFO] nothing to do, <https://builds.apache.org/job/sling-samples-1.5/ws/contrib-1.5/usermanager-ui/src/main/resources/css/usermanager/usermanager.min.css> is younger than original, use 'force' option or clean your target
+[INFO] nb warnings: 0, nb errors: 0
+[INFO] [compiler:compile {execution: default-compile}]
+[INFO] Compiling 1 source file to <https://builds.apache.org/job/sling-samples-1.5/ws/contrib-1.5/usermanager-ui/target/classes>
+[INFO] [scr:scr {execution: generate-scr-scrdescriptor}]
+[INFO] [resources:testResources {execution: default-testResources}]
+[INFO] Using 'UTF-8' encoding to copy filtered resources.
+[INFO] skip non existing resourceDirectory <https://builds.apache.org/job/sling-samples-1.5/ws/contrib-1.5/usermanager-ui/src/test/resources>
+[INFO] Copying 3 resources
+[INFO] [compiler:testCompile {execution: default-testCompile}]
+[INFO] No sources to compile
+[INFO] [surefire:test {execution: default-test}]
+[INFO] Surefire report directory: <https://builds.apache.org/job/sling-samples-1.5/ws/contrib-1.5/usermanager-ui/target/surefire-reports>
+
+-------------------------------------------------------
+ T E S T S
+-------------------------------------------------------
+There are no tests to run.
+
+Results :
+
+Tests run: 0, Failures: 0, Errors: 0, Skipped: 0
+
+[JENKINS] Recording test results[INFO] [animal-sniffer:check {execution: default}]
+[INFO] Checking unresolved references to org.codehaus.mojo.signature:java15:1.0
+
+[INFO] [bundle:bundle {execution: default-bundle}]
+[INFO] Preparing source:jar
+[WARNING] Removing: jar from forked lifecycle, to prevent recursive invocation.
+[JENKINS] Archiving <https://builds.apache.org/job/sling-samples-1.5/ws/contrib-1.5/usermanager-ui/pom.xml> to /home/hudson/hudson/jobs/sling-samples-1.5/modules/org.apache.sling.samples$org.apache.sling.samples.usermanager.ui/builds/2012-03-30_03-13-43/archive/org.apache.sling.samples/org.apache.sling.samples.usermanager.ui/0.9-SNAPSHOT/org.apache.sling.samples.usermanager.ui-0.9-SNAPSHOT.pom
+[JENKINS] Archiving <https://builds.apache.org/job/sling-samples-1.5/ws/contrib-1.5/usermanager-ui/target/org.apache.sling.samples.usermanager.ui-0.9-SNAPSHOT.jar> to /home/hudson/hudson/jobs/sling-samples-1.5/modules/org.apache.sling.samples$org.apache.sling.samples.usermanager.ui/builds/2012-03-30_03-13-43/archive/org.apache.sling.samples/org.apache.sling.samples.usermanager.ui/0.9-SNAPSHOT/org.apache.sling.samples.usermanager.ui-0.9-SNAPSHOT.jar
+[INFO] [enforcer:enforce {execution: enforce-java}]
+[INFO] [source:jar {execution: attach-sources}]
+[INFO] META-INF already added, skipping
+[INFO] META-INF/LICENSE already added, skipping
+[INFO] META-INF/NOTICE already added, skipping
+[INFO] META-INF/DEPENDENCIES already added, skipping
+[INFO] Building jar: <https://builds.apache.org/job/sling-samples-1.5/ws/contrib-1.5/usermanager-ui/target/org.apache.sling.samples.usermanager.ui-0.9-SNAPSHOT-sources.jar>
+[INFO] META-INF already added, skipping
+[INFO] META-INF/LICENSE already added, skipping
+[INFO] META-INF/NOTICE already added, skipping
+[INFO] META-INF/DEPENDENCIES already added, skipping
+[INFO] [ianal:verify-legal-files {execution: default}]
+[INFO] Checking legal files in: org.apache.sling.samples.usermanager.ui-0.9-SNAPSHOT.jar
+[INFO] Checking legal files in: org.apache.sling.samples.usermanager.ui-0.9-SNAPSHOT-sources.jar
+[INFO] [install:install {execution: default-install}]
+[INFO] Installing <https://builds.apache.org/job/sling-samples-1.5/ws/contrib-1.5/usermanager-ui/target/org.apache.sling.samples.usermanager.ui-0.9-SNAPSHOT.jar> to /home/jenkins/jenkins-slave/maven-repositories/0/org/apache/sling/samples/org.apache.sling.samples.usermanager.ui/0.9-SNAPSHOT/org.apache.sling.samples.usermanager.ui-0.9-SNAPSHOT.jar
+[INFO] Installing <https://builds.apache.org/job/sling-samples-1.5/ws/contrib-1.5/usermanager-ui/target/org.apache.sling.samples.usermanager.ui-0.9-SNAPSHOT-sources.jar> to /home/jenkins/jenkins-slave/maven-repositories/0/org/apache/sling/samples/org.apache.sling.samples.usermanager.ui/0.9-SNAPSHOT/org.apache.sling.samples.usermanager.ui-0.9-SNAPSHOT-sources.jar
+[INFO] [bundle:install {execution: default-install}]
+[INFO] Local OBR update disabled (enable with -DobrRepository)
+[JENKINS] Archiving <https://builds.apache.org/job/sling-samples-1.5/ws/contrib-1.5/usermanager-ui/target/org.apache.sling.samples.usermanager.ui-0.9-SNAPSHOT-sources.jar> to /home/hudson/hudson/jobs/sling-samples-1.5/modules/org.apache.sling.samples$org.apache.sling.samples.usermanager.ui/builds/2012-03-30_03-13-43/archive/org.apache.sling.samples/org.apache.sling.samples.usermanager.ui/0.9-SNAPSHOT/org.apache.sling.samples.usermanager.ui-0.9-SNAPSHOT-sources.jar
+[INFO] ------------------------------------------------------------------------
+[INFO] Building Apache Sling Access Manager UI sample
+[INFO]    task-segment: [clean, install]
+[INFO] ------------------------------------------------------------------------
+[INFO] [clean:clean {execution: default-clean}]
+[INFO] Deleting <https://builds.apache.org/job/sling-samples-1.5/ws/contrib-1.5/accessmanager-ui/target>
+[INFO] [enforcer:enforce {execution: enforce-java}]
+[INFO] [remote-resources:process {execution: default}]
+[INFO] [resources:resources {execution: default-resources}]
+[INFO] Using 'UTF-8' encoding to copy filtered resources.
+[INFO] Copying 14 resources
+[INFO] Copying 3 resources
+[WARNING] DEPRECATED [tasks]: Use target instead
+[INFO] [antrun:run {execution: default}]
+[WARNING] Parameter tasks is deprecated, use target instead
+[INFO] Executing tasks
+
+main:
+     [echo] **************** WARNING (SLING-443/SLING-1782) ******************************
+     [echo] On most platforms, you'll get OutOfMemoryErrors when building unless you set
+     [echo] on 32bit platforms: MAVEN_OPTS="-Xmx256M -XX:MaxPermSize=256M", see SLING-443
+     [echo] on 64bit platforms: MAVEN_OPTS="-Xmx512M -XX:MaxPermSize=512M", see SLING-1782
+     [echo] ******************************************************************************
+[INFO] Executed tasks
+[INFO] [yuicompressor:compress {execution: default}]
+[INFO] nothing to do, <https://builds.apache.org/job/sling-samples-1.5/ws/contrib-1.5/accessmanager-ui/src/main/resources/js/accessmanager/accessmanager.min.js> is younger than original, use 'force' option or clean your target
+[INFO] nothing to do, <https://builds.apache.org/job/sling-samples-1.5/ws/contrib-1.5/accessmanager-ui/src/main/resources/css/accessmanager/accessmanager.min.css> is younger than original, use 'force' option or clean your target
+[INFO] nothing to do, <https://builds.apache.org/job/sling-samples-1.5/ws/contrib-1.5/accessmanager-ui/src/main/resources/js/accessmanager/accessmanager.min.js> is younger than original, use 'force' option or clean your target
+[INFO] nothing to do, <https://builds.apache.org/job/sling-samples-1.5/ws/contrib-1.5/accessmanager-ui/src/main/resources/css/accessmanager/accessmanager.min.css> is younger than original, use 'force' option or clean your target
+[INFO] nb warnings: 0, nb errors: 0
+[INFO] [compiler:compile {execution: default-compile}]
+[INFO] Nothing to compile - all classes are up to date
+[INFO] [scr:scr {execution: generate-scr-scrdescriptor}]
+[INFO] [resources:testResources {execution: default-testResources}]
+[INFO] Using 'UTF-8' encoding to copy filtered resources.
+[INFO] skip non existing resourceDirectory <https://builds.apache.org/job/sling-samples-1.5/ws/contrib-1.5/accessmanager-ui/src/test/resources>
+[INFO] Copying 3 resources
+[INFO] [compiler:testCompile {execution: default-testCompile}]
+[INFO] No sources to compile
+[INFO] [surefire:test {execution: default-test}]
+[INFO] Surefire report directory: <https://builds.apache.org/job/sling-samples-1.5/ws/contrib-1.5/accessmanager-ui/target/surefire-reports>
+
+-------------------------------------------------------
+ T E S T S
+-------------------------------------------------------
+There are no tests to run.
+
+Results :
+
+Tests run: 0, Failures: 0, Errors: 0, Skipped: 0
+
+[JENKINS] Recording test results[INFO] [animal-sniffer:check {execution: default}]
+[INFO] Checking unresolved references to org.codehaus.mojo.signature:java15:1.0
+
+[INFO] [bundle:bundle {execution: default-bundle}]
+[WARNING] Warning building bundle org.apache.sling.samples:org.apache.sling.samples.accessmanager.ui:bundle:0.9-SNAPSHOT : Did not find matching referal for *
+[INFO] Preparing source:jar
+[WARNING] Removing: jar from forked lifecycle, to prevent recursive invocation.
+[JENKINS] Archiving <https://builds.apache.org/job/sling-samples-1.5/ws/contrib-1.5/accessmanager-ui/pom.xml> to /home/hudson/hudson/jobs/sling-samples-1.5/modules/org.apache.sling.samples$org.apache.sling.samples.accessmanager.ui/builds/2012-03-30_03-13-43/archive/org.apache.sling.samples/org.apache.sling.samples.accessmanager.ui/0.9-SNAPSHOT/org.apache.sling.samples.accessmanager.ui-0.9-SNAPSHOT.pom
+[JENKINS] Archiving <https://builds.apache.org/job/sling-samples-1.5/ws/contrib-1.5/accessmanager-ui/target/org.apache.sling.samples.accessmanager.ui-0.9-SNAPSHOT.jar> to /home/hudson/hudson/jobs/sling-samples-1.5/modules/org.apache.sling.samples$org.apache.sling.samples.accessmanager.ui/builds/2012-03-30_03-13-43/archive/org.apache.sling.samples/org.apache.sling.samples.accessmanager.ui/0.9-SNAPSHOT/org.apache.sling.samples.accessmanager.ui-0.9-SNAPSHOT.jar
+[INFO] [enforcer:enforce {execution: enforce-java}]
+[INFO] [source:jar {execution: attach-sources}]
+[INFO] META-INF already added, skipping
+[INFO] META-INF/LICENSE already added, skipping
+[INFO] META-INF/NOTICE already added, skipping
+[INFO] META-INF/DEPENDENCIES already added, skipping
+[INFO] Building jar: <https://builds.apache.org/job/sling-samples-1.5/ws/contrib-1.5/accessmanager-ui/target/org.apache.sling.samples.accessmanager.ui-0.9-SNAPSHOT-sources.jar>
+[INFO] META-INF already added, skipping
+[INFO] META-INF/LICENSE already added, skipping
+[INFO] META-INF/NOTICE already added, skipping
+[INFO] META-INF/DEPENDENCIES already added, skipping
+[INFO] [ianal:verify-legal-files {execution: default}]
+[INFO] Checking legal files in: org.apache.sling.samples.accessmanager.ui-0.9-SNAPSHOT.jar
+[INFO] Checking legal files in: org.apache.sling.samples.accessmanager.ui-0.9-SNAPSHOT-sources.jar
+[INFO] [install:install {execution: default-install}]
+[INFO] Installing <https://builds.apache.org/job/sling-samples-1.5/ws/contrib-1.5/accessmanager-ui/target/org.apache.sling.samples.accessmanager.ui-0.9-SNAPSHOT.jar> to /home/jenkins/jenkins-slave/maven-repositories/0/org/apache/sling/samples/org.apache.sling.samples.accessmanager.ui/0.9-SNAPSHOT/org.apache.sling.samples.accessmanager.ui-0.9-SNAPSHOT.jar
+[INFO] Installing <https://builds.apache.org/job/sling-samples-1.5/ws/contrib-1.5/accessmanager-ui/target/org.apache.sling.samples.accessmanager.ui-0.9-SNAPSHOT-sources.jar> to /home/jenkins/jenkins-slave/maven-repositories/0/org/apache/sling/samples/org.apache.sling.samples.accessmanager.ui/0.9-SNAPSHOT/org.apache.sling.samples.accessmanager.ui-0.9-SNAPSHOT-sources.jar
+[INFO] [bundle:install {execution: default-install}]
+[INFO] Local OBR update disabled (enable with -DobrRepository)
+[JENKINS] Archiving <https://builds.apache.org/job/sling-samples-1.5/ws/contrib-1.5/accessmanager-ui/target/org.apache.sling.samples.accessmanager.ui-0.9-SNAPSHOT-sources.jar> to /home/hudson/hudson/jobs/sling-samples-1.5/modules/org.apache.sling.samples$org.apache.sling.samples.accessmanager.ui/builds/2012-03-30_03-13-43/archive/org.apache.sling.samples/org.apache.sling.samples.accessmanager.ui/0.9-SNAPSHOT/org.apache.sling.samples.accessmanager.ui-0.9-SNAPSHOT-sources.jar
+[INFO] ------------------------------------------------------------------------
+[INFO] Building Apache Sling Samples (Builder)
+[INFO]    task-segment: [clean, install]
+[INFO] ------------------------------------------------------------------------
+[INFO] [clean:clean {execution: default-clean}]
+[INFO] [site:attach-descriptor {execution: default-attach-descriptor}]
+[INFO] [install:install {execution: default-install}]
+[INFO] Installing <https://builds.apache.org/job/sling-samples-1.5/ws/contrib-1.5/pom.xml> to /home/jenkins/jenkins-slave/maven-repositories/0/org/apache/sling/sling-samples-builder/2-SNAPSHOT/sling-samples-builder-2-SNAPSHOT.pom
+[JENKINS] Archiving <https://builds.apache.org/job/sling-samples-1.5/ws/contrib-1.5/pom.xml> to /home/hudson/hudson/jobs/sling-samples-1.5/modules/org.apache.sling$sling-samples-builder/builds/2012-03-30_03-13-42/archive/org.apache.sling/sling-samples-builder/2-SNAPSHOT/sling-samples-builder-2-SNAPSHOT.pom
+[INFO] 
+[INFO] 
+[INFO] ------------------------------------------------------------------------
+[INFO] Reactor Summary:
+[INFO] ------------------------------------------------------------------------
+[INFO] Apache Sling ESP blog sample .......................... SUCCESS [20.231s]
+[INFO] Apache Sling Javashell sample ......................... SUCCESS [3.668s]
+[INFO] Apache Sling Sample Path Based Resource Type Provider . SUCCESS [12.550s]
+[INFO] Apache Sling Sample Post Servlet Extensions ........... SUCCESS [5.441s]
+[INFO] Apache Sling Sample Application ....................... SUCCESS [8.255s]
+[INFO] Apache Sling - Slingshot Demo ......................... SUCCESS [5.227s]
+[INFO] Apache Sling Webloader Service ........................ SUCCESS [3.886s]
+[INFO] Apache Sling Webloader User Interface ................. SUCCESS [3.669s]
+[INFO] Apache Sling Sample Custom Login Form ................. SUCCESS [4.275s]
+[INFO] Apache Sling Slingbucks - sample coffee store management application  SUCCESS [4.470s]
+[INFO] Dependency Install Sample ............................. SUCCESS [3.199s]
+[INFO] Apache Sling Sample Framework Fragment Bundle ......... SUCCESS [7.564s]
+[INFO] Apache Sling User Manager UI sample ................... SUCCESS [5.916s]
+[INFO] Apache Sling Access Manager UI sample ................. SUCCESS [3.523s]
+[INFO] Apache Sling Samples (Builder) ........................ SUCCESS [1.059s]
+[INFO] ------------------------------------------------------------------------
+[INFO] ------------------------------------------------------------------------
+[INFO] BUILD SUCCESSFUL
+[INFO] ------------------------------------------------------------------------
+[INFO] Total time: 1 minute 50 seconds
+[INFO] Finished at: Fri Mar 30 03:16:02 UTC 2012
+[INFO] Final Memory: 71M/106M
+[INFO] ------------------------------------------------------------------------
+channel stopped
+[locks-and-latches] Releasing all the locks
+[locks-and-latches] All the locks released
+Maven RedeployPublished use remote ubuntu1 maven settings from : /home/jenkins/.m2/settings.xml
+[INFO] Deployment in https://repository.apache.org/content/repositories/snapshots/ (id=,uniqueVersion=false)
+Deploying the main artifact installing-dependencies-sample-0.0.1-SNAPSHOT.jar
+ERROR: Error deploying artifact: Failed to transfer file: https://repository.apache.org/content/repositories/snapshots/org/apache/sling/installing-dependencies-sample/0.0.1-SNAPSHOT/installing-dependencies-sample-0.0.1-SNAPSHOT.jar. Return code is: 401, ReasonPhrase:Unauthorized.
+org.apache.maven.artifact.deployer.ArtifactDeploymentException: Error deploying artifact: Failed to transfer file: https://repository.apache.org/content/repositories/snapshots/org/apache/sling/installing-dependencies-sample/0.0.1-SNAPSHOT/installing-dependencies-sample-0.0.1-SNAPSHOT.jar. Return code is: 401, ReasonPhrase:Unauthorized.
+	at hudson.maven.artifact.deployer.DefaultArtifactDeployer.deploy(DefaultArtifactDeployer.java:175)
+	at hudson.maven.reporters.MavenArtifactRecord.deploy(MavenArtifactRecord.java:182)
+	at hudson.maven.RedeployPublisher.perform(RedeployPublisher.java:176)
+	at hudson.tasks.BuildStepMonitor$1.perform(BuildStepMonitor.java:19)
+	at hudson.model.AbstractBuild$AbstractRunner.perform(AbstractBuild.java:703)
+	at hudson.model.AbstractBuild$AbstractRunner.performAllBuildSteps(AbstractBuild.java:678)
+	at hudson.maven.MavenModuleSetBuild$RunnerImpl.post2(MavenModuleSetBuild.java:998)
+	at hudson.model.AbstractBuild$AbstractRunner.post(AbstractBuild.java:625)
+	at hudson.model.Run.run(Run.java:1435)
+	at hudson.maven.MavenModuleSetBuild.run(MavenModuleSetBuild.java:481)
+	at hudson.model.ResourceController.execute(ResourceController.java:88)
+	at hudson.model.Executor.run(Executor.java:238)
+Caused by: org.apache.maven.wagon.TransferFailedException: Failed to transfer file: https://repository.apache.org/content/repositories/snapshots/org/apache/sling/installing-dependencies-sample/0.0.1-SNAPSHOT/installing-dependencies-sample-0.0.1-SNAPSHOT.jar. Return code is: 401, ReasonPhrase:Unauthorized.
+	at org.apache.maven.wagon.shared.http4.AbstractHttpClientWagon.put(AbstractHttpClientWagon.java:562)
+	at org.apache.maven.wagon.shared.http4.AbstractHttpClientWagon.put(AbstractHttpClientWagon.java:471)
+	at org.apache.maven.wagon.shared.http4.AbstractHttpClientWagon.put(AbstractHttpClientWagon.java:451)
+	at org.apache.maven.repository.legacy.DefaultWagonManager.putRemoteFile(DefaultWagonManager.java:543)
+	at org.apache.maven.repository.legacy.DefaultWagonManager.putArtifact(DefaultWagonManager.java:494)
+	at hudson.maven.artifact.deployer.DefaultArtifactDeployer.deploy(DefaultArtifactDeployer.java:160)
+	... 11 more
+[INFO] Deployment failed after 1.4 sec
+Build step 'Deploy artifacts to Maven repository' changed build result to FAILURE
+
+From dev-return-26294-apmail-sling-dev-archive=sling.apache.org@sling.apache.org  Fri Mar 30 03:32:18 2012
+Return-Path: <dev-return-26294-apmail-sling-dev-archive=sling.apache.org@sling.apache.org>
+X-Original-To: apmail-sling-dev-archive@www.apache.org
+Delivered-To: apmail-sling-dev-archive@www.apache.org
+Received: from mail.apache.org (hermes.apache.org [140.211.11.3])
+	by minotaur.apache.org (Postfix) with SMTP id ADDBD923A
+	for <apmail-sling-dev-archive@www.apache.org>; Fri, 30 Mar 2012 03:32:18 +0000 (UTC)
+Received: (qmail 37670 invoked by uid 500); 30 Mar 2012 03:32:18 -0000
+Delivered-To: apmail-sling-dev-archive@sling.apache.org
+Received: (qmail 37379 invoked by uid 500); 30 Mar 2012 03:32:15 -0000
+Mailing-List: contact dev-help@sling.apache.org; run by ezmlm
+Precedence: bulk
+List-Help: <mailto:dev-help@sling.apache.org>
+List-Unsubscribe: <mailto:dev-unsubscribe@sling.apache.org>
+List-Post: <mailto:dev@sling.apache.org>
+List-Id: <dev.sling.apache.org>
+Reply-To: dev@sling.apache.org
+Delivered-To: mailing list dev@sling.apache.org
+Received: (qmail 37347 invoked by uid 99); 30 Mar 2012 03:32:14 -0000
+Received: from athena.apache.org (HELO athena.apache.org) (140.211.11.136)
+    by apache.org (qpsmtpd/0.29) with ESMTP; Fri, 30 Mar 2012 03:32:14 +0000
+X-ASF-Spam-Status: No, hits=-2000.0 required=5.0
+	tests=ALL_TRUSTED
+X-Spam-Check-By: apache.org
+Received: from [140.211.11.8] (HELO aegis.apache.org) (140.211.11.8)
+    by apache.org (qpsmtpd/0.29) with ESMTP; Fri, 30 Mar 2012 03:32:11 +0000
+Received: from aegis.apache.org (localhost [127.0.0.1])
+	by aegis.apache.org (Postfix) with ESMTP id C4FF1C00A0
+	for <dev@sling.apache.org>; Fri, 30 Mar 2012 03:31:51 +0000 (UTC)
+Date: Fri, 30 Mar 2012 03:31:51 +0000 (UTC)
+From: Apache Jenkins Server <jenkins@builds.apache.org>
+To: dev@sling.apache.org
+Message-ID: <247422794.107.1333078311766.JavaMail.hudson@aegis>
+In-Reply-To: <1042696744.1289.1332996773813.JavaMail.hudson@aegis>
+References: <1042696744.1289.1332996773813.JavaMail.hudson@aegis>
+Subject: Build failed in Jenkins: sling-contrib-1.5 #848
+MIME-Version: 1.0
+Content-Type: text/plain; charset=UTF-8
+Content-Transfer-Encoding: 7bit
+X-Jenkins-Job: sling-contrib-1.5
+X-Jenkins-Result: FAILURE
+X-Virus-Checked: Checked by ClamAV on apache.org
+
+See <https://builds.apache.org/job/sling-contrib-1.5/848/>
+
+------------------------------------------
+[...truncated 3070 lines...]
+[INFO] Copying bundle from /home/jenkins/jenkins-slave/maven-repositories/1/org/apache/sling/org.apache.sling.scripting.xproc/2.0.0-SNAPSHOT/org.apache.sling.scripting.xproc-2.0.0-SNAPSHOT.jar to <https://builds.apache.org/job/sling-contrib-1.5/ws/contrib-1.5/launchpad/testing/target/launchpad-bundles/resources/bundles/15/org.apache.sling.scripting.xproc-2.0.0-SNAPSHOT.jar>
+[INFO] snapshot org.apache.sling:org.apache.sling.extensions.apt.servlet:2.0.3-SNAPSHOT: checking for updates from apache.snapshots
+[INFO] Copying bundle from /home/jenkins/jenkins-slave/maven-repositories/1/org/apache/sling/org.apache.sling.extensions.apt.servlet/2.0.3-SNAPSHOT/org.apache.sling.extensions.apt.servlet-2.0.3-SNAPSHOT.jar to <https://builds.apache.org/job/sling-contrib-1.5/ws/contrib-1.5/launchpad/testing/target/launchpad-bundles/resources/bundles/15/org.apache.sling.extensions.apt.servlet-2.0.3-SNAPSHOT.jar>
+[INFO] snapshot org.apache.sling:org.apache.sling.extensions.apt.parser:2.0.3-SNAPSHOT: checking for updates from apache.snapshots
+[INFO] Copying bundle from /home/jenkins/jenkins-slave/maven-repositories/1/org/apache/sling/org.apache.sling.extensions.apt.parser/2.0.3-SNAPSHOT/org.apache.sling.extensions.apt.parser-2.0.3-SNAPSHOT.jar to <https://builds.apache.org/job/sling-contrib-1.5/ws/contrib-1.5/launchpad/testing/target/launchpad-bundles/resources/bundles/15/org.apache.sling.extensions.apt.parser-2.0.3-SNAPSHOT.jar>
+[INFO] snapshot org.apache.sling.samples:org.apache.sling.samples.path-based.rtp:2.0.5-SNAPSHOT: checking for updates from apache.snapshots
+Downloading: http://repository.apache.org/snapshots/org/apache/sling/samples/org.apache.sling.samples.path-based.rtp/2.0.5-SNAPSHOT/org.apache.sling.samples.path-based.rtp-2.0.5-SNAPSHOT.jar
+[INFO] Copying bundle from /home/jenkins/jenkins-slave/maven-repositories/1/org/apache/sling/samples/org.apache.sling.samples.path-based.rtp/2.0.5-SNAPSHOT/org.apache.sling.samples.path-based.rtp-2.0.5-SNAPSHOT.jar to <https://builds.apache.org/job/sling-contrib-1.5/ws/contrib-1.5/launchpad/testing/target/launchpad-bundles/resources/bundles/15/org.apache.sling.samples.path-based.rtp-2.0.5-SNAPSHOT.jar>
+[INFO] [remote-resources:process {execution: default}]
+[INFO] [resources:resources {execution: default-resources}]
+[INFO] Using 'UTF-8' encoding to copy filtered resources.
+[INFO] Copying 0 resource
+[INFO] Copying 3 resources
+[INFO] [build-helper:reserve-network-port {execution: reserve-network-port}]
+[INFO] Reserved port 51931 for http.port
+[WARNING] DEPRECATED [tasks]: Use target instead
+[INFO] [antrun:run {execution: default}]
+[WARNING] Parameter tasks is deprecated, use target instead
+[INFO] Executing tasks
+
+main:
+     [echo] **************** WARNING (SLING-443/SLING-1782) ******************************
+     [echo] On most platforms, you'll get OutOfMemoryErrors when building unless you set
+     [echo] on 32bit platforms: MAVEN_OPTS="-Xmx256M -XX:MaxPermSize=256M", see SLING-443
+     [echo] on 64bit platforms: MAVEN_OPTS="-Xmx512M -XX:MaxPermSize=512M", see SLING-1782
+     [echo] ******************************************************************************
+[INFO] Executed tasks
+[INFO] [compiler:compile {execution: default-compile}]
+[INFO] No sources to compile
+[INFO] [resources:testResources {execution: default-testResources}]
+[INFO] Using 'UTF-8' encoding to copy filtered resources.
+[INFO] Copying 50 resources
+[INFO] Copying 3 resources
+[INFO] [compiler:testCompile {execution: default-testCompile}]
+[INFO] Compiling 7 source files to <https://builds.apache.org/job/sling-contrib-1.5/ws/contrib-1.5/launchpad/testing/target/test-classes>
+[WARNING] DEPRECATED [systemProperties]: Use systemPropertyVariables instead.
+[INFO] [surefire:test {execution: default-test}]
+[INFO] Surefire report directory: <https://builds.apache.org/job/sling-contrib-1.5/ws/contrib-1.5/launchpad/testing/target/surefire-reports>
+
+-------------------------------------------------------
+ T E S T S
+-------------------------------------------------------
+There are no tests to run.
+
+Results :
+
+Tests run: 0, Failures: 0, Errors: 0, Skipped: 0
+
+[JENKINS] Recording test results[INFO] [animal-sniffer:check {execution: default}]
+[INFO] Checking unresolved references to org.codehaus.mojo.signature:java15:1.0
+
+[INFO] [war:war {execution: default-war}]
+[INFO] Packaging webapp
+[INFO] Assembling webapp [org.apache.sling.launchpad.contrib-testing] in [<https://builds.apache.org/job/sling-contrib-1.5/ws/contrib-1.5/launchpad/testing/target/org.apache.sling.launchpad.contrib-testing-4-SNAPSHOT]>
+[INFO] Processing war project
+[INFO] Copying webapp webResources [<https://builds.apache.org/job/sling-contrib-1.5/ws/contrib-1.5/launchpad/testing/target/launchpad-bundles]> to [<https://builds.apache.org/job/sling-contrib-1.5/ws/contrib-1.5/launchpad/testing/target/org.apache.sling.launchpad.contrib-testing-4-SNAPSHOT]>
+[INFO] Copying webapp webResources [<https://builds.apache.org/job/sling-contrib-1.5/ws/contrib-1.5/launchpad/testing]> to [<https://builds.apache.org/job/sling-contrib-1.5/ws/contrib-1.5/launchpad/testing/target/org.apache.sling.launchpad.contrib-testing-4-SNAPSHOT]>
+[INFO] Processing overlay [ id org.apache.sling:org.apache.sling.launchpad.base:webapp]
+[INFO] Webapp assembled in [382 msecs]
+[INFO] Building war: <https://builds.apache.org/job/sling-contrib-1.5/ws/contrib-1.5/launchpad/testing/target/org.apache.sling.launchpad.contrib-testing-4-SNAPSHOT.war>
+[INFO] WEB-INF/web.xml already added, skipping
+[INFO] Preparing source:jar
+[WARNING] Removing: jar from forked lifecycle, to prevent recursive invocation.
+[JENKINS] Archiving <https://builds.apache.org/job/sling-contrib-1.5/ws/contrib-1.5/launchpad/testing/pom.xml> to /home/hudson/hudson/jobs/sling-contrib-1.5/modules/org.apache.sling$org.apache.sling.launchpad.contrib-testing/builds/2012-03-30_03-16-13/archive/org.apache.sling/org.apache.sling.launchpad.contrib-testing/4-SNAPSHOT/org.apache.sling.launchpad.contrib-testing-4-SNAPSHOT.pom
+[JENKINS] Archiving <https://builds.apache.org/job/sling-contrib-1.5/ws/contrib-1.5/launchpad/testing/target/org.apache.sling.launchpad.contrib-testing-4-SNAPSHOT.war> to /home/hudson/hudson/jobs/sling-contrib-1.5/modules/org.apache.sling$org.apache.sling.launchpad.contrib-testing/builds/2012-03-30_03-16-13/archive/org.apache.sling/org.apache.sling.launchpad.contrib-testing/4-SNAPSHOT/org.apache.sling.launchpad.contrib-testing-4-SNAPSHOT.war
+[INFO] [enforcer:enforce {execution: enforce-java}]
+[INFO] [source:jar {execution: attach-sources}]
+[INFO] META-INF already added, skipping
+[INFO] META-INF already added, skipping
+[INFO] META-INF/LICENSE already added, skipping
+[INFO] META-INF/NOTICE already added, skipping
+[INFO] META-INF/DEPENDENCIES already added, skipping
+[INFO] Building jar: <https://builds.apache.org/job/sling-contrib-1.5/ws/contrib-1.5/launchpad/testing/target/org.apache.sling.launchpad.contrib-testing-4-SNAPSHOT-sources.jar>
+[INFO] META-INF already added, skipping
+[INFO] META-INF already added, skipping
+[INFO] META-INF/LICENSE already added, skipping
+[INFO] META-INF/NOTICE already added, skipping
+[INFO] META-INF/DEPENDENCIES already added, skipping
+[WARNING] DEPRECATED [tasks]: Use target instead
+[INFO] [antrun:run {execution: delete-sling-folder}]
+[WARNING] Parameter tasks is deprecated, use target instead
+[INFO] Executing tasks
+
+main:
+     [echo] SLING-845 - delete parent sling folder before integration tests
+[INFO] Executed tasks
+[INFO] [cargo:start {execution: start-container}]
+[INFO] [beddedLocalContainer] Jetty 6.x Embedded starting...
+2012-03-30 03:31:02.343:INFO::Logging to STDERR via org.mortbay.log.StdErrLog
+2012-03-30 03:31:02.390:INFO::jetty-6.1.26
+2012-03-30 03:31:02.492:INFO::Extract <https://builds.apache.org/job/sling-contrib-1.5/ws/contrib-1.5/launchpad/testing/target/org.apache.sling.launchpad.contrib-testing-4-SNAPSHOT.war> to /tmp/Jetty_0_0_0_0_51931_org.apache.sling.launchpad.contrib.testing.4.SNAPSHOT.war__org.apache.sling.launchpad.contrib.testing.4.SNAPSHOT__tnfk2g/webapp
+log4j:WARN No appenders could be found for logger (org.apache.jasper.compiler.JspRuntimeContext).
+log4j:WARN Please initialize the log4j system properly.
+2012-03-30 03:31:04.460:INFO:/org.apache.sling.launchpad.contrib-testing-4-SNAPSHOT:sling: Setting sling.home=<https://builds.apache.org/job/sling-contrib-1.5/ws/contrib-1.5/sling/_org.apache.sling.launchpad.contrib-testing-4-SNAPSHOT> (servlet context path)
+2012-03-30 03:31:04.462:INFO:/org.apache.sling.launchpad.contrib-testing-4-SNAPSHOT:sling: Checking launcher JAR in <https://builds.apache.org/job/sling-contrib-1.5/ws/contrib-1.5/sling/_org.apache.sling.launchpad.contrib-testing-4-SNAPSHOT>
+2012-03-30 03:31:04.463:INFO:/org.apache.sling.launchpad.contrib-testing-4-SNAPSHOT:sling: Checking launcher JAR in folder <https://builds.apache.org/job/sling-contrib-1.5/ws/contrib-1.5/sling/_org.apache.sling.launchpad.contrib-testing-4-SNAPSHOT>
+2012-03-30 03:31:04.466:INFO:/org.apache.sling.launchpad.contrib-testing-4-SNAPSHOT:sling: Installing new launcher: file:/tmp/Jetty_0_0_0_0_51931_org.apache.sling.launchpad.contrib.testing.4.SNAPSHOT.war__org.apache.sling.launchpad.contrib.testing.4.SNAPSHOT__tnfk2g/webapp/WEB-INF//resources/org.apache.sling.launchpad.base.jar, 2.3.1.SNAPSHOT, Last-Modified:Fri Mar 30 01:28:08 UTC 2012 (org.apache.sling.launchpad.base.jar.1333078264466)
+2012-03-30 03:31:04.466:INFO:/org.apache.sling.launchpad.contrib-testing-4-SNAPSHOT:sling: Loading launcher class org.apache.sling.launchpad.base.webapp.SlingServletDelegate from org.apache.sling.launchpad.base.jar.1333078264466
+2012-03-30 03:31:04.474:INFO:/org.apache.sling.launchpad.contrib-testing-4-SNAPSHOT:sling: Starting launcher ...
+2012-03-30 03:31:04.474:INFO:/org.apache.sling.launchpad.contrib-testing-4-SNAPSHOT:sling: Starting Apache Sling in <https://builds.apache.org/job/sling-contrib-1.5/ws/contrib-1.5/sling/_org.apache.sling.launchpad.contrib-testing-4-SNAPSHOT>
+30.03.2012 03:31:05.793 *INFO* [FelixStartLevel] org.apache.sling.commons.logservice Service [org.apache.sling.commons.logservice.internal.LogServiceFactory,7] ServiceEvent REGISTERED
+30.03.2012 03:31:05.795 *INFO* [FelixStartLevel] org.apache.sling.commons.logservice Service [org.apache.sling.commons.logservice.internal.LogReaderServiceFactory,8] ServiceEvent REGISTERED
+30.03.2012 03:31:05.796 *INFO* [FelixDispatchQueue] org.apache.sling.commons.logservice BundleEvent STARTED
+30.03.2012 03:31:05.796 *INFO* [FelixDispatchQueue] jcl.over.slf4j BundleEvent RESOLVED
+30.03.2012 03:31:05.796 *INFO* [FelixDispatchQueue] jcl.over.slf4j BundleEvent STARTED
+30.03.2012 03:31:05.797 *INFO* [FelixDispatchQueue] log4j.over.slf4j BundleEvent RESOLVED
+30.03.2012 03:31:05.797 *INFO* [FelixDispatchQueue] log4j.over.slf4j BundleEvent STARTED
+*sys-package-mgr*: processing new jar, '/home/jenkins/jenkins-slave/maven-agent.jar'
+*sys-package-mgr*: processing new jar, '/home/jenkins/jenkins-slave/classworlds.jar'
+*sys-package-mgr*: processing new jar, '/home/jenkins/tools/java/jdk1.5.0_22-32/jre/lib/rt.jar'
+*sys-package-mgr*: processing new jar, '/home/jenkins/tools/java/jdk1.5.0_22-32/jre/lib/jsse.jar'
+*sys-package-mgr*: processing new jar, '/home/jenkins/tools/java/jdk1.5.0_22-32/jre/lib/jce.jar'
+*sys-package-mgr*: processing new jar, '/home/jenkins/tools/java/jdk1.5.0_22-32/jre/lib/charsets.jar'
+*sys-package-mgr*: processing new jar, '/home/jenkins/tools/java/jdk1.5.0_22-32/jre/lib/ext/sunjce_provider.jar'
+*sys-package-mgr*: processing new jar, '/home/jenkins/tools/java/jdk1.5.0_22-32/jre/lib/ext/localedata.jar'
+*sys-package-mgr*: processing new jar, '/home/jenkins/tools/java/jdk1.5.0_22-32/jre/lib/ext/sunpkcs11.jar'
+*sys-package-mgr*: processing new jar, '/home/jenkins/tools/java/jdk1.5.0_22-32/jre/lib/ext/dnsns.jar'
+2012-03-30 03:31:18.400:INFO:/org.apache.sling.launchpad.contrib-testing-4-SNAPSHOT:sling: Apache Sling successfully started in <https://builds.apache.org/job/sling-contrib-1.5/ws/contrib-1.5/sling/_org.apache.sling.launchpad.contrib-testing-4-SNAPSHOT>
+2012-03-30 03:31:18.400:INFO:/org.apache.sling.launchpad.contrib-testing-4-SNAPSHOT:sling: Startup completed
+2012-03-30 03:31:18.400:INFO:/org.apache.sling.launchpad.contrib-testing-4-SNAPSHOT:sling: Servlet sling initialized
+2012-03-30 03:31:18.409:INFO::Extract <https://builds.apache.org/job/sling-contrib-1.5/ws/contrib-1.5/launchpad/testing/target/cargo/cargocpc.war> to /tmp/Jetty_0_0_0_0_51931_cargocpc.war__cargocpc__dmlwk0/webapp
+2012-03-30 03:31:18.447:INFO::Started SelectChannelConnector@0.0.0.0:51931
+[INFO] [beddedLocalContainer] Jetty 6.x Embedded started on port [51931]
+[WARNING] DEPRECATED [systemProperties]: Use systemPropertyVariables instead.
+[INFO] [surefire:test {execution: surefire-integration-test}]
+[INFO] Surefire report directory: <https://builds.apache.org/job/sling-contrib-1.5/ws/contrib-1.5/launchpad/testing/target/surefire-reports>
+
+-------------------------------------------------------
+ T E S T S
+-------------------------------------------------------
+Running org.apache.sling.launchpad.webapp.integrationtest.PathBasedResourceTypeTest
+Checking if the required Sling services are started (timeout 60 seconds)...
+(base URLs=http://localhost:51931/org.apache.sling.launchpad.contrib-testing-4-SNAPSHOT and http://localhost:51931/org.apache.sling.launchpad.contrib-testing-4-SNAPSHOT)
+Sling services seem to be started, continuing with integration tests.
+Tests run: 2, Failures: 0, Errors: 0, Skipped: 0, Time elapsed: 0.907 sec
+Running org.apache.sling.launchpad.webapp.integrationtest.apt.SimpleAptRenderingTest
+Tests run: 1, Failures: 0, Errors: 0, Skipped: 0, Time elapsed: 0.101 sec
+Running org.apache.sling.launchpad.webapp.integrationtest.SlingResourceTypeRenderingTest
+Tests run: 5, Failures: 0, Errors: 0, Skipped: 0, Time elapsed: 0.701 sec
+Running org.apache.sling.launchpad.webapp.integrationtest.xproc.XsltTest
+<?xml version="1.0" encoding="UTF-8"?><no_xml jcr:primaryType="sling:Folder" jcr:created="2012-03-30T03:31:21.426Z" jcr:createdBy="admin" sling:resourceType="XsltTest1333078280622" title="no_xml" xmlns:mix="http://www.jcp.org/jcr/mix/1.0" xmlns:test2="test2=http://sling.apache.org/test/two" xmlns:fn="http://www.w3.org/2005/xpath-functions" xmlns:ocm="http://jackrabbit.apache.org/ocm" xmlns:slingevent="http://sling.apache.org/jcr/event/1.0" xmlns:xs="http://www.w3.org/2001/XMLSchema" xmlns:sv="http://www.jcp.org/jcr/sv/1.0" xmlns:test1="http://sling.apache.org/test/one" xmlns:nt="http://www.jcp.org/jcr/nt/1.0" xmlns:sling="http://sling.apache.org/jcr/sling/1.0" xmlns:fn_old="http://www.w3.org/2004/10/xpath-functions" xmlns:rep="internal" xmlns:jcr="http://www.jcp.org/jcr/1.0"/>
+Tests run: 3, Failures: 0, Errors: 0, Skipped: 0, Time elapsed: 0.905 sec
+Running org.apache.sling.launchpad.webapp.integrationtest.GetStarTest
+Tests run: 1, Failures: 0, Errors: 0, Skipped: 0, Time elapsed: 0.086 sec
+Running org.apache.sling.launchpad.webapp.integrationtest.scala.ScalaScriptingTest
+Tests run: 3, Failures: 0, Errors: 0, Skipped: 0, Time elapsed: 9.411 sec
+
+Results :
+
+Tests run: 15, Failures: 0, Errors: 0, Skipped: 0
+
+[JENKINS] Recording test results
+[INFO] [cargo:stop {execution: stop-container}]
+[INFO] [beddedLocalContainer] Jetty 6.x Embedded is stopping...
+2012-03-30 03:31:31.854:INFO::Stopped SelectChannelConnector@0.0.0.0:51931
+[INFO] [beddedLocalContainer] Jetty 6.x Embedded is stopped
+[INFO] [ianal:verify-legal-files {execution: default}]
+[INFO] Checking legal files in: org.apache.sling.launchpad.contrib-testing-4-SNAPSHOT.war
+[INFO] Checking legal files in: org.apache.sling.launchpad.contrib-testing-4-SNAPSHOT-sources.jar
+[INFO] [install:install {execution: default-install}]
+[INFO] Installing <https://builds.apache.org/job/sling-contrib-1.5/ws/contrib-1.5/launchpad/testing/target/org.apache.sling.launchpad.contrib-testing-4-SNAPSHOT.war> to /home/jenkins/jenkins-slave/maven-repositories/1/org/apache/sling/org.apache.sling.launchpad.contrib-testing/4-SNAPSHOT/org.apache.sling.launchpad.contrib-testing-4-SNAPSHOT.war
+[INFO] Installing <https://builds.apache.org/job/sling-contrib-1.5/ws/contrib-1.5/launchpad/testing/target/org.apache.sling.launchpad.contrib-testing-4-SNAPSHOT-sources.jar> to /home/jenkins/jenkins-slave/maven-repositories/1/org/apache/sling/org.apache.sling.launchpad.contrib-testing/4-SNAPSHOT/org.apache.sling.launchpad.contrib-testing-4-SNAPSHOT-sources.jar
+2012-03-30 03:31:32.395:INFO:/org.apache.sling.launchpad.contrib-testing-4-SNAPSHOT:sling: Apache Sling has been stopped
+[JENKINS] Archiving <https://builds.apache.org/job/sling-contrib-1.5/ws/contrib-1.5/launchpad/testing/target/org.apache.sling.launchpad.contrib-testing-4-SNAPSHOT-sources.jar> to /home/hudson/hudson/jobs/sling-contrib-1.5/modules/org.apache.sling$org.apache.sling.launchpad.contrib-testing/builds/2012-03-30_03-16-13/archive/org.apache.sling/org.apache.sling.launchpad.contrib-testing/4-SNAPSHOT/org.apache.sling.launchpad.contrib-testing-4-SNAPSHOT-sources.jar
+[INFO] ------------------------------------------------------------------------
+[INFO] Building Apache Sling Contrib (Builder)
+[INFO]    task-segment: [clean, install]
+[INFO] ------------------------------------------------------------------------
+[INFO] [clean:clean {execution: default-clean}]
+[INFO] Deleting file-set: <https://builds.apache.org/job/sling-contrib-1.5/ws/contrib-1.5> (included: [derby.log, cachedir, sling], excluded: [])
+[INFO] [site:attach-descriptor {execution: default-attach-descriptor}]
+[INFO] [install:install {execution: default-install}]
+[INFO] Installing <https://builds.apache.org/job/sling-contrib-1.5/ws/contrib-1.5/pom.xml> to /home/jenkins/jenkins-slave/maven-repositories/1/org/apache/sling/sling-contrib-builder/2-SNAPSHOT/sling-contrib-builder-2-SNAPSHOT.pom
+[JENKINS] Archiving <https://builds.apache.org/job/sling-contrib-1.5/ws/contrib-1.5/pom.xml> to /home/hudson/hudson/jobs/sling-contrib-1.5/modules/org.apache.sling$sling-contrib-builder/builds/2012-03-30_03-16-11/archive/org.apache.sling/sling-contrib-builder/2-SNAPSHOT/sling-contrib-builder-2-SNAPSHOT.pom
+[INFO] 
+[INFO] 
+[INFO] ------------------------------------------------------------------------
+[INFO] Reactor Summary:
+[INFO] ------------------------------------------------------------------------
+[INFO] Apache Sling Commons Java Compiler .................... SUCCESS [59.688s]
+[INFO] Apache Sling Commons FileSystem ClassLoader ........... SUCCESS [4.147s]
+[INFO] Apache Sling Commons HTML Utilities ................... SUCCESS [5.178s]
+[INFO] Apache Sling APT parser ............................... SUCCESS [7.445s]
+[INFO] Apache Sling APT servlet .............................. SUCCESS [4.749s]
+[INFO] Apache Sling Dojo JavaScript Library .................. SUCCESS [1:40.633s]
+[INFO] Apache Sling Dojo Data Extension ...................... SUCCESS [3.448s]
+[INFO] Apache Sling Google Web Toolkit Servlet Library ....... SUCCESS [18.886s]
+[INFO] Apache Sling Google Web Toolkit Sample ................ SUCCESS [40.530s]
+[INFO] Apache Sling Internationalization Support ............. SUCCESS [16.934s]
+[INFO] Apache Sling OSGi Bundle Repository ................... SUCCESS [7.476s]
+[INFO] Apache Sling Rewriter ................................. SUCCESS [6.478s]
+[INFO] Apache Sling Repository Accessor ...................... SUCCESS [4.906s]
+[INFO] Apache Sling JCR Java Compiler ........................ SUCCESS [6.421s]
+[INFO] Apache Sling JCR Prefs ................................ SUCCESS [4.734s]
+[INFO] Apache Sling Atom Tag Library ......................... SUCCESS [6.238s]
+[INFO] Apache Sling Scripting Freemarker Support ............. SUCCESS [17.565s]
+[INFO] Apache Sling Scripting Java Support ................... SUCCESS [7.565s]
+[INFO] Apache Sling Scripting JST Support .................... SUCCESS [12.278s]
+[INFO] Apache Sling Scripting Python Support ................. SUCCESS [10.852s]
+[INFO] Apache Sling Scripting Ruby Support ................... SUCCESS [46.809s]
+[INFO] Scala Script Engine ................................... SUCCESS [53.394s]
+[INFO] Apache Sling Scala Scripting Configuration ............ SUCCESS [6.993s]
+[INFO] Scala for Sling Demo Application - Hello World ........ SUCCESS [3.356s]
+[INFO] Scala for Sling Demo Application - Forum .............. SUCCESS [3.976s]
+[INFO] Apache Sling Scripting Velocity Support ............... SUCCESS [8.876s]
+[INFO] Apache Sling Scripting W3C XML Processing Support ..... SUCCESS [6.998s]
+[INFO] Apache Sling Features for ServiceMix Kernel ........... SUCCESS [4.221s]
+[INFO] Apache Sling Launchpad Contrib Testing ................ SUCCESS [6:18.119s]
+[INFO] Apache Sling Contrib (Builder) ........................ SUCCESS [10.625s]
+[INFO] ------------------------------------------------------------------------
+[INFO] ------------------------------------------------------------------------
+[INFO] BUILD SUCCESSFUL
+[INFO] ------------------------------------------------------------------------
+[INFO] Total time: 15 minutes 6 seconds
+[INFO] Finished at: Fri Mar 30 03:31:46 UTC 2012
+[INFO] Final Memory: 107M/184M
+[INFO] ------------------------------------------------------------------------
+channel stopped
+2012-03-30 03:31:48.216:INFO::Shutdown hook executing
+2012-03-30 03:31:48.217:INFO::Shutdown hook complete
+[locks-and-latches] Releasing all the locks
+[locks-and-latches] All the locks released
+Maven RedeployPublished use remote ubuntu1 maven settings from : /home/jenkins/.m2/settings.xml
+[INFO] Deployment in https://repository.apache.org/content/repositories/snapshots/ (id=,uniqueVersion=false)
+Deploying the main artifact org.apache.sling.atom.taglib-0.9.0-SNAPSHOT.jar
+ERROR: Error deploying artifact: Failed to transfer file: https://repository.apache.org/content/repositories/snapshots/org/apache/sling/org.apache.sling.atom.taglib/0.9.0-SNAPSHOT/org.apache.sling.atom.taglib-0.9.0-SNAPSHOT.jar. Return code is: 401, ReasonPhrase:Unauthorized.
+org.apache.maven.artifact.deployer.ArtifactDeploymentException: Error deploying artifact: Failed to transfer file: https://repository.apache.org/content/repositories/snapshots/org/apache/sling/org.apache.sling.atom.taglib/0.9.0-SNAPSHOT/org.apache.sling.atom.taglib-0.9.0-SNAPSHOT.jar. Return code is: 401, ReasonPhrase:Unauthorized.
+	at hudson.maven.artifact.deployer.DefaultArtifactDeployer.deploy(DefaultArtifactDeployer.java:175)
+	at hudson.maven.reporters.MavenArtifactRecord.deploy(MavenArtifactRecord.java:182)
+	at hudson.maven.RedeployPublisher.perform(RedeployPublisher.java:176)
+	at hudson.tasks.BuildStepMonitor$1.perform(BuildStepMonitor.java:19)
+	at hudson.model.AbstractBuild$AbstractRunner.perform(AbstractBuild.java:703)
+	at hudson.model.AbstractBuild$AbstractRunner.performAllBuildSteps(AbstractBuild.java:678)
+	at hudson.maven.MavenModuleSetBuild$RunnerImpl.post2(MavenModuleSetBuild.java:998)
+	at hudson.model.AbstractBuild$AbstractRunner.post(AbstractBuild.java:625)
+	at hudson.model.Run.run(Run.java:1435)
+	at hudson.maven.MavenModuleSetBuild.run(MavenModuleSetBuild.java:481)
+	at hudson.model.ResourceController.execute(ResourceController.java:88)
+	at hudson.model.Executor.run(Executor.java:238)
+Caused by: org.apache.maven.wagon.TransferFailedException: Failed to transfer file: https://repository.apache.org/content/repositories/snapshots/org/apache/sling/org.apache.sling.atom.taglib/0.9.0-SNAPSHOT/org.apache.sling.atom.taglib-0.9.0-SNAPSHOT.jar. Return code is: 401, ReasonPhrase:Unauthorized.
+	at org.apache.maven.wagon.shared.http4.AbstractHttpClientWagon.put(AbstractHttpClientWagon.java:562)
+	at org.apache.maven.wagon.shared.http4.AbstractHttpClientWagon.put(AbstractHttpClientWagon.java:471)
+	at org.apache.maven.wagon.shared.http4.AbstractHttpClientWagon.put(AbstractHttpClientWagon.java:451)
+	at org.apache.maven.repository.legacy.DefaultWagonManager.putRemoteFile(DefaultWagonManager.java:543)
+	at org.apache.maven.repository.legacy.DefaultWagonManager.putArtifact(DefaultWagonManager.java:494)
+	at hudson.maven.artifact.deployer.DefaultArtifactDeployer.deploy(DefaultArtifactDeployer.java:160)
+	... 11 more
+[INFO] Deployment failed after 0.9 sec
+Build step 'Deploy artifacts to Maven repository' changed build result to FAILURE
+



Mime
View raw message