incubator-sling-commits mailing list archives

Site index · List index
Message view « Date » · « Thread »
Top « Date » · « Thread »
From conflue...@apache.org
Subject [CONF] Apache Sling > FAQ
Date Sun, 10 Jul 2011 21:08:00 GMT
<html>
<head>
    <base href="https://cwiki.apache.org/confluence">
            <link rel="stylesheet" href="/confluence/s/2042/9/1/_/styles/combined.css?spaceKey=SLING&amp;forWysiwyg=true"
type="text/css">
    </head>
<body style="background: white;" bgcolor="white" class="email-body">
<div id="pageContent">
<div id="notificationFormat">
<div class="wiki-content">
<div class="email">
    <h2><a href="https://cwiki.apache.org/confluence/display/SLING/FAQ?focusedCommentId=27821477#comment-27821477">FAQ</a></h2>
        <h4>Page
        <b>comment added</b> by              <a href="https://cwiki.apache.org/confluence/display/~yurkech">Yury
Yurkov</a>
    </h4>
    <br/>
    <div class="notificationGreySide">
       <p>Hi,<br/>
can't build the project with error</p>

<p><a href="/confluence/pages/createpage.action?spaceKey=SLING&amp;title=INFO"
class="createlink">INFO</a> Apache Sling Installer Integration Tests .......... FAILURE
<a href="/confluence/pages/createpage.action?spaceKey=SLING&amp;title=5.860s" class="createlink">5.860s</a></p>

<p><a href="/confluence/pages/createpage.action?spaceKey=SLING&amp;title=ERROR"
class="createlink">ERROR</a> Failed to execute goal org.apache.maven.plugins:maven-surefire-plugin:2.4.3:test
(default-test) on project org.apache.sling.installer.it: There are test failures.<br/>
<a href="/confluence/pages/createpage.action?spaceKey=SLING&amp;title=ERROR" class="createlink">ERROR</a>
<br/>
<a href="/confluence/pages/createpage.action?spaceKey=SLING&amp;title=ERROR" class="createlink">ERROR</a>
Please refer to D:\Program Files (x86)\eclipse\workspace_sling\sling-builder\installer\it\target\surefire-reports
for the individual test results.<br/>
<a href="/confluence/pages/createpage.action?spaceKey=SLING&amp;title=ERROR" class="createlink">ERROR</a>
-&gt; <a href="/confluence/pages/createpage.action?spaceKey=SLING&amp;title=Help+1"
class="createlink">Help 1</a><br/>
org.apache.maven.lifecycle.LifecycleExecutionException: Failed to execute goal org.apache.maven.plugins:maven-surefire-plugin:2.4.3:test
(default-test) on project org.apache.sling.installer.it: There are test failures.</p>

<p>Please refer to D:\Program Files (x86)\eclipse\workspace_sling\sling-builder\installer\it\target\surefire-reports
for the individual test results.<br/>
	at org.apache.maven.lifecycle.internal.MojoExecutor.execute(MojoExecutor.java:213)<br/>
	at org.apache.maven.lifecycle.internal.MojoExecutor.execute(MojoExecutor.java:153)<br/>
	at org.apache.maven.lifecycle.internal.MojoExecutor.execute(MojoExecutor.java:145)<br/>
	at org.apache.maven.lifecycle.internal.LifecycleModuleBuilder.buildProject(LifecycleModuleBuilder.java:84)<br/>
	at org.apache.maven.lifecycle.internal.LifecycleModuleBuilder.buildProject(LifecycleModuleBuilder.java:59)<br/>
	at org.apache.maven.lifecycle.internal.LifecycleStarter.singleThreadedBuild(LifecycleStarter.java:183)<br/>
	at org.apache.maven.lifecycle.internal.LifecycleStarter.execute(LifecycleStarter.java:161)<br/>
	at org.apache.maven.DefaultMaven.doExecute(DefaultMaven.java:319)<br/>
	at org.apache.maven.DefaultMaven.execute(DefaultMaven.java:156)<br/>
	at org.apache.maven.cli.MavenCli.execute(MavenCli.java:537)<br/>
	at org.apache.maven.cli.MavenCli.doMain(MavenCli.java:196)<br/>
	at org.apache.maven.cli.MavenCli.main(MavenCli.java:141)<br/>
	at sun.reflect.NativeMethodAccessorImpl.invoke0(Native Method)<br/>
	at sun.reflect.NativeMethodAccessorImpl.invoke(NativeMethodAccessorImpl.java:39)<br/>
	at sun.reflect.DelegatingMethodAccessorImpl.invoke(DelegatingMethodAccessorImpl.java:25)<br/>
	at java.lang.reflect.Method.invoke(Method.java:597)<br/>
	at org.codehaus.plexus.classworlds.launcher.Launcher.launchEnhanced(Launcher.java:290)<br/>
	at org.codehaus.plexus.classworlds.launcher.Launcher.launch(Launcher.java:230)<br/>
	at org.codehaus.plexus.classworlds.launcher.Launcher.mainWithExitCode(Launcher.java:409)<br/>
	at org.codehaus.plexus.classworlds.launcher.Launcher.main(Launcher.java:352)<br/>
Caused by: org.apache.maven.plugin.MojoFailureException: There are test failures. </p>

<p>PS: have used last sources from svn<br/>
Can anybody help to solve problem?</p>

<p>Thanks!</p>
    </div>

        
    <div id="commentsSection" class="wiki-content pageSection">
       <div style="float: right;">
            <a href="https://cwiki.apache.org/confluence/users/viewnotifications.action"
class="grey">Change Notification Preferences</a>
       </div>
       <a href="https://cwiki.apache.org/confluence/display/SLING/FAQ?focusedCommentId=27821477#comment-27821477">View
Online</a>
              |
       <a id="reply-27821477" href="https://cwiki.apache.org/confluence/display/SLING/FAQ?replyToComment=27821477#comment-27821477">Reply
To This</a>
           </div>

</div>
</div>
</div>
</div>
</body>
</html>

Mime
View raw message