incubator-sling-commits mailing list archives

Site index · List index
Message view « Date » · « Thread »
Top « Date » · « Thread »
From Continuum VMBuild Server <contin...@apache.org>
Subject [continuum] BUILD FAILURE: Sling Launchpad Web Application
Date Thu, 10 Apr 2008 00:20:55 GMT
Online report : http://vmbuild.apache.org/continuum/buildResult.action?buildId=75245&projectId=535

Build statistics:
  State: Failed
  Previous State: Failed
  Started at: Wed 9 Apr 2008 17:13:19 -0700
  Finished at: Wed 9 Apr 2008 17:20:14 -0700
  Total time: 6m 54s
  Build Trigger: Schedule
  Build Number: 50
  Exit code: 1
  Building machine hostname: vmbuild.apache.org
  Operating system : Linux(unknown)
  Java Home version : 
          java version "1.6.0_05"
          Java(TM) SE Runtime Environment (build 1.6.0_05-b13)
          Java HotSpot(TM) Client VM (build 10.0-b19, mixed mode, sharing)
        
  Builder version :
          Maven version: 2.0.7
          Java version: 1.6.0_05
          OS name: "linux" version: "2.6.20-16-server" arch: "i386"
    
****************************************************************************
SCM Changes:
****************************************************************************
No files changed

****************************************************************************
Dependencies Changes:
****************************************************************************
org.apache.sling:org.apache.sling.launchpad.app:2.0.0-incubator-SNAPSHOT


****************************************************************************
Build Defintion:
****************************************************************************
POM filename: pom.xml
Goals: clean install   
Arguments: --batch-mode --non-recursive
Build Fresh: false
Always Build: false
Default Build Definition: true
Schedule: DEFAULT_SCHEDULE
Description: 


****************************************************************************
Test Summary:
****************************************************************************
Tests: 137
Failures: 137
Total time: 63437

****************************************************************************
Output:
****************************************************************************
[INFO] Scanning for projects...
[INFO] ----------------------------------------------------------------------------
[INFO] Building Sling Launchpad Web Application
[INFO]    task-segment: [clean, install]
[INFO] ----------------------------------------------------------------------------
[INFO] [clean:clean]
[INFO] Deleting directory /home/continuum/data/working-directory/535/target
[INFO] Deleting directory /home/continuum/data/working-directory/535/target/classes
[INFO] Deleting directory /home/continuum/data/working-directory/535/target/test-classes
[INFO] Deleting directory /home/continuum/data/working-directory/535/target/site
[INFO] [enforcer:enforce {execution: enforce-java}]
[INFO] [dependency:unpack-dependencies {execution: unpack-dependencies}]
[INFO] Expanding: /home/continuum/.m2/repository/org/apache/sling/org.apache.sling.launchpad.app/2.0.0-incubator-SNAPSHOT/org.apache.sling.launchpad.app-2.0.0-incubator-SNAPSHOT.jar
into /home/continuum/data/working-directory/535/target/launchpad-app
[INFO] Expanding: /home/continuum/.m2/repository/org/eclipse/equinox/http/servlet/1.0.0-v20070606/servlet-1.0.0-v20070606.jar
into /home/continuum/data/working-directory/535/target/launchpad-app
[INFO] [dependency:copy-dependencies {execution: copy-dependencies}]
[INFO] Copying org.apache.sling.launchpad.app-2.0.0-incubator-SNAPSHOT.jar to /home/continuum/data/working-directory/535/target/org.apache.sling.launchpad.webapp-2.0.0-incubator-SNAPSHOT/WEB-INF/resources/bundles/org.apache.sling.launchpad.app-2.0.0-incubator-SNAPSHOT.jar
[INFO] Copying org.apache.sling.scripting.javascript-2.0.0-incubator-SNAPSHOT.jar to /home/continuum/data/working-directory/535/target/org.apache.sling.launchpad.webapp-2.0.0-incubator-SNAPSHOT/WEB-INF/resources/bundles/org.apache.sling.scripting.javascript-2.0.0-incubator-SNAPSHOT.jar
[INFO] Copying org.apache.sling.servlets.post-2.0.0-incubator-SNAPSHOT.jar to /home/continuum/data/working-directory/535/target/org.apache.sling.launchpad.webapp-2.0.0-incubator-SNAPSHOT/WEB-INF/resources/bundles/org.apache.sling.servlets.post-2.0.0-incubator-SNAPSHOT.jar
[INFO] [resources:resources]
[INFO] Using default encoding to copy filtered resources.
[INFO] [compiler:compile]
[INFO] Compiling 2 source files to /home/continuum/data/working-directory/535/target/classes
[INFO] [resources:testResources]
[INFO] Using default encoding to copy filtered resources.
[INFO] [compiler:testCompile]
[INFO] Compiling 39 source files to /home/continuum/data/working-directory/535/target/test-classes
[INFO] [surefire:test]
[INFO] Surefire report directory: /home/continuum/data/working-directory/535/target/surefire-reports

-------------------------------------------------------
 T E S T S
-------------------------------------------------------
There are no tests to run.

Results :

Tests run: 0, Failures: 0, Errors: 0, Skipped: 0

[INFO] [war:war]
[INFO] Exploding webapp...
[INFO] Assembling webapp org.apache.sling.launchpad.webapp in /home/continuum/data/working-directory/535/target/org.apache.sling.launchpad.webapp-2.0.0-incubator-SNAPSHOT
[INFO] Copy webapp webResources to /home/continuum/data/working-directory/535/target/org.apache.sling.launchpad.webapp-2.0.0-incubator-SNAPSHOT
[INFO] Copy webapp webResources to /home/continuum/data/working-directory/535/target/org.apache.sling.launchpad.webapp-2.0.0-incubator-SNAPSHOT
[INFO] Copy webapp webResources to /home/continuum/data/working-directory/535/target/org.apache.sling.launchpad.webapp-2.0.0-incubator-SNAPSHOT
[INFO] Generating war /home/continuum/data/working-directory/535/target/org.apache.sling.launchpad.webapp-2.0.0-incubator-SNAPSHOT.war
[INFO] Building war: /home/continuum/data/working-directory/535/target/org.apache.sling.launchpad.webapp-2.0.0-incubator-SNAPSHOT.war
[INFO] Preparing source:jar
[WARNING] Removing: jar from forked lifecycle, to prevent recursive invocation.
[INFO] [enforcer:enforce {execution: enforce-java}]
[INFO] [source:jar {execution: attach-sources}]
[INFO] Building jar: /home/continuum/data/working-directory/535/target/org.apache.sling.launchpad.webapp-2.0.0-incubator-SNAPSHOT-sources.jar
[INFO] [cargo:start {execution: start-container}]
[INFO] [beddedLocalContainer] Jetty 6.x Embedded starting...
2008-04-09 17:14:45.047::INFO:  Logging to STDERR via org.mortbay.log.StdErrLog
2008-04-09 17:14:45.686::INFO:  jetty-6.1.1rc1
2008-04-09 17:14:58.595::INFO:  Extract jar:file:/home/continuum/data/working-directory/535/target/org.apache.sling.launchpad.webapp-2.0.0-incubator-SNAPSHOT.war!/
to /tmp/Jetty_0_0_0_0_8888_org.apache.sling.launchpad.webapp-2.0.0-incubator-SNAPSHOT.war__org_apache_sling_launchpad_webapp-2_0_0-incubator-SNAPSHOT__tvdn0n/webapp
2008-04-09 17:16:16.514:/org.apache.sling.launchpad.webapp-2.0.0-incubator-SNAPSHOT:INFO:
 sling: Servlet sling initialized
2008-04-09 17:16:16.775::INFO:  Extract jar:file:/tmp/cargo/conf/cargocpc.war!/ to /tmp/Jetty_0_0_0_0_8888_cargocpc.war__cargocpc__rw8xgv/webapp
2008-04-09 17:16:17.534::INFO:  Started SelectChannelConnector @ 0.0.0.0:8888
[INFO] [beddedLocalContainer] Jetty 6.x Embedded started on port [8888]
[INFO] [surefire:test {execution: surefire-integration-test}]
[INFO] Surefire report directory: /home/continuum/data/working-directory/535/target/surefire-reports

-------------------------------------------------------
 T E S T S
-------------------------------------------------------
Running org.apache.sling.launchpad.webapp.integrationtest.StaticContentTest
log4j:WARN No appenders could be found for logger (org.apache.commons.httpclient.HttpClient).
log4j:WARN Please initialize the log4j system properly.
Checking if the required Sling services are started...
(base URLs=http://localhost:8888/org.apache.sling.launchpad.webapp-2.0.0-incubator-SNAPSHOT
and http://localhost:8888/org.apache.sling.launchpad.webapp-2.0.0-incubator-SNAPSHOT)
Server does not seem to be ready, after 60000 msec, got the following 114 Exceptions:java.io.IOException:
Expected status code 302 for POST, got 404, URL=http://localhost:8888/org.apache.sling.launchpad.webapp-2.0.0-incubator-SNAPSHOT/WaitForSlingStartup_1207786582790
java.io.IOException: Expected status code 302 for POST, got 404, URL=http://localhost:8888/org.apache.sling.launchpad.webapp-2.0.0-incubator-SNAPSHOT/WaitForSlingStartup_1207786583862
java.io.IOException: Expected status code 302 for POST, got 404, URL=http://localhost:8888/org.apache.sling.launchpad.webapp-2.0.0-incubator-SNAPSHOT/WaitForSlingStartup_1207786584392
java.io.IOException: Expected status code 302 for POST, got 404, URL=http://localhost:8888/org.apache.sling.launchpad.webapp-2.0.0-incubator-SNAPSHOT/WaitForSlingStartup_1207786584922
java.io.IOException: Expected status code 302 for POST, got 404, URL=http://localhost:8888/org.apache.sling.launchpad.webapp-2.0.0-incubator-SNAPSHOT/WaitForSlingStartup_1207786585462
java.io.IOException: Expected status code 302 for POST, got 404, URL=http://localhost:8888/org.apache.sling.launchpad.webapp-2.0.0-incubator-SNAPSHOT/WaitForSlingStartup_1207786585992
java.io.IOException: Expected status code 302 for POST, got 404, URL=http://localhost:8888/org.apache.sling.launchpad.webapp-2.0.0-incubator-SNAPSHOT/WaitForSlingStartup_1207786586512
java.io.IOException: Expected status code 302 for POST, got 404, URL=http://localhost:8888/org.apache.sling.launchpad.webapp-2.0.0-incubator-SNAPSHOT/WaitForSlingStartup_1207786587032
java.io.IOException: Expected status code 302 for POST, got 404, URL=http://localhost:8888/org.apache.sling.launchpad.webapp-2.0.0-incubator-SNAPSHOT/WaitForSlingStartup_1207786587562
java.io.IOException: Expected status code 302 for POST, got 404, URL=http://localhost:8888/org.apache.sling.launchpad.webapp-2.0.0-incubator-SNAPSHOT/WaitForSlingStartup_1207786588082
java.io.IOException: Expected status code 302 for POST, got 404, URL=http://localhost:8888/org.apache.sling.launchpad.webapp-2.0.0-incubator-SNAPSHOT/WaitForSlingStartup_1207786588602
java.io.IOException: Expected status code 302 for POST, got 404, URL=http://localhost:8888/org.apache.sling.launchpad.webapp-2.0.0-incubator-SNAPSHOT/WaitForSlingStartup_1207786589122
java.io.IOException: Expected status code 302 for POST, got 404, URL=http://localhost:8888/org.apache.sling.launchpad.webapp-2.0.0-incubator-SNAPSHOT/WaitForSlingStartup_1207786589642
java.io.IOException: Expected status code 302 for POST, got 404, URL=http://localhost:8888/org.apache.sling.launchpad.webapp-2.0.0-incubator-SNAPSHOT/WaitForSlingStartup_1207786590162
java.io.IOException: Expected status code 302 for POST, got 404, URL=http://localhost:8888/org.apache.sling.launchpad.webapp-2.0.0-incubator-SNAPSHOT/WaitForSlingStartup_1207786590682
java.io.IOException: Expected status code 302 for POST, got 404, URL=http://localhost:8888/org.apache.sling.launchpad.webapp-2.0.0-incubator-SNAPSHOT/WaitForSlingStartup_1207786591212
java.io.IOException: Expected status code 302 for POST, got 404, URL=http://localhost:8888/org.apache.sling.launchpad.webapp-2.0.0-incubator-SNAPSHOT/WaitForSlingStartup_1207786591732
java.io.IOException: Expected status code 302 for POST, got 404, URL=http://localhost:8888/org.apache.sling.launchpad.webapp-2.0.0-incubator-SNAPSHOT/WaitForSlingStartup_1207786592252
java.io.IOException: Expected status code 302 for POST, got 404, URL=http://localhost:8888/org.apache.sling.launchpad.webapp-2.0.0-incubator-SNAPSHOT/WaitForSlingStartup_1207786592772
java.io.IOException: Expected status code 302 for POST, got 404, URL=http://localhost:8888/org.apache.sling.launchpad.webapp-2.0.0-incubator-SNAPSHOT/WaitForSlingStartup_1207786593292
java.io.IOException: Expected status code 302 for POST, got 404, URL=http://localhost:8888/org.apache.sling.launchpad.webapp-2.0.0-incubator-SNAPSHOT/WaitForSlingStartup_1207786593812
java.io.IOException: Expected status code 302 for POST, got 404, URL=http://localhost:8888/org.apache.sling.launchpad.webapp-2.0.0-incubator-SNAPSHOT/WaitForSlingStartup_1207786594332
java.io.IOException: Expected status code 302 for POST, got 404, URL=http://localhost:8888/org.apache.sling.launchpad.webapp-2.0.0-incubator-SNAPSHOT/WaitForSlingStartup_1207786594852
java.io.IOException: Expected status code 302 for POST, got 404, URL=http://localhost:8888/org.apache.sling.launchpad.webapp-2.0.0-incubator-SNAPSHOT/WaitForSlingStartup_1207786595372
java.io.IOException: Expected status code 302 for POST, got 404, URL=http://localhost:8888/org.apache.sling.launchpad.webapp-2.0.0-incubator-SNAPSHOT/WaitForSlingStartup_1207786595902
java.io.IOException: Expected status code 302 for POST, got 404, URL=http://localhost:8888/org.apache.sling.launchpad.webapp-2.0.0-incubator-SNAPSHOT/WaitForSlingStartup_1207786596422
java.io.IOException: Expected status code 302 for POST, got 404, URL=http://localhost:8888/org.apache.sling.launchpad.webapp-2.0.0-incubator-SNAPSHOT/WaitForSlingStartup_1207786596942
java.io.IOException: Expected status code 302 for POST, got 404, URL=http://localhost:8888/org.apache.sling.launchpad.webapp-2.0.0-incubator-SNAPSHOT/WaitForSlingStartup_1207786597492
java.io.IOException: Expected status code 302 for POST, got 404, URL=http://localhost:8888/org.apache.sling.launchpad.webapp-2.0.0-incubator-SNAPSHOT/WaitForSlingStartup_1207786598012
java.io.IOException: Expected status code 302 for POST, got 404, URL=http://localhost:8888/org.apache.sling.launchpad.webapp-2.0.0-incubator-SNAPSHOT/WaitForSlingStartup_1207786598532
java.io.IOException: Expected status code 302 for POST, got 404, URL=http://localhost:8888/org.apache.sling.launchpad.webapp-2.0.0-incubator-SNAPSHOT/WaitForSlingStartup_1207786599062
java.io.IOException: Expected status code 302 for POST, got 404, URL=http://localhost:8888/org.apache.sling.launchpad.webapp-2.0.0-incubator-SNAPSHOT/WaitForSlingStartup_1207786599582
java.io.IOException: Expected status code 302 for POST, got 404, URL=http://localhost:8888/org.apache.sling.launchpad.webapp-2.0.0-incubator-SNAPSHOT/WaitForSlingStartup_1207786600102
java.io.IOException: Expected status code 302 for POST, got 404, URL=http://localhost:8888/org.apache.sling.launchpad.webapp-2.0.0-incubator-SNAPSHOT/WaitForSlingStartup_1207786600622
java.io.IOException: Expected status code 302 for POST, got 404, URL=http://localhost:8888/org.apache.sling.launchpad.webapp-2.0.0-incubator-SNAPSHOT/WaitForSlingStartup_1207786601142
java.io.IOException: Expected status code 302 for POST, got 404, URL=http://localhost:8888/org.apache.sling.launchpad.webapp-2.0.0-incubator-SNAPSHOT/WaitForSlingStartup_1207786601662
java.io.IOException: Expected status code 302 for POST, got 404, URL=http://localhost:8888/org.apache.sling.launchpad.webapp-2.0.0-incubator-SNAPSHOT/WaitForSlingStartup_1207786602182
java.io.IOException: Expected status code 302 for POST, got 404, URL=http://localhost:8888/org.apache.sling.launchpad.webapp-2.0.0-incubator-SNAPSHOT/WaitForSlingStartup_1207786602712
java.io.IOException: Expected status code 302 for POST, got 404, URL=http://localhost:8888/org.apache.sling.launchpad.webapp-2.0.0-incubator-SNAPSHOT/WaitForSlingStartup_1207786603232
java.io.IOException: Expected status code 302 for POST, got 404, URL=http://localhost:8888/org.apache.sling.launchpad.webapp-2.0.0-incubator-SNAPSHOT/WaitForSlingStartup_1207786603752
java.io.IOException: Expected status code 302 for POST, got 404, URL=http://localhost:8888/org.apache.sling.launchpad.webapp-2.0.0-incubator-SNAPSHOT/WaitForSlingStartup_1207786604272
java.io.IOException: Expected status code 302 for POST, got 404, URL=http://localhost:8888/org.apache.sling.launchpad.webapp-2.0.0-incubator-SNAPSHOT/WaitForSlingStartup_1207786604792
java.io.IOException: Expected status code 302 for POST, got 404, URL=http://localhost:8888/org.apache.sling.launchpad.webapp-2.0.0-incubator-SNAPSHOT/WaitForSlingStartup_1207786605312
java.io.IOException: Expected status code 302 for POST, got 404, URL=http://localhost:8888/org.apache.sling.launchpad.webapp-2.0.0-incubator-SNAPSHOT/WaitForSlingStartup_1207786605832
java.io.IOException: Expected status code 302 for POST, got 404, URL=http://localhost:8888/org.apache.sling.launchpad.webapp-2.0.0-incubator-SNAPSHOT/WaitForSlingStartup_1207786606352
java.io.IOException: Expected status code 302 for POST, got 404, URL=http://localhost:8888/org.apache.sling.launchpad.webapp-2.0.0-incubator-SNAPSHOT/WaitForSlingStartup_1207786606872
java.io.IOException: Expected status code 302 for POST, got 404, URL=http://localhost:8888/org.apache.sling.launchpad.webapp-2.0.0-incubator-SNAPSHOT/WaitForSlingStartup_1207786607392
java.io.IOException: Expected status code 302 for POST, got 404, URL=http://localhost:8888/org.apache.sling.launchpad.webapp-2.0.0-incubator-SNAPSHOT/WaitForSlingStartup_1207786607912
java.io.IOException: Expected status code 302 for POST, got 404, URL=http://localhost:8888/org.apache.sling.launchpad.webapp-2.0.0-incubator-SNAPSHOT/WaitForSlingStartup_1207786608432
java.io.IOException: Expected status code 302 for POST, got 404, URL=http://localhost:8888/org.apache.sling.launchpad.webapp-2.0.0-incubator-SNAPSHOT/WaitForSlingStartup_1207786608952
java.io.IOException: Expected status code 302 for POST, got 404, URL=http://localhost:8888/org.apache.sling.launchpad.webapp-2.0.0-incubator-SNAPSHOT/WaitForSlingStartup_1207786609472
java.io.IOException: Expected status code 302 for POST, got 404, URL=http://localhost:8888/org.apache.sling.launchpad.webapp-2.0.0-incubator-SNAPSHOT/WaitForSlingStartup_1207786609992
java.io.IOException: Expected status code 302 for POST, got 404, URL=http://localhost:8888/org.apache.sling.launchpad.webapp-2.0.0-incubator-SNAPSHOT/WaitForSlingStartup_1207786610512
java.io.IOException: Expected status code 302 for POST, got 404, URL=http://localhost:8888/org.apache.sling.launchpad.webapp-2.0.0-incubator-SNAPSHOT/WaitForSlingStartup_1207786611042
java.io.IOException: Expected status code 302 for POST, got 404, URL=http://localhost:8888/org.apache.sling.launchpad.webapp-2.0.0-incubator-SNAPSHOT/WaitForSlingStartup_1207786611562
java.io.IOException: Expected status code 302 for POST, got 404, URL=http://localhost:8888/org.apache.sling.launchpad.webapp-2.0.0-incubator-SNAPSHOT/WaitForSlingStartup_1207786612082
java.io.IOException: Expected status code 302 for POST, got 404, URL=http://localhost:8888/org.apache.sling.launchpad.webapp-2.0.0-incubator-SNAPSHOT/WaitForSlingStartup_1207786612602
java.io.IOException: Expected status code 302 for POST, got 404, URL=http://localhost:8888/org.apache.sling.launchpad.webapp-2.0.0-incubator-SNAPSHOT/WaitForSlingStartup_1207786613122
java.io.IOException: Expected status code 302 for POST, got 404, URL=http://localhost:8888/org.apache.sling.launchpad.webapp-2.0.0-incubator-SNAPSHOT/WaitForSlingStartup_1207786613642
java.io.IOException: Expected status code 302 for POST, got 404, URL=http://localhost:8888/org.apache.sling.launchpad.webapp-2.0.0-incubator-SNAPSHOT/WaitForSlingStartup_1207786614162
java.io.IOException: Expected status code 302 for POST, got 404, URL=http://localhost:8888/org.apache.sling.launchpad.webapp-2.0.0-incubator-SNAPSHOT/WaitForSlingStartup_1207786614682
java.io.IOException: Expected status code 302 for POST, got 404, URL=http://localhost:8888/org.apache.sling.launchpad.webapp-2.0.0-incubator-SNAPSHOT/WaitForSlingStartup_1207786615202
java.io.IOException: Expected status code 302 for POST, got 404, URL=http://localhost:8888/org.apache.sling.launchpad.webapp-2.0.0-incubator-SNAPSHOT/WaitForSlingStartup_1207786615722
java.io.IOException: Expected status code 302 for POST, got 404, URL=http://localhost:8888/org.apache.sling.launchpad.webapp-2.0.0-incubator-SNAPSHOT/WaitForSlingStartup_1207786616242
java.io.IOException: Expected status code 302 for POST, got 404, URL=http://localhost:8888/org.apache.sling.launchpad.webapp-2.0.0-incubator-SNAPSHOT/WaitForSlingStartup_1207786616762
java.io.IOException: Expected status code 302 for POST, got 404, URL=http://localhost:8888/org.apache.sling.launchpad.webapp-2.0.0-incubator-SNAPSHOT/WaitForSlingStartup_1207786617282
java.io.IOException: Expected status code 302 for POST, got 404, URL=http://localhost:8888/org.apache.sling.launchpad.webapp-2.0.0-incubator-SNAPSHOT/WaitForSlingStartup_1207786617802
java.io.IOException: Expected status code 302 for POST, got 404, URL=http://localhost:8888/org.apache.sling.launchpad.webapp-2.0.0-incubator-SNAPSHOT/WaitForSlingStartup_1207786618322
java.io.IOException: Expected status code 302 for POST, got 404, URL=http://localhost:8888/org.apache.sling.launchpad.webapp-2.0.0-incubator-SNAPSHOT/WaitForSlingStartup_1207786618842
java.io.IOException: Expected status code 302 for POST, got 404, URL=http://localhost:8888/org.apache.sling.launchpad.webapp-2.0.0-incubator-SNAPSHOT/WaitForSlingStartup_1207786619362
java.io.IOException: Expected status code 302 for POST, got 404, URL=http://localhost:8888/org.apache.sling.launchpad.webapp-2.0.0-incubator-SNAPSHOT/WaitForSlingStartup_1207786619882
java.io.IOException: Expected status code 302 for POST, got 404, URL=http://localhost:8888/org.apache.sling.launchpad.webapp-2.0.0-incubator-SNAPSHOT/WaitForSlingStartup_1207786620402
java.io.IOException: Expected status code 302 for POST, got 404, URL=http://localhost:8888/org.apache.sling.launchpad.webapp-2.0.0-incubator-SNAPSHOT/WaitForSlingStartup_1207786620922
java.io.IOException: Expected status code 302 for POST, got 404, URL=http://localhost:8888/org.apache.sling.launchpad.webapp-2.0.0-incubator-SNAPSHOT/WaitForSlingStartup_1207786621442
java.io.IOException: Expected status code 302 for POST, got 404, URL=http://localhost:8888/org.apache.sling.launchpad.webapp-2.0.0-incubator-SNAPSHOT/WaitForSlingStartup_1207786621962
java.io.IOException: Expected status code 302 for POST, got 404, URL=http://localhost:8888/org.apache.sling.launchpad.webapp-2.0.0-incubator-SNAPSHOT/WaitForSlingStartup_1207786622482
java.io.IOException: Expected status code 302 for POST, got 404, URL=http://localhost:8888/org.apache.sling.launchpad.webapp-2.0.0-incubator-SNAPSHOT/WaitForSlingStartup_1207786623002
java.io.IOException: Expected status code 302 for POST, got 404, URL=http://localhost:8888/org.apache.sling.launchpad.webapp-2.0.0-incubator-SNAPSHOT/WaitForSlingStartup_1207786623523
java.io.IOException: Expected status code 302 for POST, got 404, URL=http://localhost:8888/org.apache.sling.launchpad.webapp-2.0.0-incubator-SNAPSHOT/WaitForSlingStartup_1207786624042
java.io.IOException: Expected status code 302 for POST, got 404, URL=http://localhost:8888/org.apache.sling.launchpad.webapp-2.0.0-incubator-SNAPSHOT/WaitForSlingStartup_1207786624564
java.io.IOException: Expected status code 302 for POST, got 404, URL=http://localhost:8888/org.apache.sling.launchpad.webapp-2.0.0-incubator-SNAPSHOT/WaitForSlingStartup_1207786625092
java.io.IOException: Expected status code 302 for POST, got 404, URL=http://localhost:8888/org.apache.sling.launchpad.webapp-2.0.0-incubator-SNAPSHOT/WaitForSlingStartup_1207786625622
java.io.IOException: Expected status code 302 for POST, got 404, URL=http://localhost:8888/org.apache.sling.launchpad.webapp-2.0.0-incubator-SNAPSHOT/WaitForSlingStartup_1207786626152
java.io.IOException: Expected status code 302 for POST, got 404, URL=http://localhost:8888/org.apache.sling.launchpad.webapp-2.0.0-incubator-SNAPSHOT/WaitForSlingStartup_1207786626672
java.io.IOException: Expected status code 302 for POST, got 404, URL=http://localhost:8888/org.apache.sling.launchpad.webapp-2.0.0-incubator-SNAPSHOT/WaitForSlingStartup_1207786627192
java.io.IOException: Expected status code 302 for POST, got 404, URL=http://localhost:8888/org.apache.sling.launchpad.webapp-2.0.0-incubator-SNAPSHOT/WaitForSlingStartup_1207786627713
java.io.IOException: Expected status code 302 for POST, got 404, URL=http://localhost:8888/org.apache.sling.launchpad.webapp-2.0.0-incubator-SNAPSHOT/WaitForSlingStartup_1207786628232
java.io.IOException: Expected status code 302 for POST, got 404, URL=http://localhost:8888/org.apache.sling.launchpad.webapp-2.0.0-incubator-SNAPSHOT/WaitForSlingStartup_1207786628752
java.io.IOException: Expected status code 302 for POST, got 404, URL=http://localhost:8888/org.apache.sling.launchpad.webapp-2.0.0-incubator-SNAPSHOT/WaitForSlingStartup_1207786629272
java.io.IOException: Expected status code 302 for POST, got 404, URL=http://localhost:8888/org.apache.sling.launchpad.webapp-2.0.0-incubator-SNAPSHOT/WaitForSlingStartup_1207786629792
java.io.IOException: Expected status code 302 for POST, got 404, URL=http://localhost:8888/org.apache.sling.launchpad.webapp-2.0.0-incubator-SNAPSHOT/WaitForSlingStartup_1207786630313
java.io.IOException: Expected status code 302 for POST, got 404, URL=http://localhost:8888/org.apache.sling.launchpad.webapp-2.0.0-incubator-SNAPSHOT/WaitForSlingStartup_1207786630832
java.io.IOException: Expected status code 302 for POST, got 404, URL=http://localhost:8888/org.apache.sling.launchpad.webapp-2.0.0-incubator-SNAPSHOT/WaitForSlingStartup_1207786631352
java.io.IOException: Expected status code 302 for POST, got 404, URL=http://localhost:8888/org.apache.sling.launchpad.webapp-2.0.0-incubator-SNAPSHOT/WaitForSlingStartup_1207786631872
java.io.IOException: Expected status code 302 for POST, got 404, URL=http://localhost:8888/org.apache.sling.launchpad.webapp-2.0.0-incubator-SNAPSHOT/WaitForSlingStartup_1207786632392
java.io.IOException: Expected status code 302 for POST, got 404, URL=http://localhost:8888/org.apache.sling.launchpad.webapp-2.0.0-incubator-SNAPSHOT/WaitForSlingStartup_1207786632912
java.io.IOException: Expected status code 302 for POST, got 404, URL=http://localhost:8888/org.apache.sling.launchpad.webapp-2.0.0-incubator-SNAPSHOT/WaitForSlingStartup_1207786633432
java.io.IOException: Expected status code 302 for POST, got 404, URL=http://localhost:8888/org.apache.sling.launchpad.webapp-2.0.0-incubator-SNAPSHOT/WaitForSlingStartup_1207786633952
java.io.IOException: Expected status code 302 for POST, got 404, URL=http://localhost:8888/org.apache.sling.launchpad.webapp-2.0.0-incubator-SNAPSHOT/WaitForSlingStartup_1207786634472
java.io.IOException: Expected status code 302 for POST, got 404, URL=http://localhost:8888/org.apache.sling.launchpad.webapp-2.0.0-incubator-SNAPSHOT/WaitForSlingStartup_1207786634992
java.io.IOException: Expected status code 302 for POST, got 404, URL=http://localhost:8888/org.apache.sling.launchpad.webapp-2.0.0-incubator-SNAPSHOT/WaitForSlingStartup_1207786635512
java.io.IOException: Expected status code 302 for POST, got 404, URL=http://localhost:8888/org.apache.sling.launchpad.webapp-2.0.0-incubator-SNAPSHOT/WaitForSlingStartup_1207786636052
java.io.IOException: Expected status code 302 for POST, got 404, URL=http://localhost:8888/org.apache.sling.launchpad.webapp-2.0.0-incubator-SNAPSHOT/WaitForSlingStartup_1207786636571
java.io.IOException: Expected status code 302 for POST, got 404, URL=http://localhost:8888/org.apache.sling.launchpad.webapp-2.0.0-incubator-SNAPSHOT/WaitForSlingStartup_1207786637092
java.io.IOException: Expected status code 302 for POST, got 404, URL=http://localhost:8888/org.apache.sling.launchpad.webapp-2.0.0-incubator-SNAPSHOT/WaitForSlingStartup_1207786637612
java.io.IOException: Expected status code 302 for POST, got 404, URL=http://localhost:8888/org.apache.sling.launchpad.webapp-2.0.0-incubator-SNAPSHOT/WaitForSlingStartup_1207786638132
java.io.IOException: Expected status code 302 for POST, got 404, URL=http://localhost:8888/org.apache.sling.launchpad.webapp-2.0.0-incubator-SNAPSHOT/WaitForSlingStartup_1207786638652
java.io.IOException: Expected status code 302 for POST, got 404, URL=http://localhost:8888/org.apache.sling.launchpad.webapp-2.0.0-incubator-SNAPSHOT/WaitForSlingStartup_1207786639172
java.io.IOException: Expected status code 302 for POST, got 404, URL=http://localhost:8888/org.apache.sling.launchpad.webapp-2.0.0-incubator-SNAPSHOT/WaitForSlingStartup_1207786639692
java.io.IOException: Expected status code 302 for POST, got 404, URL=http://localhost:8888/org.apache.sling.launchpad.webapp-2.0.0-incubator-SNAPSHOT/WaitForSlingStartup_1207786640212
java.io.IOException: Expected status code 302 for POST, got 404, URL=http://localhost:8888/org.apache.sling.launchpad.webapp-2.0.0-incubator-SNAPSHOT/WaitForSlingStartup_1207786640732
java.io.IOException: Expected status code 302 for POST, got 404, URL=http://localhost:8888/org.apache.sling.launchpad.webapp-2.0.0-incubator-SNAPSHOT/WaitForSlingStartup_1207786641252
java.io.IOException: Expected status code 302 for POST, got 404, URL=http://localhost:8888/org.apache.sling.launchpad.webapp-2.0.0-incubator-SNAPSHOT/WaitForSlingStartup_1207786641782
java.io.IOException: Expected status code 302 for POST, got 404, URL=http://localhost:8888/org.apache.sling.launchpad.webapp-2.0.0-incubator-SNAPSHOT/WaitForSlingStartup_1207786642302

Tests run: 2, Failures: 2, Errors: 0, Skipped: 0, Time elapsed: 62.624 sec <<< FAILURE!
Running org.apache.sling.launchpad.webapp.integrationtest.servlets.post.PostServletOrderTest
Tests run: 9, Failures: 9, Errors: 0, Skipped: 0, Time elapsed: 0.07 sec <<< FAILURE!
Running org.apache.sling.launchpad.webapp.integrationtest.JavascriptWrappersTest
Tests run: 1, Failures: 1, Errors: 0, Skipped: 0, Time elapsed: 0.01 sec <<< FAILURE!
Running org.apache.sling.launchpad.webapp.integrationtest.GeneratedNodeNameTest
Tests run: 5, Failures: 5, Errors: 0, Skipped: 0, Time elapsed: 0.071 sec <<< FAILURE!
Running org.apache.sling.launchpad.webapp.integrationtest.servlets.post.PostServletMoveTest
Tests run: 7, Failures: 7, Errors: 0, Skipped: 0, Time elapsed: 0.051 sec <<< FAILURE!
Running org.apache.sling.launchpad.webapp.integrationtest.JsonRenderingTest
Tests run: 8, Failures: 8, Errors: 0, Skipped: 0, Time elapsed: 0.047 sec <<< FAILURE!
Running org.apache.sling.launchpad.webapp.integrationtest.servlets.post.PostServletCreateTest
Tests run: 9, Failures: 9, Errors: 0, Skipped: 0, Time elapsed: 0.033 sec <<< FAILURE!
Running org.apache.sling.launchpad.webapp.integrationtest.servlets.post.SlingDefaultValuesTest
Tests run: 4, Failures: 4, Errors: 0, Skipped: 0, Time elapsed: 0.009 sec <<< FAILURE!
Running org.apache.sling.launchpad.webapp.integrationtest.UploadFileTest
Tests run: 3, Failures: 3, Errors: 0, Skipped: 0, Time elapsed: 0.008 sec <<< FAILURE!
Running org.apache.sling.launchpad.webapp.integrationtest.PathBasedResourceTypeTest
Tests run: 2, Failures: 2, Errors: 0, Skipped: 0, Time elapsed: 0.006 sec <<< FAILURE!
Running org.apache.sling.launchpad.webapp.integrationtest.MkdirTest
Tests run: 2, Failures: 2, Errors: 0, Skipped: 0, Time elapsed: 0.006 sec <<< FAILURE!
Running org.apache.sling.launchpad.webapp.integrationtest.servlets.post.PostServletUpdateTest
Tests run: 4, Failures: 4, Errors: 0, Skipped: 0, Time elapsed: 0.008 sec <<< FAILURE!
Running org.apache.sling.launchpad.webapp.integrationtest.apt.SimpleAptRenderingTest
Tests run: 1, Failures: 1, Errors: 0, Skipped: 0, Time elapsed: 0.005 sec <<< FAILURE!
Running org.apache.sling.launchpad.webapp.integrationtest.servlets.post.PostServletDeleteTest
Tests run: 1, Failures: 1, Errors: 0, Skipped: 0, Time elapsed: 0.003 sec <<< FAILURE!
Running org.apache.sling.launchpad.webapp.integrationtest.ValueFromTest
Tests run: 3, Failures: 3, Errors: 0, Skipped: 0, Time elapsed: 0.009 sec <<< FAILURE!
Running org.apache.sling.launchpad.webapp.integrationtest.IncludeTest
Tests run: 5, Failures: 5, Errors: 0, Skipped: 0, Time elapsed: 0.006 sec <<< FAILURE!
Running org.apache.sling.launchpad.webapp.integrationtest.GetWithSuffixTest
Tests run: 4, Failures: 4, Errors: 0, Skipped: 0, Time elapsed: 0.031 sec <<< FAILURE!
Running org.apache.sling.launchpad.webapp.integrationtest.JspScriptingTest
Tests run: 4, Failures: 4, Errors: 0, Skipped: 0, Time elapsed: 0.028 sec <<< FAILURE!
Running org.apache.sling.launchpad.webapp.integrationtest.NodetypeRenderingTest
Tests run: 6, Failures: 6, Errors: 0, Skipped: 0, Time elapsed: 0.032 sec <<< FAILURE!
Running org.apache.sling.launchpad.webapp.integrationtest.InitialContentTest
Tests run: 1, Failures: 1, Errors: 0, Skipped: 0, Time elapsed: 0.002 sec <<< FAILURE!
Running org.apache.sling.launchpad.webapp.integrationtest.SlingResourceTypeRenderingTest
Tests run: 9, Failures: 9, Errors: 0, Skipped: 0, Time elapsed: 0.03 sec <<< FAILURE!
Running org.apache.sling.launchpad.webapp.integrationtest.servlets.post.SlingDateValuesTest
Tests run: 1, Failures: 1, Errors: 0, Skipped: 0, Time elapsed: 0.003 sec <<< FAILURE!
Running org.apache.sling.launchpad.webapp.integrationtest.PropertyRenderingTest
Tests run: 6, Failures: 6, Errors: 0, Skipped: 0, Time elapsed: 0.016 sec <<< FAILURE!
Running org.apache.sling.launchpad.webapp.integrationtest.servlets.post.SlingAutoPropertiesTest
Tests run: 3, Failures: 3, Errors: 0, Skipped: 0, Time elapsed: 0.051 sec <<< FAILURE!
Running org.apache.sling.launchpad.webapp.integrationtest.CreateNodeTest
Tests run: 6, Failures: 6, Errors: 0, Skipped: 0, Time elapsed: 0.012 sec <<< FAILURE!
Running org.apache.sling.launchpad.webapp.integrationtest.JsonQueryServletTest
Tests run: 7, Failures: 7, Errors: 0, Skipped: 0, Time elapsed: 0.014 sec <<< FAILURE!
Running org.apache.sling.launchpad.webapp.integrationtest.GetStarTest
Tests run: 3, Failures: 3, Errors: 0, Skipped: 0, Time elapsed: 0.018 sec <<< FAILURE!
Running org.apache.sling.launchpad.webapp.integrationtest.RedirectTest
Tests run: 4, Failures: 4, Errors: 0, Skipped: 0, Time elapsed: 0.008 sec <<< FAILURE!
Running org.apache.sling.launchpad.webapp.integrationtest.FileUploadTest
Tests run: 1, Failures: 1, Errors: 0, Skipped: 0, Time elapsed: 0.003 sec <<< FAILURE!
Running org.apache.sling.launchpad.webapp.integrationtest.servlets.post.SlingSessionInfoTest
Tests run: 2, Failures: 2, Errors: 0, Skipped: 0, Time elapsed: 0.005 sec <<< FAILURE!
Running org.apache.sling.launchpad.webapp.integrationtest.ScriptBuiltinObjectsTest
Tests run: 1, Failures: 1, Errors: 0, Skipped: 0, Time elapsed: 0.003 sec <<< FAILURE!
Running org.apache.sling.launchpad.webapp.integrationtest.SyntheticResourceTest
Tests run: 1, Failures: 1, Errors: 0, Skipped: 0, Time elapsed: 0.004 sec <<< FAILURE!
Running org.apache.sling.launchpad.webapp.integrationtest.StreamServletTest
Tests run: 4, Failures: 4, Errors: 0, Skipped: 0, Time elapsed: 0.013 sec <<< FAILURE!
Running org.apache.sling.launchpad.webapp.integrationtest.PostRedirectTest
Tests run: 6, Failures: 6, Errors: 0, Skipped: 0, Time elapsed: 0.011 sec <<< FAILURE!
Running org.apache.sling.launchpad.webapp.integrationtest.HttpPingTest
Tests run: 2, Failures: 2, Errors: 0, Skipped: 0, Time elapsed: 0.006 sec <<< FAILURE!

Results :

Failed tests: 
  testWebInfForbidden(org.apache.sling.launchpad.webapp.integrationtest.StaticContentTest)
  testMetaInfForbidden(org.apache.sling.launchpad.webapp.integrationtest.StaticContentTest)
  testStandardOrder(org.apache.sling.launchpad.webapp.integrationtest.servlets.post.PostServletOrderTest)
  testOrderFirst(org.apache.sling.launchpad.webapp.integrationtest.servlets.post.PostServletOrderTest)
  testOrderLast(org.apache.sling.launchpad.webapp.integrationtest.servlets.post.PostServletOrderTest)
  testOrderBefore(org.apache.sling.launchpad.webapp.integrationtest.servlets.post.PostServletOrderTest)
  testOrderAfter(org.apache.sling.launchpad.webapp.integrationtest.servlets.post.PostServletOrderTest)
  testOrderIntToBack(org.apache.sling.launchpad.webapp.integrationtest.servlets.post.PostServletOrderTest)
  testOrderIntToFront(org.apache.sling.launchpad.webapp.integrationtest.servlets.post.PostServletOrderTest)
  testOrderIntZero(org.apache.sling.launchpad.webapp.integrationtest.servlets.post.PostServletOrderTest)
  testOrderIntOOB(org.apache.sling.launchpad.webapp.integrationtest.servlets.post.PostServletOrderTest)
  testRecursiveDump(org.apache.sling.launchpad.webapp.integrationtest.JavascriptWrappersTest)
  testTitle(org.apache.sling.launchpad.webapp.integrationtest.GeneratedNodeNameTest)
  testSlingPostNodeNameParam(org.apache.sling.launchpad.webapp.integrationtest.GeneratedNodeNameTest)
  testTitleWithSavePrefix(org.apache.sling.launchpad.webapp.integrationtest.GeneratedNodeNameTest)
  testCollision(org.apache.sling.launchpad.webapp.integrationtest.GeneratedNodeNameTest)
  testNoParams(org.apache.sling.launchpad.webapp.integrationtest.GeneratedNodeNameTest)
  testMoveNodeAbsolute(org.apache.sling.launchpad.webapp.integrationtest.servlets.post.PostServletMoveTest)
  testMoveNodeRelative(org.apache.sling.launchpad.webapp.integrationtest.servlets.post.PostServletMoveTest)
  testMoveNodeNew(org.apache.sling.launchpad.webapp.integrationtest.servlets.post.PostServletMoveTest)
  testMoveNodeExistingFail(org.apache.sling.launchpad.webapp.integrationtest.servlets.post.PostServletMoveTest)
  testMoveNodeExistingReplace(org.apache.sling.launchpad.webapp.integrationtest.servlets.post.PostServletMoveTest)
  testMoveNodeDeep(org.apache.sling.launchpad.webapp.integrationtest.servlets.post.PostServletMoveTest)
  testMoveNodeDeepFail(org.apache.sling.launchpad.webapp.integrationtest.servlets.post.PostServletMoveTest)
  testAssertJavascript(org.apache.sling.launchpad.webapp.integrationtest.JsonRenderingTest)
  testNonRecursive(org.apache.sling.launchpad.webapp.integrationtest.JsonRenderingTest)
  testRecursiveOneLevel(org.apache.sling.launchpad.webapp.integrationtest.JsonRenderingTest)
  testRecursiveZeroLevels(org.apache.sling.launchpad.webapp.integrationtest.JsonRenderingTest)
  testRecursiveInfinity(org.apache.sling.launchpad.webapp.integrationtest.JsonRenderingTest)
  testInvalidLevel(org.apache.sling.launchpad.webapp.integrationtest.JsonRenderingTest)
  testEscapedStrings(org.apache.sling.launchpad.webapp.integrationtest.JsonRenderingTest)
  testAccentedStrings(org.apache.sling.launchpad.webapp.integrationtest.JsonRenderingTest)
  testPostPathIsUnique(org.apache.sling.launchpad.webapp.integrationtest.servlets.post.PostServletCreateTest)
  testCreateNode(org.apache.sling.launchpad.webapp.integrationtest.servlets.post.PostServletCreateTest)
  testCreateNodeWithExtension(org.apache.sling.launchpad.webapp.integrationtest.servlets.post.PostServletCreateTest)
  testCreateNodeAtSpecificUrl(org.apache.sling.launchpad.webapp.integrationtest.servlets.post.PostServletCreateTest)
  testCreateNodeAtDeepUrl(org.apache.sling.launchpad.webapp.integrationtest.servlets.post.PostServletCreateTest)
  testCreateWithData(org.apache.sling.launchpad.webapp.integrationtest.servlets.post.PostServletCreateTest)
  testCreateSubnodeProperty(org.apache.sling.launchpad.webapp.integrationtest.servlets.post.PostServletCreateTest)
  testDefaultSavePrefix(org.apache.sling.launchpad.webapp.integrationtest.servlets.post.PostServletCreateTest)
  testCustomSavePrefix(org.apache.sling.launchpad.webapp.integrationtest.servlets.post.PostServletCreateTest)
  testDefaultBehaviour(org.apache.sling.launchpad.webapp.integrationtest.servlets.post.SlingDefaultValuesTest)
  testWithSpecificDefault(org.apache.sling.launchpad.webapp.integrationtest.servlets.post.SlingDefaultValuesTest)
  testWithIgnore(org.apache.sling.launchpad.webapp.integrationtest.servlets.post.SlingDefaultValuesTest)
  testWithNull(org.apache.sling.launchpad.webapp.integrationtest.servlets.post.SlingDefaultValuesTest)
  testDistinctResource(org.apache.sling.launchpad.webapp.integrationtest.UploadFileTest)
  testDistinctResourceWithType(org.apache.sling.launchpad.webapp.integrationtest.UploadFileTest)
  testDistinctFile(org.apache.sling.launchpad.webapp.integrationtest.UploadFileTest)
  testDefaultResourceType(org.apache.sling.launchpad.webapp.integrationtest.PathBasedResourceTypeTest)
  testExplicitResourceType(org.apache.sling.launchpad.webapp.integrationtest.PathBasedResourceTypeTest)
  testMkdir(org.apache.sling.launchpad.webapp.integrationtest.MkdirTest)
  testMkdirDeep(org.apache.sling.launchpad.webapp.integrationtest.MkdirTest)
  testPostPathIsUnique(org.apache.sling.launchpad.webapp.integrationtest.servlets.post.PostServletUpdateTest)
  testUpdateWithChanges(org.apache.sling.launchpad.webapp.integrationtest.servlets.post.PostServletUpdateTest)
  testUpdateNoChanges(org.apache.sling.launchpad.webapp.integrationtest.servlets.post.PostServletUpdateTest)
  testUpdateSomeChanges(org.apache.sling.launchpad.webapp.integrationtest.servlets.post.PostServletUpdateTest)
  testAptDocument(org.apache.sling.launchpad.webapp.integrationtest.apt.SimpleAptRenderingTest)
  testDelete(org.apache.sling.launchpad.webapp.integrationtest.servlets.post.PostServletDeleteTest)
  testWithoutValueFrom(org.apache.sling.launchpad.webapp.integrationtest.ValueFromTest)
  testWithValueFrom(org.apache.sling.launchpad.webapp.integrationtest.ValueFromTest)
  testWithValueFromAndMissingField(org.apache.sling.launchpad.webapp.integrationtest.ValueFromTest)
  testWithoutInclude(org.apache.sling.launchpad.webapp.integrationtest.IncludeTest)
  testWithInclude(org.apache.sling.launchpad.webapp.integrationtest.IncludeTest)
  testWithIncludeAndExtension(org.apache.sling.launchpad.webapp.integrationtest.IncludeTest)
  testInfiniteLoopDetection(org.apache.sling.launchpad.webapp.integrationtest.IncludeTest)
  testForcedResourceType(org.apache.sling.launchpad.webapp.integrationtest.IncludeTest)
  testWithExactUrl(org.apache.sling.launchpad.webapp.integrationtest.GetWithSuffixTest)
  testGETScript(org.apache.sling.launchpad.webapp.integrationtest.GetWithSuffixTest)
  testWithExtraPathA(org.apache.sling.launchpad.webapp.integrationtest.GetWithSuffixTest)
  testWithExtraPathB(org.apache.sling.launchpad.webapp.integrationtest.GetWithSuffixTest)
  testRtNoScript(org.apache.sling.launchpad.webapp.integrationtest.JspScriptingTest)
  testUnstructuredNoScript(org.apache.sling.launchpad.webapp.integrationtest.JspScriptingTest)
  testRtJsp(org.apache.sling.launchpad.webapp.integrationtest.JspScriptingTest)
  testUnstructuredJsp(org.apache.sling.launchpad.webapp.integrationtest.JspScriptingTest)
  testWithoutScriptTxt(org.apache.sling.launchpad.webapp.integrationtest.NodetypeRenderingTest)
  testWithoutScriptHtml(org.apache.sling.launchpad.webapp.integrationtest.NodetypeRenderingTest)
  testMiniScriptHtml(org.apache.sling.launchpad.webapp.integrationtest.NodetypeRenderingTest)
  testEspHtml(org.apache.sling.launchpad.webapp.integrationtest.NodetypeRenderingTest)
  testEspXml(org.apache.sling.launchpad.webapp.integrationtest.NodetypeRenderingTest)
  testEspPlain(org.apache.sling.launchpad.webapp.integrationtest.NodetypeRenderingTest)
  testIndex(org.apache.sling.launchpad.webapp.integrationtest.InitialContentTest)
  testWithoutScriptTxt(org.apache.sling.launchpad.webapp.integrationtest.SlingResourceTypeRenderingTest)
  testWithoutScriptHtml(org.apache.sling.launchpad.webapp.integrationtest.SlingResourceTypeRenderingTest)
  testEspHtml(org.apache.sling.launchpad.webapp.integrationtest.SlingResourceTypeRenderingTest)
  testEspXml(org.apache.sling.launchpad.webapp.integrationtest.SlingResourceTypeRenderingTest)
  testEspPlain(org.apache.sling.launchpad.webapp.integrationtest.SlingResourceTypeRenderingTest)
  testEspJavaCode(org.apache.sling.launchpad.webapp.integrationtest.SlingResourceTypeRenderingTest)
  testEspHtmlInAppsFolder(org.apache.sling.launchpad.webapp.integrationtest.SlingResourceTypeRenderingTest)
  testEspHtmlWithSelectors(org.apache.sling.launchpad.webapp.integrationtest.SlingResourceTypeRenderingTest)
  testEspJs(org.apache.sling.launchpad.webapp.integrationtest.SlingResourceTypeRenderingTest)
  testDateValues(org.apache.sling.launchpad.webapp.integrationtest.servlets.post.SlingDateValuesTest)
  testNodeAccess(org.apache.sling.launchpad.webapp.integrationtest.PropertyRenderingTest)
  testTextJson(org.apache.sling.launchpad.webapp.integrationtest.PropertyRenderingTest)
  testTextHtml(org.apache.sling.launchpad.webapp.integrationtest.PropertyRenderingTest)
  testTextTxt(org.apache.sling.launchpad.webapp.integrationtest.PropertyRenderingTest)
  testTextNoExt(org.apache.sling.launchpad.webapp.integrationtest.PropertyRenderingTest)
  testResourceTypeNoExt(org.apache.sling.launchpad.webapp.integrationtest.PropertyRenderingTest)
  testPostPathIsUnique(org.apache.sling.launchpad.webapp.integrationtest.servlets.post.SlingAutoPropertiesTest)
  testCreatedAndModified(org.apache.sling.launchpad.webapp.integrationtest.servlets.post.SlingAutoPropertiesTest)
  testWithSpecificValues(org.apache.sling.launchpad.webapp.integrationtest.servlets.post.SlingAutoPropertiesTest)
  testCreateNode(org.apache.sling.launchpad.webapp.integrationtest.CreateNodeTest)
  testCreateNodeMultipart(org.apache.sling.launchpad.webapp.integrationtest.CreateNodeTest)
  testCreateNodeWithNodeType(org.apache.sling.launchpad.webapp.integrationtest.CreateNodeTest)
  testCreateNewNodeWithNodeType(org.apache.sling.launchpad.webapp.integrationtest.CreateNodeTest)
  testDeepCreateNodeWithNodeType(org.apache.sling.launchpad.webapp.integrationtest.CreateNodeTest)
  testCreateEmptyNode(org.apache.sling.launchpad.webapp.integrationtest.CreateNodeTest)
  testFolderQuery(org.apache.sling.launchpad.webapp.integrationtest.JsonQueryServletTest)
  testSubFolderQuery(org.apache.sling.launchpad.webapp.integrationtest.JsonQueryServletTest)
  testDefaultQueryType(org.apache.sling.launchpad.webapp.integrationtest.JsonQueryServletTest)
  testSql(org.apache.sling.launchpad.webapp.integrationtest.JsonQueryServletTest)
  testOffset(org.apache.sling.launchpad.webapp.integrationtest.JsonQueryServletTest)
  testRows(org.apache.sling.launchpad.webapp.integrationtest.JsonQueryServletTest)
  testPropertyParam(org.apache.sling.launchpad.webapp.integrationtest.JsonQueryServletTest)
  testGetStarHtml(org.apache.sling.launchpad.webapp.integrationtest.GetStarTest)
  testGetStarJson(org.apache.sling.launchpad.webapp.integrationtest.GetStarTest)
  testGetStarWithScript(org.apache.sling.launchpad.webapp.integrationtest.GetStarTest)
  testRedirect302(org.apache.sling.launchpad.webapp.integrationtest.RedirectTest)
  testRedirect404(org.apache.sling.launchpad.webapp.integrationtest.RedirectTest)
  testRedirectJson(org.apache.sling.launchpad.webapp.integrationtest.RedirectTest)
  testRedirectJson2(org.apache.sling.launchpad.webapp.integrationtest.RedirectTest)
  testUploadAndDelete(org.apache.sling.launchpad.webapp.integrationtest.FileUploadTest)
  testSessionInfo(org.apache.sling.launchpad.webapp.integrationtest.servlets.post.SlingSessionInfoTest)
  testNonexistentSlingUrl(org.apache.sling.launchpad.webapp.integrationtest.servlets.post.SlingSessionInfoTest)
  testEspBuiltinObjects(org.apache.sling.launchpad.webapp.integrationtest.ScriptBuiltinObjectsTest)
  testNoSyntheticResourceTest(org.apache.sling.launchpad.webapp.integrationtest.SyntheticResourceTest)
  testPlainTextFile(org.apache.sling.launchpad.webapp.integrationtest.StreamServletTest)
  testHtmlFile(org.apache.sling.launchpad.webapp.integrationtest.StreamServletTest)
  testJavascriptFile(org.apache.sling.launchpad.webapp.integrationtest.StreamServletTest)
  testJsonFile(org.apache.sling.launchpad.webapp.integrationtest.StreamServletTest)
  testForcedRedirect(org.apache.sling.launchpad.webapp.integrationtest.PostRedirectTest)
  testDefaultRedirect(org.apache.sling.launchpad.webapp.integrationtest.PostRedirectTest)
  testMagicStarRedirect(org.apache.sling.launchpad.webapp.integrationtest.PostRedirectTest)
  testMagicStarRedirectPrefix(org.apache.sling.launchpad.webapp.integrationtest.PostRedirectTest)
  testMagicStarRedirectSuffix(org.apache.sling.launchpad.webapp.integrationtest.PostRedirectTest)
  testMagicStarRedirectPrefixSuffix(org.apache.sling.launchpad.webapp.integrationtest.PostRedirectTest)
  testWebServerRoot(org.apache.sling.launchpad.webapp.integrationtest.HttpPingTest)
  test404(org.apache.sling.launchpad.webapp.integrationtest.HttpPingTest)

Tests run: 137, Failures: 137, Errors: 0, Skipped: 0

[INFO] ------------------------------------------------------------------------
[ERROR] BUILD FAILURE
[INFO] ------------------------------------------------------------------------
[INFO] There are test failures.
[INFO] ------------------------------------------------------------------------
[INFO] For more information, run Maven with the -e switch
[INFO] ------------------------------------------------------------------------
[INFO] Total time: 4 minutes 2 seconds
[INFO] Finished at: Wed Apr 09 17:17:30 PDT 2008
2008-04-09 17:17:31.266::INFO:  Shutdown hook executing
[INFO] Final Memory: 16M/31M
[INFO] ------------------------------------------------------------------------
2008-04-09 17:20:12.740::INFO:  Shutdown hook complete

****************************************************************************



Mime
View raw message