incubator-sling-commits mailing list archives

Site index · List index
Message view « Date » · « Thread »
Top « Date » · « Thread »
From Continuum VMBuild Server <contin...@apache.org>
Subject [continuum] BUILD FAILURE: Sling Launchpad Web Application
Date Wed, 09 Apr 2008 12:19:37 GMT
Online report : http://vmbuild.apache.org/continuum/buildResult.action?buildId=75067&projectId=535

Build statistics:
  State: Failed
  Previous State: Ok
  Started at: Wed 9 Apr 2008 05:14:57 -0700
  Finished at: Wed 9 Apr 2008 05:19:02 -0700
  Total time: 4m 5s
  Build Trigger: Schedule
  Build Number: 50
  Exit code: 1
  Building machine hostname: vmbuild.apache.org
  Operating system : Linux(unknown)
  Java Home version : 
          java version "1.6.0_05"
          Java(TM) SE Runtime Environment (build 1.6.0_05-b13)
          Java HotSpot(TM) Client VM (build 10.0-b19, mixed mode, sharing)
        
  Builder version :
          Maven version: 2.0.7
          Java version: 1.6.0_05
          OS name: "linux" version: "2.6.20-16-server" arch: "i386"
    
****************************************************************************
SCM Changes:
****************************************************************************
No files changed

****************************************************************************
Dependencies Changes:
****************************************************************************
org.apache.sling:org.apache.sling.scripting.javascript:2.0.0-incubator-SNAPSHOT

org.apache.sling:org.apache.sling.servlets.post:2.0.0-incubator-SNAPSHOT

org.apache.sling:sling:1-incubator-SNAPSHOT


****************************************************************************
Build Defintion:
****************************************************************************
POM filename: pom.xml
Goals: clean install   
Arguments: --batch-mode --non-recursive
Build Fresh: false
Always Build: false
Default Build Definition: true
Schedule: DEFAULT_SCHEDULE
Description: 


****************************************************************************
Test Summary:
****************************************************************************
Tests: 137
Failures: 137
Total time: 62649

****************************************************************************
Output:
****************************************************************************
[INFO] Scanning for projects...
[INFO] ----------------------------------------------------------------------------
[INFO] Building Sling Launchpad Web Application
[INFO]    task-segment: [clean, install]
[INFO] ----------------------------------------------------------------------------
[INFO] [clean:clean]
[INFO] Deleting directory /home/continuum/data/working-directory/535/target
[INFO] Deleting directory /home/continuum/data/working-directory/535/target/classes
[INFO] Deleting directory /home/continuum/data/working-directory/535/target/test-classes
[INFO] Deleting directory /home/continuum/data/working-directory/535/target/site
[INFO] snapshot org.apache.sling:org.apache.sling.launchpad.app:2.0.0-incubator-SNAPSHOT:
checking for updates from apache.snapshots
[INFO] [enforcer:enforce {execution: enforce-java}]
[INFO] [dependency:unpack-dependencies {execution: unpack-dependencies}]
[INFO] Expanding: /home/continuum/.m2/repository/org/apache/sling/org.apache.sling.launchpad.app/2.0.0-incubator-SNAPSHOT/org.apache.sling.launchpad.app-2.0.0-incubator-SNAPSHOT.jar
into /home/continuum/data/working-directory/535/target/launchpad-app
[INFO] Expanding: /home/continuum/.m2/repository/org/eclipse/equinox/http/servlet/1.0.0-v20070606/servlet-1.0.0-v20070606.jar
into /home/continuum/data/working-directory/535/target/launchpad-app
[INFO] [dependency:copy-dependencies {execution: copy-dependencies}]
[INFO] Copying org.apache.sling.launchpad.app-2.0.0-incubator-SNAPSHOT.jar to /home/continuum/data/working-directory/535/target/org.apache.sling.launchpad.webapp-2.0.0-incubator-SNAPSHOT/WEB-INF/resources/bundles/org.apache.sling.launchpad.app-2.0.0-incubator-SNAPSHOT.jar
[INFO] Copying org.apache.sling.scripting.javascript-2.0.0-incubator-SNAPSHOT.jar to /home/continuum/data/working-directory/535/target/org.apache.sling.launchpad.webapp-2.0.0-incubator-SNAPSHOT/WEB-INF/resources/bundles/org.apache.sling.scripting.javascript-2.0.0-incubator-SNAPSHOT.jar
[INFO] Copying org.apache.sling.servlets.post-2.0.0-incubator-SNAPSHOT.jar to /home/continuum/data/working-directory/535/target/org.apache.sling.launchpad.webapp-2.0.0-incubator-SNAPSHOT/WEB-INF/resources/bundles/org.apache.sling.servlets.post-2.0.0-incubator-SNAPSHOT.jar
[INFO] [resources:resources]
[INFO] Using default encoding to copy filtered resources.
[INFO] [compiler:compile]
[INFO] Compiling 2 source files to /home/continuum/data/working-directory/535/target/classes
[INFO] [resources:testResources]
[INFO] Using default encoding to copy filtered resources.
[INFO] [compiler:testCompile]
[INFO] Compiling 39 source files to /home/continuum/data/working-directory/535/target/test-classes
[INFO] [surefire:test]
[INFO] Surefire report directory: /home/continuum/data/working-directory/535/target/surefire-reports

-------------------------------------------------------
 T E S T S
-------------------------------------------------------
There are no tests to run.

Results :

Tests run: 0, Failures: 0, Errors: 0, Skipped: 0

[INFO] [war:war]
[INFO] Exploding webapp...
[INFO] Assembling webapp org.apache.sling.launchpad.webapp in /home/continuum/data/working-directory/535/target/org.apache.sling.launchpad.webapp-2.0.0-incubator-SNAPSHOT
[INFO] Copy webapp webResources to /home/continuum/data/working-directory/535/target/org.apache.sling.launchpad.webapp-2.0.0-incubator-SNAPSHOT
[INFO] Copy webapp webResources to /home/continuum/data/working-directory/535/target/org.apache.sling.launchpad.webapp-2.0.0-incubator-SNAPSHOT
[INFO] Copy webapp webResources to /home/continuum/data/working-directory/535/target/org.apache.sling.launchpad.webapp-2.0.0-incubator-SNAPSHOT
[INFO] Generating war /home/continuum/data/working-directory/535/target/org.apache.sling.launchpad.webapp-2.0.0-incubator-SNAPSHOT.war
[INFO] Building war: /home/continuum/data/working-directory/535/target/org.apache.sling.launchpad.webapp-2.0.0-incubator-SNAPSHOT.war
[INFO] Preparing source:jar
[WARNING] Removing: jar from forked lifecycle, to prevent recursive invocation.
[INFO] [enforcer:enforce {execution: enforce-java}]
[INFO] [source:jar {execution: attach-sources}]
[INFO] Building jar: /home/continuum/data/working-directory/535/target/org.apache.sling.launchpad.webapp-2.0.0-incubator-SNAPSHOT-sources.jar
[INFO] [cargo:start {execution: start-container}]
[INFO] [beddedLocalContainer] Jetty 6.x Embedded starting...
2008-04-09 05:16:55.226::INFO:  Logging to STDERR via org.mortbay.log.StdErrLog
2008-04-09 05:16:55.526::INFO:  jetty-6.1.1rc1
2008-04-09 05:16:58.643::INFO:  Extract jar:file:/home/continuum/data/working-directory/535/target/org.apache.sling.launchpad.webapp-2.0.0-incubator-SNAPSHOT.war!/
to /tmp/Jetty_0_0_0_0_8888_org.apache.sling.launchpad.webapp-2.0.0-incubator-SNAPSHOT.war__org_apache_sling_launchpad_webapp-2_0_0-incubator-SNAPSHOT__tvdn0n/webapp
2008-04-09 05:17:18.522:/org.apache.sling.launchpad.webapp-2.0.0-incubator-SNAPSHOT:INFO:
 sling: Servlet sling initialized
2008-04-09 05:17:18.525::INFO:  Extract jar:file:/tmp/cargo/conf/cargocpc.war!/ to /tmp/Jetty_0_0_0_0_8888_cargocpc.war__cargocpc__rw8xgv/webapp
2008-04-09 05:17:31.397::INFO:  Started SelectChannelConnector @ 0.0.0.0:8888
[INFO] [beddedLocalContainer] Jetty 6.x Embedded started on port [8888]
[INFO] [surefire:test {execution: surefire-integration-test}]
[INFO] Surefire report directory: /home/continuum/data/working-directory/535/target/surefire-reports

-------------------------------------------------------
 T E S T S
-------------------------------------------------------
Running org.apache.sling.launchpad.webapp.integrationtest.StaticContentTest
log4j:WARN No appenders could be found for logger (org.apache.commons.httpclient.HttpClient).
log4j:WARN Please initialize the log4j system properly.
Checking if the required Sling services are started...
(base URLs=http://localhost:8888/org.apache.sling.launchpad.webapp-2.0.0-incubator-SNAPSHOT
and http://localhost:8888/org.apache.sling.launchpad.webapp-2.0.0-incubator-SNAPSHOT)
Server does not seem to be ready, after 60000 msec, got the following 112 Exceptions:java.io.IOException:
Expected status code 302 for POST, got 503, URL=http://localhost:8888/org.apache.sling.launchpad.webapp-2.0.0-incubator-SNAPSHOT/WaitForSlingStartup_1207743459182
java.io.IOException: Expected status code 302 for POST, got 503, URL=http://localhost:8888/org.apache.sling.launchpad.webapp-2.0.0-incubator-SNAPSHOT/WaitForSlingStartup_1207743460039
java.io.IOException: Expected status code 302 for POST, got 503, URL=http://localhost:8888/org.apache.sling.launchpad.webapp-2.0.0-incubator-SNAPSHOT/WaitForSlingStartup_1207743460589
java.io.IOException: Expected status code 302 for POST, got 503, URL=http://localhost:8888/org.apache.sling.launchpad.webapp-2.0.0-incubator-SNAPSHOT/WaitForSlingStartup_1207743461119
java.io.IOException: Expected status code 302 for POST, got 503, URL=http://localhost:8888/org.apache.sling.launchpad.webapp-2.0.0-incubator-SNAPSHOT/WaitForSlingStartup_1207743461639
java.io.IOException: Expected status code 302 for POST, got 503, URL=http://localhost:8888/org.apache.sling.launchpad.webapp-2.0.0-incubator-SNAPSHOT/WaitForSlingStartup_1207743462169
java.io.IOException: Expected status code 302 for POST, got 503, URL=http://localhost:8888/org.apache.sling.launchpad.webapp-2.0.0-incubator-SNAPSHOT/WaitForSlingStartup_1207743462709
java.io.IOException: Expected status code 302 for POST, got 503, URL=http://localhost:8888/org.apache.sling.launchpad.webapp-2.0.0-incubator-SNAPSHOT/WaitForSlingStartup_1207743463229
java.io.IOException: Expected status code 302 for POST, got 503, URL=http://localhost:8888/org.apache.sling.launchpad.webapp-2.0.0-incubator-SNAPSHOT/WaitForSlingStartup_1207743463769
java.io.IOException: Expected status code 302 for POST, got 503, URL=http://localhost:8888/org.apache.sling.launchpad.webapp-2.0.0-incubator-SNAPSHOT/WaitForSlingStartup_1207743464299
java.io.IOException: Expected status code 302 for POST, got 503, URL=http://localhost:8888/org.apache.sling.launchpad.webapp-2.0.0-incubator-SNAPSHOT/WaitForSlingStartup_1207743464819
java.io.IOException: Expected status code 302 for POST, got 503, URL=http://localhost:8888/org.apache.sling.launchpad.webapp-2.0.0-incubator-SNAPSHOT/WaitForSlingStartup_1207743465359
java.io.IOException: Expected status code 302 for POST, got 503, URL=http://localhost:8888/org.apache.sling.launchpad.webapp-2.0.0-incubator-SNAPSHOT/WaitForSlingStartup_1207743465889
java.io.IOException: Expected status code 302 for POST, got 503, URL=http://localhost:8888/org.apache.sling.launchpad.webapp-2.0.0-incubator-SNAPSHOT/WaitForSlingStartup_1207743466409
java.io.IOException: Expected status code 302 for POST, got 503, URL=http://localhost:8888/org.apache.sling.launchpad.webapp-2.0.0-incubator-SNAPSHOT/WaitForSlingStartup_1207743466939
java.io.IOException: Expected status code 302 for POST, got 503, URL=http://localhost:8888/org.apache.sling.launchpad.webapp-2.0.0-incubator-SNAPSHOT/WaitForSlingStartup_1207743467479
java.io.IOException: Expected status code 302 for POST, got 503, URL=http://localhost:8888/org.apache.sling.launchpad.webapp-2.0.0-incubator-SNAPSHOT/WaitForSlingStartup_1207743468009
java.io.IOException: Expected status code 302 for POST, got 503, URL=http://localhost:8888/org.apache.sling.launchpad.webapp-2.0.0-incubator-SNAPSHOT/WaitForSlingStartup_1207743468529
java.io.IOException: Expected status code 302 for POST, got 503, URL=http://localhost:8888/org.apache.sling.launchpad.webapp-2.0.0-incubator-SNAPSHOT/WaitForSlingStartup_1207743469059
java.io.IOException: Expected status code 302 for POST, got 503, URL=http://localhost:8888/org.apache.sling.launchpad.webapp-2.0.0-incubator-SNAPSHOT/WaitForSlingStartup_1207743469579
java.io.IOException: Expected status code 302 for POST, got 503, URL=http://localhost:8888/org.apache.sling.launchpad.webapp-2.0.0-incubator-SNAPSHOT/WaitForSlingStartup_1207743470119
java.io.IOException: Expected status code 302 for POST, got 503, URL=http://localhost:8888/org.apache.sling.launchpad.webapp-2.0.0-incubator-SNAPSHOT/WaitForSlingStartup_1207743470649
java.io.IOException: Expected status code 302 for POST, got 503, URL=http://localhost:8888/org.apache.sling.launchpad.webapp-2.0.0-incubator-SNAPSHOT/WaitForSlingStartup_1207743471169
java.io.IOException: Expected status code 302 for POST, got 503, URL=http://localhost:8888/org.apache.sling.launchpad.webapp-2.0.0-incubator-SNAPSHOT/WaitForSlingStartup_1207743471699
java.io.IOException: Expected status code 302 for POST, got 503, URL=http://localhost:8888/org.apache.sling.launchpad.webapp-2.0.0-incubator-SNAPSHOT/WaitForSlingStartup_1207743472229
java.io.IOException: Expected status code 302 for POST, got 503, URL=http://localhost:8888/org.apache.sling.launchpad.webapp-2.0.0-incubator-SNAPSHOT/WaitForSlingStartup_1207743472759
java.io.IOException: Expected status code 302 for POST, got 503, URL=http://localhost:8888/org.apache.sling.launchpad.webapp-2.0.0-incubator-SNAPSHOT/WaitForSlingStartup_1207743473289
java.io.IOException: Expected status code 302 for POST, got 503, URL=http://localhost:8888/org.apache.sling.launchpad.webapp-2.0.0-incubator-SNAPSHOT/WaitForSlingStartup_1207743473819
java.io.IOException: Expected status code 302 for POST, got 503, URL=http://localhost:8888/org.apache.sling.launchpad.webapp-2.0.0-incubator-SNAPSHOT/WaitForSlingStartup_1207743474359
java.io.IOException: Expected status code 302 for POST, got 503, URL=http://localhost:8888/org.apache.sling.launchpad.webapp-2.0.0-incubator-SNAPSHOT/WaitForSlingStartup_1207743474899
java.io.IOException: Expected status code 302 for POST, got 503, URL=http://localhost:8888/org.apache.sling.launchpad.webapp-2.0.0-incubator-SNAPSHOT/WaitForSlingStartup_1207743475429
java.io.IOException: Expected status code 302 for POST, got 503, URL=http://localhost:8888/org.apache.sling.launchpad.webapp-2.0.0-incubator-SNAPSHOT/WaitForSlingStartup_1207743475959
java.io.IOException: Expected status code 302 for POST, got 503, URL=http://localhost:8888/org.apache.sling.launchpad.webapp-2.0.0-incubator-SNAPSHOT/WaitForSlingStartup_1207743476499
java.io.IOException: Expected status code 302 for POST, got 503, URL=http://localhost:8888/org.apache.sling.launchpad.webapp-2.0.0-incubator-SNAPSHOT/WaitForSlingStartup_1207743477029
java.io.IOException: Expected status code 302 for POST, got 503, URL=http://localhost:8888/org.apache.sling.launchpad.webapp-2.0.0-incubator-SNAPSHOT/WaitForSlingStartup_1207743477549
java.io.IOException: Expected status code 302 for POST, got 503, URL=http://localhost:8888/org.apache.sling.launchpad.webapp-2.0.0-incubator-SNAPSHOT/WaitForSlingStartup_1207743478069
java.io.IOException: Expected status code 302 for POST, got 503, URL=http://localhost:8888/org.apache.sling.launchpad.webapp-2.0.0-incubator-SNAPSHOT/WaitForSlingStartup_1207743478589
java.io.IOException: Expected status code 302 for POST, got 503, URL=http://localhost:8888/org.apache.sling.launchpad.webapp-2.0.0-incubator-SNAPSHOT/WaitForSlingStartup_1207743479120
java.io.IOException: Expected status code 302 for POST, got 503, URL=http://localhost:8888/org.apache.sling.launchpad.webapp-2.0.0-incubator-SNAPSHOT/WaitForSlingStartup_1207743479649
java.io.IOException: Expected status code 302 for POST, got 503, URL=http://localhost:8888/org.apache.sling.launchpad.webapp-2.0.0-incubator-SNAPSHOT/WaitForSlingStartup_1207743480179
java.io.IOException: Expected status code 302 for POST, got 503, URL=http://localhost:8888/org.apache.sling.launchpad.webapp-2.0.0-incubator-SNAPSHOT/WaitForSlingStartup_1207743480699
java.io.IOException: Expected status code 302 for POST, got 503, URL=http://localhost:8888/org.apache.sling.launchpad.webapp-2.0.0-incubator-SNAPSHOT/WaitForSlingStartup_1207743481229
java.io.IOException: Expected status code 302 for POST, got 503, URL=http://localhost:8888/org.apache.sling.launchpad.webapp-2.0.0-incubator-SNAPSHOT/WaitForSlingStartup_1207743481839
java.io.IOException: Expected status code 302 for POST, got 503, URL=http://localhost:8888/org.apache.sling.launchpad.webapp-2.0.0-incubator-SNAPSHOT/WaitForSlingStartup_1207743482359
java.io.IOException: Expected status code 302 for POST, got 503, URL=http://localhost:8888/org.apache.sling.launchpad.webapp-2.0.0-incubator-SNAPSHOT/WaitForSlingStartup_1207743482889
java.io.IOException: Expected status code 302 for POST, got 503, URL=http://localhost:8888/org.apache.sling.launchpad.webapp-2.0.0-incubator-SNAPSHOT/WaitForSlingStartup_1207743483439
java.io.IOException: Expected status code 302 for POST, got 503, URL=http://localhost:8888/org.apache.sling.launchpad.webapp-2.0.0-incubator-SNAPSHOT/WaitForSlingStartup_1207743483969
java.io.IOException: Expected status code 302 for POST, got 503, URL=http://localhost:8888/org.apache.sling.launchpad.webapp-2.0.0-incubator-SNAPSHOT/WaitForSlingStartup_1207743484499
java.io.IOException: Expected status code 302 for POST, got 503, URL=http://localhost:8888/org.apache.sling.launchpad.webapp-2.0.0-incubator-SNAPSHOT/WaitForSlingStartup_1207743485019
java.io.IOException: Expected status code 302 for POST, got 503, URL=http://localhost:8888/org.apache.sling.launchpad.webapp-2.0.0-incubator-SNAPSHOT/WaitForSlingStartup_1207743485549
java.io.IOException: Expected status code 302 for POST, got 503, URL=http://localhost:8888/org.apache.sling.launchpad.webapp-2.0.0-incubator-SNAPSHOT/WaitForSlingStartup_1207743486069
java.io.IOException: Expected status code 302 for POST, got 503, URL=http://localhost:8888/org.apache.sling.launchpad.webapp-2.0.0-incubator-SNAPSHOT/WaitForSlingStartup_1207743486590
java.io.IOException: Expected status code 302 for POST, got 503, URL=http://localhost:8888/org.apache.sling.launchpad.webapp-2.0.0-incubator-SNAPSHOT/WaitForSlingStartup_1207743487129
java.io.IOException: Expected status code 302 for POST, got 503, URL=http://localhost:8888/org.apache.sling.launchpad.webapp-2.0.0-incubator-SNAPSHOT/WaitForSlingStartup_1207743487649
java.io.IOException: Expected status code 302 for POST, got 503, URL=http://localhost:8888/org.apache.sling.launchpad.webapp-2.0.0-incubator-SNAPSHOT/WaitForSlingStartup_1207743488179
java.io.IOException: Expected status code 302 for POST, got 503, URL=http://localhost:8888/org.apache.sling.launchpad.webapp-2.0.0-incubator-SNAPSHOT/WaitForSlingStartup_1207743488709
java.io.IOException: Expected status code 302 for POST, got 503, URL=http://localhost:8888/org.apache.sling.launchpad.webapp-2.0.0-incubator-SNAPSHOT/WaitForSlingStartup_1207743489239
java.io.IOException: Expected status code 302 for POST, got 503, URL=http://localhost:8888/org.apache.sling.launchpad.webapp-2.0.0-incubator-SNAPSHOT/WaitForSlingStartup_1207743489769
java.io.IOException: Expected status code 302 for POST, got 503, URL=http://localhost:8888/org.apache.sling.launchpad.webapp-2.0.0-incubator-SNAPSHOT/WaitForSlingStartup_1207743490289
java.io.IOException: Expected status code 302 for POST, got 503, URL=http://localhost:8888/org.apache.sling.launchpad.webapp-2.0.0-incubator-SNAPSHOT/WaitForSlingStartup_1207743490819
java.io.IOException: Expected status code 302 for POST, got 503, URL=http://localhost:8888/org.apache.sling.launchpad.webapp-2.0.0-incubator-SNAPSHOT/WaitForSlingStartup_1207743491340
java.io.IOException: Expected status code 302 for POST, got 503, URL=http://localhost:8888/org.apache.sling.launchpad.webapp-2.0.0-incubator-SNAPSHOT/WaitForSlingStartup_1207743491869
java.io.IOException: Expected status code 302 for POST, got 503, URL=http://localhost:8888/org.apache.sling.launchpad.webapp-2.0.0-incubator-SNAPSHOT/WaitForSlingStartup_1207743492389
java.io.IOException: Expected status code 302 for POST, got 503, URL=http://localhost:8888/org.apache.sling.launchpad.webapp-2.0.0-incubator-SNAPSHOT/WaitForSlingStartup_1207743492921
java.io.IOException: Expected status code 302 for POST, got 503, URL=http://localhost:8888/org.apache.sling.launchpad.webapp-2.0.0-incubator-SNAPSHOT/WaitForSlingStartup_1207743493479
java.io.IOException: Expected status code 302 for POST, got 503, URL=http://localhost:8888/org.apache.sling.launchpad.webapp-2.0.0-incubator-SNAPSHOT/WaitForSlingStartup_1207743494009
java.io.IOException: Expected status code 302 for POST, got 503, URL=http://localhost:8888/org.apache.sling.launchpad.webapp-2.0.0-incubator-SNAPSHOT/WaitForSlingStartup_1207743494539
java.io.IOException: Expected status code 302 for POST, got 503, URL=http://localhost:8888/org.apache.sling.launchpad.webapp-2.0.0-incubator-SNAPSHOT/WaitForSlingStartup_1207743495060
java.io.IOException: Expected status code 302 for POST, got 503, URL=http://localhost:8888/org.apache.sling.launchpad.webapp-2.0.0-incubator-SNAPSHOT/WaitForSlingStartup_1207743495579
java.io.IOException: Expected status code 302 for POST, got 503, URL=http://localhost:8888/org.apache.sling.launchpad.webapp-2.0.0-incubator-SNAPSHOT/WaitForSlingStartup_1207743496099
java.io.IOException: Expected status code 302 for POST, got 503, URL=http://localhost:8888/org.apache.sling.launchpad.webapp-2.0.0-incubator-SNAPSHOT/WaitForSlingStartup_1207743496619
java.io.IOException: Expected status code 302 for POST, got 503, URL=http://localhost:8888/org.apache.sling.launchpad.webapp-2.0.0-incubator-SNAPSHOT/WaitForSlingStartup_1207743497149
java.io.IOException: Expected status code 302 for POST, got 503, URL=http://localhost:8888/org.apache.sling.launchpad.webapp-2.0.0-incubator-SNAPSHOT/WaitForSlingStartup_1207743497669
java.io.IOException: Expected status code 302 for POST, got 503, URL=http://localhost:8888/org.apache.sling.launchpad.webapp-2.0.0-incubator-SNAPSHOT/WaitForSlingStartup_1207743498199
java.io.IOException: Expected status code 302 for POST, got 503, URL=http://localhost:8888/org.apache.sling.launchpad.webapp-2.0.0-incubator-SNAPSHOT/WaitForSlingStartup_1207743498729
java.io.IOException: Expected status code 302 for POST, got 503, URL=http://localhost:8888/org.apache.sling.launchpad.webapp-2.0.0-incubator-SNAPSHOT/WaitForSlingStartup_1207743499249
java.io.IOException: Expected status code 302 for POST, got 503, URL=http://localhost:8888/org.apache.sling.launchpad.webapp-2.0.0-incubator-SNAPSHOT/WaitForSlingStartup_1207743499779
java.io.IOException: Expected status code 302 for POST, got 503, URL=http://localhost:8888/org.apache.sling.launchpad.webapp-2.0.0-incubator-SNAPSHOT/WaitForSlingStartup_1207743500309
java.io.IOException: Expected status code 302 for POST, got 503, URL=http://localhost:8888/org.apache.sling.launchpad.webapp-2.0.0-incubator-SNAPSHOT/WaitForSlingStartup_1207743500839
java.io.IOException: Expected status code 302 for POST, got 503, URL=http://localhost:8888/org.apache.sling.launchpad.webapp-2.0.0-incubator-SNAPSHOT/WaitForSlingStartup_1207743501389
java.io.IOException: Expected status code 302 for POST, got 503, URL=http://localhost:8888/org.apache.sling.launchpad.webapp-2.0.0-incubator-SNAPSHOT/WaitForSlingStartup_1207743501919
java.io.IOException: Expected status code 302 for POST, got 503, URL=http://localhost:8888/org.apache.sling.launchpad.webapp-2.0.0-incubator-SNAPSHOT/WaitForSlingStartup_1207743502439
java.io.IOException: Expected status code 302 for POST, got 503, URL=http://localhost:8888/org.apache.sling.launchpad.webapp-2.0.0-incubator-SNAPSHOT/WaitForSlingStartup_1207743502969
java.io.IOException: Expected status code 302 for POST, got 503, URL=http://localhost:8888/org.apache.sling.launchpad.webapp-2.0.0-incubator-SNAPSHOT/WaitForSlingStartup_1207743503499
java.io.IOException: Expected status code 302 for POST, got 503, URL=http://localhost:8888/org.apache.sling.launchpad.webapp-2.0.0-incubator-SNAPSHOT/WaitForSlingStartup_1207743504019
java.io.IOException: Expected status code 302 for POST, got 503, URL=http://localhost:8888/org.apache.sling.launchpad.webapp-2.0.0-incubator-SNAPSHOT/WaitForSlingStartup_1207743504769
java.io.IOException: Expected status code 302 for POST, got 503, URL=http://localhost:8888/org.apache.sling.launchpad.webapp-2.0.0-incubator-SNAPSHOT/WaitForSlingStartup_1207743505299
java.io.IOException: Expected status code 302 for POST, got 503, URL=http://localhost:8888/org.apache.sling.launchpad.webapp-2.0.0-incubator-SNAPSHOT/WaitForSlingStartup_1207743505819
java.io.IOException: Expected status code 302 for POST, got 503, URL=http://localhost:8888/org.apache.sling.launchpad.webapp-2.0.0-incubator-SNAPSHOT/WaitForSlingStartup_1207743506339
java.io.IOException: Expected status code 302 for POST, got 503, URL=http://localhost:8888/org.apache.sling.launchpad.webapp-2.0.0-incubator-SNAPSHOT/WaitForSlingStartup_1207743506879
java.io.IOException: Expected status code 302 for POST, got 503, URL=http://localhost:8888/org.apache.sling.launchpad.webapp-2.0.0-incubator-SNAPSHOT/WaitForSlingStartup_1207743507409
java.io.IOException: Expected status code 302 for POST, got 503, URL=http://localhost:8888/org.apache.sling.launchpad.webapp-2.0.0-incubator-SNAPSHOT/WaitForSlingStartup_1207743507939
java.io.IOException: Expected status code 302 for POST, got 503, URL=http://localhost:8888/org.apache.sling.launchpad.webapp-2.0.0-incubator-SNAPSHOT/WaitForSlingStartup_1207743508469
java.io.IOException: Expected status code 302 for POST, got 503, URL=http://localhost:8888/org.apache.sling.launchpad.webapp-2.0.0-incubator-SNAPSHOT/WaitForSlingStartup_1207743508989
java.io.IOException: Expected status code 302 for POST, got 503, URL=http://localhost:8888/org.apache.sling.launchpad.webapp-2.0.0-incubator-SNAPSHOT/WaitForSlingStartup_1207743509709
java.io.IOException: Expected status code 302 for POST, got 503, URL=http://localhost:8888/org.apache.sling.launchpad.webapp-2.0.0-incubator-SNAPSHOT/WaitForSlingStartup_1207743510239
java.io.IOException: Expected status code 302 for POST, got 503, URL=http://localhost:8888/org.apache.sling.launchpad.webapp-2.0.0-incubator-SNAPSHOT/WaitForSlingStartup_1207743510759
java.io.IOException: Expected status code 302 for POST, got 503, URL=http://localhost:8888/org.apache.sling.launchpad.webapp-2.0.0-incubator-SNAPSHOT/WaitForSlingStartup_1207743511289
java.io.IOException: Expected status code 302 for POST, got 503, URL=http://localhost:8888/org.apache.sling.launchpad.webapp-2.0.0-incubator-SNAPSHOT/WaitForSlingStartup_1207743511809
java.io.IOException: Expected status code 302 for POST, got 503, URL=http://localhost:8888/org.apache.sling.launchpad.webapp-2.0.0-incubator-SNAPSHOT/WaitForSlingStartup_1207743512339
java.io.IOException: Expected status code 302 for POST, got 503, URL=http://localhost:8888/org.apache.sling.launchpad.webapp-2.0.0-incubator-SNAPSHOT/WaitForSlingStartup_1207743512879
java.io.IOException: Expected status code 302 for POST, got 503, URL=http://localhost:8888/org.apache.sling.launchpad.webapp-2.0.0-incubator-SNAPSHOT/WaitForSlingStartup_1207743513409
java.io.IOException: Expected status code 302 for POST, got 503, URL=http://localhost:8888/org.apache.sling.launchpad.webapp-2.0.0-incubator-SNAPSHOT/WaitForSlingStartup_1207743513939
java.io.IOException: Expected status code 302 for POST, got 503, URL=http://localhost:8888/org.apache.sling.launchpad.webapp-2.0.0-incubator-SNAPSHOT/WaitForSlingStartup_1207743514469
java.io.IOException: Expected status code 302 for POST, got 503, URL=http://localhost:8888/org.apache.sling.launchpad.webapp-2.0.0-incubator-SNAPSHOT/WaitForSlingStartup_1207743514989
java.io.IOException: Expected status code 302 for POST, got 503, URL=http://localhost:8888/org.apache.sling.launchpad.webapp-2.0.0-incubator-SNAPSHOT/WaitForSlingStartup_1207743515519
java.io.IOException: Expected status code 302 for POST, got 503, URL=http://localhost:8888/org.apache.sling.launchpad.webapp-2.0.0-incubator-SNAPSHOT/WaitForSlingStartup_1207743516039
java.io.IOException: Expected status code 302 for POST, got 503, URL=http://localhost:8888/org.apache.sling.launchpad.webapp-2.0.0-incubator-SNAPSHOT/WaitForSlingStartup_1207743516579
java.io.IOException: Expected status code 302 for POST, got 503, URL=http://localhost:8888/org.apache.sling.launchpad.webapp-2.0.0-incubator-SNAPSHOT/WaitForSlingStartup_1207743517099
java.io.IOException: Expected status code 302 for POST, got 503, URL=http://localhost:8888/org.apache.sling.launchpad.webapp-2.0.0-incubator-SNAPSHOT/WaitForSlingStartup_1207743517629
java.io.IOException: Expected status code 302 for POST, got 503, URL=http://localhost:8888/org.apache.sling.launchpad.webapp-2.0.0-incubator-SNAPSHOT/WaitForSlingStartup_1207743518149
java.io.IOException: Expected status code 302 for POST, got 503, URL=http://localhost:8888/org.apache.sling.launchpad.webapp-2.0.0-incubator-SNAPSHOT/WaitForSlingStartup_1207743518679

Tests run: 2, Failures: 2, Errors: 0, Skipped: 0, Time elapsed: 62.388 sec <<< FAILURE!
Running org.apache.sling.launchpad.webapp.integrationtest.servlets.post.PostServletOrderTest
Tests run: 9, Failures: 9, Errors: 0, Skipped: 0, Time elapsed: 0.021 sec <<< FAILURE!
Running org.apache.sling.launchpad.webapp.integrationtest.JavascriptWrappersTest
Tests run: 1, Failures: 1, Errors: 0, Skipped: 0, Time elapsed: 0.006 sec <<< FAILURE!
Running org.apache.sling.launchpad.webapp.integrationtest.GeneratedNodeNameTest
Tests run: 5, Failures: 5, Errors: 0, Skipped: 0, Time elapsed: 0.013 sec <<< FAILURE!
Running org.apache.sling.launchpad.webapp.integrationtest.servlets.post.PostServletMoveTest
Tests run: 7, Failures: 7, Errors: 0, Skipped: 0, Time elapsed: 0.016 sec <<< FAILURE!
Running org.apache.sling.launchpad.webapp.integrationtest.JsonRenderingTest
Tests run: 8, Failures: 8, Errors: 0, Skipped: 0, Time elapsed: 0.017 sec <<< FAILURE!
Running org.apache.sling.launchpad.webapp.integrationtest.servlets.post.PostServletCreateTest
Tests run: 9, Failures: 9, Errors: 0, Skipped: 0, Time elapsed: 0.015 sec <<< FAILURE!
Running org.apache.sling.launchpad.webapp.integrationtest.servlets.post.SlingDefaultValuesTest
Tests run: 4, Failures: 4, Errors: 0, Skipped: 0, Time elapsed: 0.011 sec <<< FAILURE!
Running org.apache.sling.launchpad.webapp.integrationtest.UploadFileTest
Tests run: 3, Failures: 3, Errors: 0, Skipped: 0, Time elapsed: 0.008 sec <<< FAILURE!
Running org.apache.sling.launchpad.webapp.integrationtest.PathBasedResourceTypeTest
Tests run: 2, Failures: 2, Errors: 0, Skipped: 0, Time elapsed: 0.006 sec <<< FAILURE!
Running org.apache.sling.launchpad.webapp.integrationtest.MkdirTest
Tests run: 2, Failures: 2, Errors: 0, Skipped: 0, Time elapsed: 0.006 sec <<< FAILURE!
Running org.apache.sling.launchpad.webapp.integrationtest.servlets.post.PostServletUpdateTest
Tests run: 4, Failures: 4, Errors: 0, Skipped: 0, Time elapsed: 0.009 sec <<< FAILURE!
Running org.apache.sling.launchpad.webapp.integrationtest.apt.SimpleAptRenderingTest
Tests run: 1, Failures: 1, Errors: 0, Skipped: 0, Time elapsed: 0.003 sec <<< FAILURE!
Running org.apache.sling.launchpad.webapp.integrationtest.servlets.post.PostServletDeleteTest
Tests run: 1, Failures: 1, Errors: 0, Skipped: 0, Time elapsed: 0.005 sec <<< FAILURE!
Running org.apache.sling.launchpad.webapp.integrationtest.ValueFromTest
Tests run: 3, Failures: 3, Errors: 0, Skipped: 0, Time elapsed: 0.007 sec <<< FAILURE!
Running org.apache.sling.launchpad.webapp.integrationtest.IncludeTest
Tests run: 5, Failures: 5, Errors: 0, Skipped: 0, Time elapsed: 0.018 sec <<< FAILURE!
Running org.apache.sling.launchpad.webapp.integrationtest.GetWithSuffixTest
Tests run: 4, Failures: 4, Errors: 0, Skipped: 0, Time elapsed: 0.009 sec <<< FAILURE!
Running org.apache.sling.launchpad.webapp.integrationtest.JspScriptingTest
Tests run: 4, Failures: 4, Errors: 0, Skipped: 0, Time elapsed: 0.008 sec <<< FAILURE!
Running org.apache.sling.launchpad.webapp.integrationtest.NodetypeRenderingTest
Tests run: 6, Failures: 6, Errors: 0, Skipped: 0, Time elapsed: 0.011 sec <<< FAILURE!
Running org.apache.sling.launchpad.webapp.integrationtest.InitialContentTest
Tests run: 1, Failures: 1, Errors: 0, Skipped: 0, Time elapsed: 0.006 sec <<< FAILURE!
Running org.apache.sling.launchpad.webapp.integrationtest.SlingResourceTypeRenderingTest
Tests run: 9, Failures: 9, Errors: 0, Skipped: 0, Time elapsed: 0.023 sec <<< FAILURE!
Running org.apache.sling.launchpad.webapp.integrationtest.servlets.post.SlingDateValuesTest
Tests run: 1, Failures: 1, Errors: 0, Skipped: 0, Time elapsed: 0.005 sec <<< FAILURE!
Running org.apache.sling.launchpad.webapp.integrationtest.PropertyRenderingTest
Tests run: 6, Failures: 6, Errors: 0, Skipped: 0, Time elapsed: 0.013 sec <<< FAILURE!
Running org.apache.sling.launchpad.webapp.integrationtest.servlets.post.SlingAutoPropertiesTest
Tests run: 3, Failures: 3, Errors: 0, Skipped: 0, Time elapsed: 0.008 sec <<< FAILURE!
Running org.apache.sling.launchpad.webapp.integrationtest.CreateNodeTest
Tests run: 6, Failures: 6, Errors: 0, Skipped: 0, Time elapsed: 0.013 sec <<< FAILURE!
Running org.apache.sling.launchpad.webapp.integrationtest.JsonQueryServletTest
Tests run: 7, Failures: 7, Errors: 0, Skipped: 0, Time elapsed: 0.009 sec <<< FAILURE!
Running org.apache.sling.launchpad.webapp.integrationtest.GetStarTest
Tests run: 3, Failures: 3, Errors: 0, Skipped: 0, Time elapsed: 0.006 sec <<< FAILURE!
Running org.apache.sling.launchpad.webapp.integrationtest.RedirectTest
Tests run: 4, Failures: 4, Errors: 0, Skipped: 0, Time elapsed: 0.02 sec <<< FAILURE!
Running org.apache.sling.launchpad.webapp.integrationtest.FileUploadTest
Tests run: 1, Failures: 1, Errors: 0, Skipped: 0, Time elapsed: 0.006 sec <<< FAILURE!
Running org.apache.sling.launchpad.webapp.integrationtest.servlets.post.SlingSessionInfoTest
Tests run: 2, Failures: 2, Errors: 0, Skipped: 0, Time elapsed: 0.004 sec <<< FAILURE!
Running org.apache.sling.launchpad.webapp.integrationtest.ScriptBuiltinObjectsTest
Tests run: 1, Failures: 1, Errors: 0, Skipped: 0, Time elapsed: 0.006 sec <<< FAILURE!
Running org.apache.sling.launchpad.webapp.integrationtest.SyntheticResourceTest
Tests run: 1, Failures: 1, Errors: 0, Skipped: 0, Time elapsed: 0.004 sec <<< FAILURE!
Running org.apache.sling.launchpad.webapp.integrationtest.StreamServletTest
Tests run: 4, Failures: 4, Errors: 0, Skipped: 0, Time elapsed: 0.006 sec <<< FAILURE!
Running org.apache.sling.launchpad.webapp.integrationtest.PostRedirectTest
Tests run: 6, Failures: 6, Errors: 0, Skipped: 0, Time elapsed: 0.01 sec <<< FAILURE!
Running org.apache.sling.launchpad.webapp.integrationtest.HttpPingTest
Tests run: 2, Failures: 2, Errors: 0, Skipped: 0, Time elapsed: 0.007 sec <<< FAILURE!

Results :

Failed tests: 
  testWebInfForbidden(org.apache.sling.launchpad.webapp.integrationtest.StaticContentTest)
  testMetaInfForbidden(org.apache.sling.launchpad.webapp.integrationtest.StaticContentTest)
  testStandardOrder(org.apache.sling.launchpad.webapp.integrationtest.servlets.post.PostServletOrderTest)
  testOrderFirst(org.apache.sling.launchpad.webapp.integrationtest.servlets.post.PostServletOrderTest)
  testOrderLast(org.apache.sling.launchpad.webapp.integrationtest.servlets.post.PostServletOrderTest)
  testOrderBefore(org.apache.sling.launchpad.webapp.integrationtest.servlets.post.PostServletOrderTest)
  testOrderAfter(org.apache.sling.launchpad.webapp.integrationtest.servlets.post.PostServletOrderTest)
  testOrderIntToBack(org.apache.sling.launchpad.webapp.integrationtest.servlets.post.PostServletOrderTest)
  testOrderIntToFront(org.apache.sling.launchpad.webapp.integrationtest.servlets.post.PostServletOrderTest)
  testOrderIntZero(org.apache.sling.launchpad.webapp.integrationtest.servlets.post.PostServletOrderTest)
  testOrderIntOOB(org.apache.sling.launchpad.webapp.integrationtest.servlets.post.PostServletOrderTest)
  testRecursiveDump(org.apache.sling.launchpad.webapp.integrationtest.JavascriptWrappersTest)
  testTitle(org.apache.sling.launchpad.webapp.integrationtest.GeneratedNodeNameTest)
  testSlingPostNodeNameParam(org.apache.sling.launchpad.webapp.integrationtest.GeneratedNodeNameTest)
  testTitleWithSavePrefix(org.apache.sling.launchpad.webapp.integrationtest.GeneratedNodeNameTest)
  testCollision(org.apache.sling.launchpad.webapp.integrationtest.GeneratedNodeNameTest)
  testNoParams(org.apache.sling.launchpad.webapp.integrationtest.GeneratedNodeNameTest)
  testMoveNodeAbsolute(org.apache.sling.launchpad.webapp.integrationtest.servlets.post.PostServletMoveTest)
  testMoveNodeRelative(org.apache.sling.launchpad.webapp.integrationtest.servlets.post.PostServletMoveTest)
  testMoveNodeNew(org.apache.sling.launchpad.webapp.integrationtest.servlets.post.PostServletMoveTest)
  testMoveNodeExistingFail(org.apache.sling.launchpad.webapp.integrationtest.servlets.post.PostServletMoveTest)
  testMoveNodeExistingReplace(org.apache.sling.launchpad.webapp.integrationtest.servlets.post.PostServletMoveTest)
  testMoveNodeDeep(org.apache.sling.launchpad.webapp.integrationtest.servlets.post.PostServletMoveTest)
  testMoveNodeDeepFail(org.apache.sling.launchpad.webapp.integrationtest.servlets.post.PostServletMoveTest)
  testAssertJavascript(org.apache.sling.launchpad.webapp.integrationtest.JsonRenderingTest)
  testNonRecursive(org.apache.sling.launchpad.webapp.integrationtest.JsonRenderingTest)
  testRecursiveOneLevel(org.apache.sling.launchpad.webapp.integrationtest.JsonRenderingTest)
  testRecursiveZeroLevels(org.apache.sling.launchpad.webapp.integrationtest.JsonRenderingTest)
  testRecursiveInfinity(org.apache.sling.launchpad.webapp.integrationtest.JsonRenderingTest)
  testInvalidLevel(org.apache.sling.launchpad.webapp.integrationtest.JsonRenderingTest)
  testEscapedStrings(org.apache.sling.launchpad.webapp.integrationtest.JsonRenderingTest)
  testAccentedStrings(org.apache.sling.launchpad.webapp.integrationtest.JsonRenderingTest)
  testPostPathIsUnique(org.apache.sling.launchpad.webapp.integrationtest.servlets.post.PostServletCreateTest)
  testCreateNode(org.apache.sling.launchpad.webapp.integrationtest.servlets.post.PostServletCreateTest)
  testCreateNodeWithExtension(org.apache.sling.launchpad.webapp.integrationtest.servlets.post.PostServletCreateTest)
  testCreateNodeAtSpecificUrl(org.apache.sling.launchpad.webapp.integrationtest.servlets.post.PostServletCreateTest)
  testCreateNodeAtDeepUrl(org.apache.sling.launchpad.webapp.integrationtest.servlets.post.PostServletCreateTest)
  testCreateWithData(org.apache.sling.launchpad.webapp.integrationtest.servlets.post.PostServletCreateTest)
  testCreateSubnodeProperty(org.apache.sling.launchpad.webapp.integrationtest.servlets.post.PostServletCreateTest)
  testDefaultSavePrefix(org.apache.sling.launchpad.webapp.integrationtest.servlets.post.PostServletCreateTest)
  testCustomSavePrefix(org.apache.sling.launchpad.webapp.integrationtest.servlets.post.PostServletCreateTest)
  testDefaultBehaviour(org.apache.sling.launchpad.webapp.integrationtest.servlets.post.SlingDefaultValuesTest)
  testWithSpecificDefault(org.apache.sling.launchpad.webapp.integrationtest.servlets.post.SlingDefaultValuesTest)
  testWithIgnore(org.apache.sling.launchpad.webapp.integrationtest.servlets.post.SlingDefaultValuesTest)
  testWithNull(org.apache.sling.launchpad.webapp.integrationtest.servlets.post.SlingDefaultValuesTest)
  testDistinctResource(org.apache.sling.launchpad.webapp.integrationtest.UploadFileTest)
  testDistinctResourceWithType(org.apache.sling.launchpad.webapp.integrationtest.UploadFileTest)
  testDistinctFile(org.apache.sling.launchpad.webapp.integrationtest.UploadFileTest)
  testDefaultResourceType(org.apache.sling.launchpad.webapp.integrationtest.PathBasedResourceTypeTest)
  testExplicitResourceType(org.apache.sling.launchpad.webapp.integrationtest.PathBasedResourceTypeTest)
  testMkdir(org.apache.sling.launchpad.webapp.integrationtest.MkdirTest)
  testMkdirDeep(org.apache.sling.launchpad.webapp.integrationtest.MkdirTest)
  testPostPathIsUnique(org.apache.sling.launchpad.webapp.integrationtest.servlets.post.PostServletUpdateTest)
  testUpdateWithChanges(org.apache.sling.launchpad.webapp.integrationtest.servlets.post.PostServletUpdateTest)
  testUpdateNoChanges(org.apache.sling.launchpad.webapp.integrationtest.servlets.post.PostServletUpdateTest)
  testUpdateSomeChanges(org.apache.sling.launchpad.webapp.integrationtest.servlets.post.PostServletUpdateTest)
  testAptDocument(org.apache.sling.launchpad.webapp.integrationtest.apt.SimpleAptRenderingTest)
  testDelete(org.apache.sling.launchpad.webapp.integrationtest.servlets.post.PostServletDeleteTest)
  testWithoutValueFrom(org.apache.sling.launchpad.webapp.integrationtest.ValueFromTest)
  testWithValueFrom(org.apache.sling.launchpad.webapp.integrationtest.ValueFromTest)
  testWithValueFromAndMissingField(org.apache.sling.launchpad.webapp.integrationtest.ValueFromTest)
  testWithoutInclude(org.apache.sling.launchpad.webapp.integrationtest.IncludeTest)
  testWithInclude(org.apache.sling.launchpad.webapp.integrationtest.IncludeTest)
  testWithIncludeAndExtension(org.apache.sling.launchpad.webapp.integrationtest.IncludeTest)
  testInfiniteLoopDetection(org.apache.sling.launchpad.webapp.integrationtest.IncludeTest)
  testForcedResourceType(org.apache.sling.launchpad.webapp.integrationtest.IncludeTest)
  testWithExactUrl(org.apache.sling.launchpad.webapp.integrationtest.GetWithSuffixTest)
  testGETScript(org.apache.sling.launchpad.webapp.integrationtest.GetWithSuffixTest)
  testWithExtraPathA(org.apache.sling.launchpad.webapp.integrationtest.GetWithSuffixTest)
  testWithExtraPathB(org.apache.sling.launchpad.webapp.integrationtest.GetWithSuffixTest)
  testRtNoScript(org.apache.sling.launchpad.webapp.integrationtest.JspScriptingTest)
  testUnstructuredNoScript(org.apache.sling.launchpad.webapp.integrationtest.JspScriptingTest)
  testRtJsp(org.apache.sling.launchpad.webapp.integrationtest.JspScriptingTest)
  testUnstructuredJsp(org.apache.sling.launchpad.webapp.integrationtest.JspScriptingTest)
  testWithoutScriptTxt(org.apache.sling.launchpad.webapp.integrationtest.NodetypeRenderingTest)
  testWithoutScriptHtml(org.apache.sling.launchpad.webapp.integrationtest.NodetypeRenderingTest)
  testMiniScriptHtml(org.apache.sling.launchpad.webapp.integrationtest.NodetypeRenderingTest)
  testEspHtml(org.apache.sling.launchpad.webapp.integrationtest.NodetypeRenderingTest)
  testEspXml(org.apache.sling.launchpad.webapp.integrationtest.NodetypeRenderingTest)
  testEspPlain(org.apache.sling.launchpad.webapp.integrationtest.NodetypeRenderingTest)
  testIndex(org.apache.sling.launchpad.webapp.integrationtest.InitialContentTest)
  testWithoutScriptTxt(org.apache.sling.launchpad.webapp.integrationtest.SlingResourceTypeRenderingTest)
  testWithoutScriptHtml(org.apache.sling.launchpad.webapp.integrationtest.SlingResourceTypeRenderingTest)
  testEspHtml(org.apache.sling.launchpad.webapp.integrationtest.SlingResourceTypeRenderingTest)
  testEspXml(org.apache.sling.launchpad.webapp.integrationtest.SlingResourceTypeRenderingTest)
  testEspPlain(org.apache.sling.launchpad.webapp.integrationtest.SlingResourceTypeRenderingTest)
  testEspJavaCode(org.apache.sling.launchpad.webapp.integrationtest.SlingResourceTypeRenderingTest)
  testEspHtmlInAppsFolder(org.apache.sling.launchpad.webapp.integrationtest.SlingResourceTypeRenderingTest)
  testEspHtmlWithSelectors(org.apache.sling.launchpad.webapp.integrationtest.SlingResourceTypeRenderingTest)
  testEspJs(org.apache.sling.launchpad.webapp.integrationtest.SlingResourceTypeRenderingTest)
  testDateValues(org.apache.sling.launchpad.webapp.integrationtest.servlets.post.SlingDateValuesTest)
  testNodeAccess(org.apache.sling.launchpad.webapp.integrationtest.PropertyRenderingTest)
  testTextJson(org.apache.sling.launchpad.webapp.integrationtest.PropertyRenderingTest)
  testTextHtml(org.apache.sling.launchpad.webapp.integrationtest.PropertyRenderingTest)
  testTextTxt(org.apache.sling.launchpad.webapp.integrationtest.PropertyRenderingTest)
  testTextNoExt(org.apache.sling.launchpad.webapp.integrationtest.PropertyRenderingTest)
  testResourceTypeNoExt(org.apache.sling.launchpad.webapp.integrationtest.PropertyRenderingTest)
  testPostPathIsUnique(org.apache.sling.launchpad.webapp.integrationtest.servlets.post.SlingAutoPropertiesTest)
  testCreatedAndModified(org.apache.sling.launchpad.webapp.integrationtest.servlets.post.SlingAutoPropertiesTest)
  testWithSpecificValues(org.apache.sling.launchpad.webapp.integrationtest.servlets.post.SlingAutoPropertiesTest)
  testCreateNode(org.apache.sling.launchpad.webapp.integrationtest.CreateNodeTest)
  testCreateNodeMultipart(org.apache.sling.launchpad.webapp.integrationtest.CreateNodeTest)
  testCreateNodeWithNodeType(org.apache.sling.launchpad.webapp.integrationtest.CreateNodeTest)
  testCreateNewNodeWithNodeType(org.apache.sling.launchpad.webapp.integrationtest.CreateNodeTest)
  testDeepCreateNodeWithNodeType(org.apache.sling.launchpad.webapp.integrationtest.CreateNodeTest)
  testCreateEmptyNode(org.apache.sling.launchpad.webapp.integrationtest.CreateNodeTest)
  testFolderQuery(org.apache.sling.launchpad.webapp.integrationtest.JsonQueryServletTest)
  testSubFolderQuery(org.apache.sling.launchpad.webapp.integrationtest.JsonQueryServletTest)
  testDefaultQueryType(org.apache.sling.launchpad.webapp.integrationtest.JsonQueryServletTest)
  testSql(org.apache.sling.launchpad.webapp.integrationtest.JsonQueryServletTest)
  testOffset(org.apache.sling.launchpad.webapp.integrationtest.JsonQueryServletTest)
  testRows(org.apache.sling.launchpad.webapp.integrationtest.JsonQueryServletTest)
  testPropertyParam(org.apache.sling.launchpad.webapp.integrationtest.JsonQueryServletTest)
  testGetStarHtml(org.apache.sling.launchpad.webapp.integrationtest.GetStarTest)
  testGetStarJson(org.apache.sling.launchpad.webapp.integrationtest.GetStarTest)
  testGetStarWithScript(org.apache.sling.launchpad.webapp.integrationtest.GetStarTest)
  testRedirect302(org.apache.sling.launchpad.webapp.integrationtest.RedirectTest)
  testRedirect404(org.apache.sling.launchpad.webapp.integrationtest.RedirectTest)
  testRedirectJson(org.apache.sling.launchpad.webapp.integrationtest.RedirectTest)
  testRedirectJson2(org.apache.sling.launchpad.webapp.integrationtest.RedirectTest)
  testUploadAndDelete(org.apache.sling.launchpad.webapp.integrationtest.FileUploadTest)
  testSessionInfo(org.apache.sling.launchpad.webapp.integrationtest.servlets.post.SlingSessionInfoTest)
  testNonexistentSlingUrl(org.apache.sling.launchpad.webapp.integrationtest.servlets.post.SlingSessionInfoTest)
  testEspBuiltinObjects(org.apache.sling.launchpad.webapp.integrationtest.ScriptBuiltinObjectsTest)
  testNoSyntheticResourceTest(org.apache.sling.launchpad.webapp.integrationtest.SyntheticResourceTest)
  testPlainTextFile(org.apache.sling.launchpad.webapp.integrationtest.StreamServletTest)
  testHtmlFile(org.apache.sling.launchpad.webapp.integrationtest.StreamServletTest)
  testJavascriptFile(org.apache.sling.launchpad.webapp.integrationtest.StreamServletTest)
  testJsonFile(org.apache.sling.launchpad.webapp.integrationtest.StreamServletTest)
  testForcedRedirect(org.apache.sling.launchpad.webapp.integrationtest.PostRedirectTest)
  testDefaultRedirect(org.apache.sling.launchpad.webapp.integrationtest.PostRedirectTest)
  testMagicStarRedirect(org.apache.sling.launchpad.webapp.integrationtest.PostRedirectTest)
  testMagicStarRedirectPrefix(org.apache.sling.launchpad.webapp.integrationtest.PostRedirectTest)
  testMagicStarRedirectSuffix(org.apache.sling.launchpad.webapp.integrationtest.PostRedirectTest)
  testMagicStarRedirectPrefixSuffix(org.apache.sling.launchpad.webapp.integrationtest.PostRedirectTest)
  testWebServerRoot(org.apache.sling.launchpad.webapp.integrationtest.HttpPingTest)
  test404(org.apache.sling.launchpad.webapp.integrationtest.HttpPingTest)

Tests run: 137, Failures: 137, Errors: 0, Skipped: 0

[INFO] ------------------------------------------------------------------------
[ERROR] BUILD FAILURE
[INFO] ------------------------------------------------------------------------
[INFO] There are test failures.
[INFO] ------------------------------------------------------------------------
[INFO] For more information, run Maven with the -e switch
[INFO] ------------------------------------------------------------------------
[INFO] Total time: 3 minutes 34 seconds
[INFO] Finished at: Wed Apr 09 05:18:39 PDT 2008
[INFO] Final Memory: 18M/33M
[INFO] ------------------------------------------------------------------------
2008-04-09 05:18:39.901::INFO:  Shutdown hook executing
2008-04-09 05:19:01.129::INFO:  Shutdown hook complete

****************************************************************************



Mime
View raw message