incubator-sling-commits mailing list archives

Site index · List index
Message view « Date » · « Thread »
Top « Date » · « Thread »
From Continuum VMBuild Server <contin...@apache.org>
Subject [continuum] BUILD SUCCESSFUL: Sling Resource Resolver and Initial Content Loader
Date Wed, 09 Apr 2008 11:42:52 GMT
Online report : http://vmbuild.apache.org/continuum/buildResult.action?buildId=75031&projectId=298

Build statistics:
  State: Ok
  Previous State: Error
  Started at: Wed 9 Apr 2008 04:35:53 -0700
  Finished at: Wed 9 Apr 2008 04:42:20 -0700
  Total time: 6m 27s
  Build Trigger: Schedule
  Build Number: 104
  Exit code: 0
  Building machine hostname: vmbuild.apache.org
  Operating system : Linux(unknown)
  Java Home version : 
          java version "1.6.0_05"
          Java(TM) SE Runtime Environment (build 1.6.0_05-b13)
          Java HotSpot(TM) Client VM (build 10.0-b19, mixed mode, sharing)
        
  Builder version :
          Maven version: 2.0.7
          Java version: 1.6.0_05
          OS name: "linux" version: "2.6.20-16-server" arch: "i386"
    
****************************************************************************
SCM Changes:
****************************************************************************
No files changed

****************************************************************************
Dependencies Changes:
****************************************************************************
org.apache.sling:org.apache.sling.api:2.0.0-incubator-SNAPSHOT

org.apache.sling:org.apache.sling.commons.mime:2.0.0-incubator-SNAPSHOT

org.apache.sling:org.apache.sling.commons.json:2.0.0-incubator-SNAPSHOT

org.apache.sling:org.apache.sling.osgi.commons:2.0.0-incubator-SNAPSHOT

org.apache.sling:org.apache.sling.jcr.api:2.0.0-incubator-SNAPSHOT

org.apache.sling:org.apache.sling.adapter:2.0.0-incubator-SNAPSHOT

org.apache.sling:org.apache.sling.commons.testing:2.0.0-incubator-SNAPSHOT

org.apache.sling:sling:1-incubator-SNAPSHOT


****************************************************************************
Build Defintion:
****************************************************************************
POM filename: pom.xml
Goals: clean install   
Arguments: --batch-mode --non-recursive
Build Fresh: false
Always Build: false
Default Build Definition: true
Schedule: DEFAULT_SCHEDULE
Description: 


****************************************************************************
Test Summary:
****************************************************************************
Tests: 78
Failures: 0
Total time: 328735

****************************************************************************
Output:
****************************************************************************
[INFO] Scanning for projects...
[INFO] ----------------------------------------------------------------------------
[INFO] Building Sling Resource Resolver and Initial Content Loader
[INFO]    task-segment: [clean, install]
[INFO] ----------------------------------------------------------------------------
[INFO] [clean:clean]
[INFO] Deleting directory /home/continuum/data/working-directory/298/target
[INFO] Deleting directory /home/continuum/data/working-directory/298/target/classes
[INFO] Deleting directory /home/continuum/data/working-directory/298/target/test-classes
[INFO] Deleting directory /home/continuum/data/working-directory/298/target/site
[INFO] snapshot org.apache.sling:org.apache.sling.commons.mime:2.0.0-incubator-SNAPSHOT: checking
for updates from apache.snapshots
[INFO] snapshot org.apache.sling:org.apache.sling.commons.json:2.0.0-incubator-SNAPSHOT: checking
for updates from apache.snapshots
[INFO] snapshot org.apache.sling:org.apache.sling.adapter:2.0.0-incubator-SNAPSHOT: checking
for updates from apache.snapshots
[INFO] [enforcer:enforce {execution: enforce-java}]
[INFO] [jcrocm:ocm {execution: generate-JCR-OCM-descriptor}]
[INFO] No Jackrabbit OCM Descriptors found in project
[INFO] [resources:resources]
[INFO] Using default encoding to copy filtered resources.
[INFO] [compiler:compile]
[INFO] Compiling 28 source files to /home/continuum/data/working-directory/298/target/classes
[INFO] [scr:scr {execution: generate-scr-scrdescriptor}]
[INFO] Generating 2 MetaType Descriptors to /home/continuum/data/working-directory/298/target/scr-plugin-generated/OSGI-INF/metatype/metatype.xml
[INFO] Writing abstract service descriptor /home/continuum/data/working-directory/298/target/scr-plugin-generated/OSGI-INF/scr-plugin/scrinfo.xml
with 2 entries.
[INFO] Generating 2 Service Component Descriptors to /home/continuum/data/working-directory/298/target/scr-plugin-generated/OSGI-INF/serviceComponents.xml
[INFO] [resources:testResources]
[INFO] Using default encoding to copy filtered resources.
[INFO] [compiler:testCompile]
[INFO] Compiling 10 source files to /home/continuum/data/working-directory/298/target/test-classes
[INFO] [surefire:test]
[INFO] Surefire report directory: /home/continuum/data/working-directory/298/target/surefire-reports

-------------------------------------------------------
 T E S T S
-------------------------------------------------------
Running org.apache.sling.jcr.resource.internal.loader.XJsonReaderTest
Tests run: 19, Failures: 0, Errors: 0, Skipped: 0, Time elapsed: 0.083 sec
Running org.apache.sling.jcr.resource.internal.helper.ResourcePathIteratorTest
Tests run: 15, Failures: 0, Errors: 0, Skipped: 0, Time elapsed: 0.024 sec
Running org.apache.sling.jcr.resource.internal.helper.JcrNodeResourceIteratorTest
Tests run: 3, Failures: 0, Errors: 0, Skipped: 0, Time elapsed: 0.031 sec
Running org.apache.sling.jcr.resource.internal.helper.jcr.JcrNodeResourceTest
1260 [main] INFO org.apache.jackrabbit.core.RepositoryImpl - Starting repository...
1325 [main] INFO org.apache.jackrabbit.core.fs.local.LocalFileSystem - LocalFileSystem initialized
at path target/repository/repository
3310 [main] INFO org.apache.jackrabbit.core.nodetype.NodeTypeRegistry - no custom node type
definitions found
3318 [main] INFO org.apache.jackrabbit.core.fs.local.LocalFileSystem - LocalFileSystem initialized
at path target/repository/version
168431 [main] INFO org.apache.jackrabbit.core.persistence.db.DatabasePersistenceManager -
Database: Apache Derby / 10.2.1.6 - (452058)
168432 [main] INFO org.apache.jackrabbit.core.persistence.db.DatabasePersistenceManager -
Driver: Apache Derby Embedded JDBC Driver / 10.2.1.6 - (452058)
216276 [main] INFO org.apache.jackrabbit.core.fs.local.LocalFileSystem - LocalFileSystem initialized
at path target/repository/version/blobs
217887 [main] INFO org.apache.jackrabbit.core.RepositoryImpl - initializing workspace 'default'...
217888 [main] INFO org.apache.jackrabbit.core.fs.local.LocalFileSystem - LocalFileSystem initialized
at path target/repository/workspaces/default
305650 [main] INFO org.apache.jackrabbit.core.persistence.db.DatabasePersistenceManager -
Database: Apache Derby / 10.2.1.6 - (452058)
305650 [main] INFO org.apache.jackrabbit.core.persistence.db.DatabasePersistenceManager -
Driver: Apache Derby Embedded JDBC Driver / 10.2.1.6 - (452058)
310952 [main] INFO org.apache.jackrabbit.core.fs.local.LocalFileSystem - LocalFileSystem initialized
at path target/repository/workspaces/default/blobs
311026 [main] INFO org.apache.jackrabbit.core.RepositoryImpl - workspace 'default' initialized
312560 [main] INFO org.apache.jackrabbit.core.fs.local.LocalFileSystem - LocalFileSystem initialized
at path target/repository/repository/index
314071 [main] INFO org.apache.jackrabbit.core.query.lucene.SearchIndex - Index initialized:
target/repository/repository/index Version: 2
314088 [main] INFO org.apache.jackrabbit.core.fs.local.LocalFileSystem - LocalFileSystem initialized
at path target/repository/workspaces/default/index
314097 [main] INFO org.apache.jackrabbit.core.query.lucene.SearchIndex - Index initialized:
target/repository/workspaces/default/index Version: 2
314102 [main] INFO org.apache.jackrabbit.core.RepositoryImpl - Repository started
Tests run: 6, Failures: 0, Errors: 0, Skipped: 0, Time elapsed: 325.417 sec
Running org.apache.sling.jcr.resource.internal.JcrResourceResolverTest
325933 [main] INFO org.apache.sling.jcr.resource.internal.JcrResourceResolver - Could not
resolve URL /test1207741315266/missing to a Resource
325936 [main] INFO org.apache.sling.jcr.resource.internal.JcrResourceResolver - Could not
resolve URL /test12077413152661207741315696 to a Resource
326151 [main] INFO org.apache.sling.jcr.resource.internal.JcrResourceResolver - Could not
resolve URL /test1207741315816/nothing to a Resource
326151 [main] INFO org.apache.sling.jcr.resource.internal.JcrResourceResolver - Could not
resolve URL /test1207741315816/nothing to a Resource
328409 [main] INFO org.apache.sling.jcr.resource.internal.helper.jcr.JcrResourceProvider -
itemExists: Error checking for existence of /test1207741316081/1207741318168/*: javax.jcr.RepositoryException:
invalid path:/test1207741316081/1207741318168/*: '/test1207741316081/1207741318168/*' is not
a valid path. '*' not a valid name character.: '/test1207741316081/1207741318168/*' is not
a valid path. '*' not a valid name character.
328409 [main] INFO org.apache.sling.jcr.resource.internal.JcrResourceResolver - Could not
resolve URL /test1207741316081/1207741318168/* to a Resource
328411 [main] INFO org.apache.sling.jcr.resource.internal.helper.jcr.JcrResourceProvider -
itemExists: Error checking for existence of /test1207741316081/1207741318168/*: javax.jcr.RepositoryException:
invalid path:/test1207741316081/1207741318168/*: '/test1207741316081/1207741318168/*' is not
a valid path. '*' not a valid name character.: '/test1207741316081/1207741318168/*' is not
a valid path. '*' not a valid name character.
328411 [main] INFO org.apache.sling.jcr.resource.internal.JcrResourceResolver - Could not
resolve URL /test1207741316081/1207741318168/* to a Resource
328411 [main] INFO org.apache.sling.jcr.resource.internal.helper.jcr.JcrResourceProvider -
itemExists: Error checking for existence of /test1207741316081/1207741318168/*: javax.jcr.RepositoryException:
invalid path:/test1207741316081/1207741318168/*: '/test1207741316081/1207741318168/*' is not
a valid path. '*' not a valid name character.: '/test1207741316081/1207741318168/*' is not
a valid path. '*' not a valid name character.
328411 [main] INFO org.apache.sling.jcr.resource.internal.JcrResourceResolver - Could not
resolve URL /test1207741316081/1207741318168/* to a Resource
328411 [main] INFO org.apache.sling.jcr.resource.internal.helper.jcr.JcrResourceProvider -
itemExists: Error checking for existence of /test1207741316081/1207741318168/*: javax.jcr.RepositoryException:
invalid path:/test1207741316081/1207741318168/*: '/test1207741316081/1207741318168/*' is not
a valid path. '*' not a valid name character.: '/test1207741316081/1207741318168/*' is not
a valid path. '*' not a valid name character.
328411 [main] INFO org.apache.sling.jcr.resource.internal.JcrResourceResolver - Could not
resolve URL /test1207741316081/1207741318168/* to a Resource
328469 [main] INFO org.apache.sling.jcr.resource.internal.helper.jcr.JcrResourceProvider -
itemExists: Error checking for existence of /test1207741318191/1207741318228/*.html: javax.jcr.RepositoryException:
invalid path:/test1207741318191/1207741318228/*.html: '/test1207741318191/1207741318228/*.html'
is not a valid path. '*' not a valid name character.: '/test1207741318191/1207741318228/*.html'
is not a valid path. '*' not a valid name character.
328469 [main] INFO org.apache.sling.jcr.resource.internal.helper.jcr.JcrResourceProvider -
itemExists: Error checking for existence of /test1207741318191/1207741318228/*: javax.jcr.RepositoryException:
invalid path:/test1207741318191/1207741318228/*: '/test1207741318191/1207741318228/*' is not
a valid path. '*' not a valid name character.: '/test1207741318191/1207741318228/*' is not
a valid path. '*' not a valid name character.
328469 [main] INFO org.apache.sling.jcr.resource.internal.JcrResourceResolver - Could not
resolve URL /test1207741318191/1207741318228/*.html to a Resource
328469 [main] INFO org.apache.sling.jcr.resource.internal.helper.jcr.JcrResourceProvider -
itemExists: Error checking for existence of /test1207741318191/1207741318228/*.html: javax.jcr.RepositoryException:
invalid path:/test1207741318191/1207741318228/*.html: '/test1207741318191/1207741318228/*.html'
is not a valid path. '*' not a valid name character.: '/test1207741318191/1207741318228/*.html'
is not a valid path. '*' not a valid name character.
328469 [main] INFO org.apache.sling.jcr.resource.internal.helper.jcr.JcrResourceProvider -
itemExists: Error checking for existence of /test1207741318191/1207741318228/*: javax.jcr.RepositoryException:
invalid path:/test1207741318191/1207741318228/*: '/test1207741318191/1207741318228/*' is not
a valid path. '*' not a valid name character.: '/test1207741318191/1207741318228/*' is not
a valid path. '*' not a valid name character.
328469 [main] INFO org.apache.sling.jcr.resource.internal.JcrResourceResolver - Could not
resolve URL /test1207741318191/1207741318228/*.html to a Resource
328469 [main] INFO org.apache.sling.jcr.resource.internal.helper.jcr.JcrResourceProvider -
itemExists: Error checking for existence of /test1207741318191/1207741318228/*.html: javax.jcr.RepositoryException:
invalid path:/test1207741318191/1207741318228/*.html: '/test1207741318191/1207741318228/*.html'
is not a valid path. '*' not a valid name character.: '/test1207741318191/1207741318228/*.html'
is not a valid path. '*' not a valid name character.
328469 [main] INFO org.apache.sling.jcr.resource.internal.helper.jcr.JcrResourceProvider -
itemExists: Error checking for existence of /test1207741318191/1207741318228/*: javax.jcr.RepositoryException:
invalid path:/test1207741318191/1207741318228/*: '/test1207741318191/1207741318228/*' is not
a valid path. '*' not a valid name character.: '/test1207741318191/1207741318228/*' is not
a valid path. '*' not a valid name character.
328469 [main] INFO org.apache.sling.jcr.resource.internal.JcrResourceResolver - Could not
resolve URL /test1207741318191/1207741318228/*.html to a Resource
328469 [main] INFO org.apache.sling.jcr.resource.internal.helper.jcr.JcrResourceProvider -
itemExists: Error checking for existence of /test1207741318191/1207741318228/*.html: javax.jcr.RepositoryException:
invalid path:/test1207741318191/1207741318228/*.html: '/test1207741318191/1207741318228/*.html'
is not a valid path. '*' not a valid name character.: '/test1207741318191/1207741318228/*.html'
is not a valid path. '*' not a valid name character.
328469 [main] INFO org.apache.sling.jcr.resource.internal.helper.jcr.JcrResourceProvider -
itemExists: Error checking for existence of /test1207741318191/1207741318228/*: javax.jcr.RepositoryException:
invalid path:/test1207741318191/1207741318228/*: '/test1207741318191/1207741318228/*' is not
a valid path. '*' not a valid name character.: '/test1207741318191/1207741318228/*' is not
a valid path. '*' not a valid name character.
328470 [main] INFO org.apache.sling.jcr.resource.internal.JcrResourceResolver - Could not
resolve URL /test1207741318191/1207741318228/*.html to a Resource
328514 [main] INFO org.apache.sling.jcr.resource.internal.helper.jcr.JcrResourceProvider -
itemExists: Error checking for existence of /test1207741318251/1207741318273/*.print.a4.html:
javax.jcr.RepositoryException: invalid path:/test1207741318251/1207741318273/*.print.a4.html:
'/test1207741318251/1207741318273/*.print.a4.html' is not a valid path. '*' not a valid name
character.: '/test1207741318251/1207741318273/*.print.a4.html' is not a valid path. '*' not
a valid name character.
328514 [main] INFO org.apache.sling.jcr.resource.internal.helper.jcr.JcrResourceProvider -
itemExists: Error checking for existence of /test1207741318251/1207741318273/*.print.a4: javax.jcr.RepositoryException:
invalid path:/test1207741318251/1207741318273/*.print.a4: '/test1207741318251/1207741318273/*.print.a4'
is not a valid path. '*' not a valid name character.: '/test1207741318251/1207741318273/*.print.a4'
is not a valid path. '*' not a valid name character.
328527 [main] INFO org.apache.sling.jcr.resource.internal.helper.jcr.JcrResourceProvider -
itemExists: Error checking for existence of /test1207741318251/1207741318273/*.print: javax.jcr.RepositoryException:
invalid path:/test1207741318251/1207741318273/*.print: '/test1207741318251/1207741318273/*.print'
is not a valid path. '*' not a valid name character.: '/test1207741318251/1207741318273/*.print'
is not a valid path. '*' not a valid name character.
328528 [main] INFO org.apache.sling.jcr.resource.internal.helper.jcr.JcrResourceProvider -
itemExists: Error checking for existence of /test1207741318251/1207741318273/*: javax.jcr.RepositoryException:
invalid path:/test1207741318251/1207741318273/*: '/test1207741318251/1207741318273/*' is not
a valid path. '*' not a valid name character.: '/test1207741318251/1207741318273/*' is not
a valid path. '*' not a valid name character.
328528 [main] INFO org.apache.sling.jcr.resource.internal.JcrResourceResolver - Could not
resolve URL /test1207741318251/1207741318273/*.print.a4.html to a Resource
328528 [main] INFO org.apache.sling.jcr.resource.internal.helper.jcr.JcrResourceProvider -
itemExists: Error checking for existence of /test1207741318251/1207741318273/*.print.a4.html:
javax.jcr.RepositoryException: invalid path:/test1207741318251/1207741318273/*.print.a4.html:
'/test1207741318251/1207741318273/*.print.a4.html' is not a valid path. '*' not a valid name
character.: '/test1207741318251/1207741318273/*.print.a4.html' is not a valid path. '*' not
a valid name character.
328528 [main] INFO org.apache.sling.jcr.resource.internal.helper.jcr.JcrResourceProvider -
itemExists: Error checking for existence of /test1207741318251/1207741318273/*.print.a4: javax.jcr.RepositoryException:
invalid path:/test1207741318251/1207741318273/*.print.a4: '/test1207741318251/1207741318273/*.print.a4'
is not a valid path. '*' not a valid name character.: '/test1207741318251/1207741318273/*.print.a4'
is not a valid path. '*' not a valid name character.
328528 [main] INFO org.apache.sling.jcr.resource.internal.helper.jcr.JcrResourceProvider -
itemExists: Error checking for existence of /test1207741318251/1207741318273/*.print: javax.jcr.RepositoryException:
invalid path:/test1207741318251/1207741318273/*.print: '/test1207741318251/1207741318273/*.print'
is not a valid path. '*' not a valid name character.: '/test1207741318251/1207741318273/*.print'
is not a valid path. '*' not a valid name character.
328528 [main] INFO org.apache.sling.jcr.resource.internal.helper.jcr.JcrResourceProvider -
itemExists: Error checking for existence of /test1207741318251/1207741318273/*: javax.jcr.RepositoryException:
invalid path:/test1207741318251/1207741318273/*: '/test1207741318251/1207741318273/*' is not
a valid path. '*' not a valid name character.: '/test1207741318251/1207741318273/*' is not
a valid path. '*' not a valid name character.
328528 [main] INFO org.apache.sling.jcr.resource.internal.JcrResourceResolver - Could not
resolve URL /test1207741318251/1207741318273/*.print.a4.html to a Resource
328528 [main] INFO org.apache.sling.jcr.resource.internal.helper.jcr.JcrResourceProvider -
itemExists: Error checking for existence of /test1207741318251/1207741318273/*.print.a4.html:
javax.jcr.RepositoryException: invalid path:/test1207741318251/1207741318273/*.print.a4.html:
'/test1207741318251/1207741318273/*.print.a4.html' is not a valid path. '*' not a valid name
character.: '/test1207741318251/1207741318273/*.print.a4.html' is not a valid path. '*' not
a valid name character.
328528 [main] INFO org.apache.sling.jcr.resource.internal.helper.jcr.JcrResourceProvider -
itemExists: Error checking for existence of /test1207741318251/1207741318273/*.print.a4: javax.jcr.RepositoryException:
invalid path:/test1207741318251/1207741318273/*.print.a4: '/test1207741318251/1207741318273/*.print.a4'
is not a valid path. '*' not a valid name character.: '/test1207741318251/1207741318273/*.print.a4'
is not a valid path. '*' not a valid name character.
328528 [main] INFO org.apache.sling.jcr.resource.internal.helper.jcr.JcrResourceProvider -
itemExists: Error checking for existence of /test1207741318251/1207741318273/*.print: javax.jcr.RepositoryException:
invalid path:/test1207741318251/1207741318273/*.print: '/test1207741318251/1207741318273/*.print'
is not a valid path. '*' not a valid name character.: '/test1207741318251/1207741318273/*.print'
is not a valid path. '*' not a valid name character.
328531 [main] INFO org.apache.sling.jcr.resource.internal.helper.jcr.JcrResourceProvider -
itemExists: Error checking for existence of /test1207741318251/1207741318273/*: javax.jcr.RepositoryException:
invalid path:/test1207741318251/1207741318273/*: '/test1207741318251/1207741318273/*' is not
a valid path. '*' not a valid name character.: '/test1207741318251/1207741318273/*' is not
a valid path. '*' not a valid name character.
328531 [main] INFO org.apache.sling.jcr.resource.internal.JcrResourceResolver - Could not
resolve URL /test1207741318251/1207741318273/*.print.a4.html to a Resource
328531 [main] INFO org.apache.sling.jcr.resource.internal.helper.jcr.JcrResourceProvider -
itemExists: Error checking for existence of /test1207741318251/1207741318273/*.print.a4.html:
javax.jcr.RepositoryException: invalid path:/test1207741318251/1207741318273/*.print.a4.html:
'/test1207741318251/1207741318273/*.print.a4.html' is not a valid path. '*' not a valid name
character.: '/test1207741318251/1207741318273/*.print.a4.html' is not a valid path. '*' not
a valid name character.
328531 [main] INFO org.apache.sling.jcr.resource.internal.helper.jcr.JcrResourceProvider -
itemExists: Error checking for existence of /test1207741318251/1207741318273/*.print.a4: javax.jcr.RepositoryException:
invalid path:/test1207741318251/1207741318273/*.print.a4: '/test1207741318251/1207741318273/*.print.a4'
is not a valid path. '*' not a valid name character.: '/test1207741318251/1207741318273/*.print.a4'
is not a valid path. '*' not a valid name character.
328531 [main] INFO org.apache.sling.jcr.resource.internal.helper.jcr.JcrResourceProvider -
itemExists: Error checking for existence of /test1207741318251/1207741318273/*.print: javax.jcr.RepositoryException:
invalid path:/test1207741318251/1207741318273/*.print: '/test1207741318251/1207741318273/*.print'
is not a valid path. '*' not a valid name character.: '/test1207741318251/1207741318273/*.print'
is not a valid path. '*' not a valid name character.
328531 [main] INFO org.apache.sling.jcr.resource.internal.helper.jcr.JcrResourceProvider -
itemExists: Error checking for existence of /test1207741318251/1207741318273/*: javax.jcr.RepositoryException:
invalid path:/test1207741318251/1207741318273/*: '/test1207741318251/1207741318273/*' is not
a valid path. '*' not a valid name character.: '/test1207741318251/1207741318273/*' is not
a valid path. '*' not a valid name character.
328531 [main] INFO org.apache.sling.jcr.resource.internal.JcrResourceResolver - Could not
resolve URL /test1207741318251/1207741318273/*.print.a4.html to a Resource
Tests run: 7, Failures: 0, Errors: 0, Skipped: 0, Time elapsed: 3.129 sec
Running org.apache.sling.jcr.resource.internal.helper.ResourceProviderEntryTest
Tests run: 5, Failures: 0, Errors: 0, Skipped: 0, Time elapsed: 0.021 sec
Running org.apache.sling.jcr.resource.internal.loader.JsonReaderTest
Tests run: 19, Failures: 0, Errors: 0, Skipped: 0, Time elapsed: 0.048 sec
Running org.apache.sling.jcr.resource.JcrResourceUtilTest
328644 [main] ERROR org.apache.sling.jcr.resource.JcrResourceUtil - normalize: Path '/..'
cannot be resolved
328644 [main] ERROR org.apache.sling.jcr.resource.JcrResourceUtil - normalize: Path '/..'
cannot be resolved
328644 [main] ERROR org.apache.sling.jcr.resource.JcrResourceUtil - normalize: Path '/a/b/../../..'
cannot be resolved
328644 [main] ERROR org.apache.sling.jcr.resource.JcrResourceUtil - normalize: Path '/..'
cannot be resolved
328644 [main] ERROR org.apache.sling.jcr.resource.JcrResourceUtil - normalize: Path '/..'
cannot be resolved
328644 [main] ERROR org.apache.sling.jcr.resource.JcrResourceUtil - normalize: Path '/az/bz/../../..'
cannot be resolved
328644 [main] ERROR org.apache.sling.jcr.resource.JcrResourceUtil - normalize: Path '/a/b/../../../c'
cannot be resolved
328645 [main] ERROR org.apache.sling.jcr.resource.JcrResourceUtil - normalize: Path '/az/bz/../../../cz'
cannot be resolved
328645 [main] ERROR org.apache.sling.jcr.resource.JcrResourceUtil - normalize: Path 'a/b/../../../c'
cannot be resolved
328645 [main] ERROR org.apache.sling.jcr.resource.JcrResourceUtil - normalize: Not modifying
empty path
328646 [main] ERROR org.apache.sling.jcr.resource.JcrResourceUtil - normalize: Path '/..'
cannot be resolved
Tests run: 4, Failures: 0, Errors: 0, Skipped: 0, Time elapsed: 0.007 sec

Results :

Tests run: 78, Failures: 0, Errors: 0, Skipped: 0

328650 [Thread-7] INFO org.apache.jackrabbit.core.RepositoryImpl - Shutting down repository...
328710 [IndexMerger] INFO org.apache.jackrabbit.core.query.lucene.IndexMerger - IndexMerger
terminated
328715 [Thread-7] INFO org.apache.jackrabbit.core.query.lucene.SearchIndex - Index closed:
target/repository/repository/index
328715 [Thread-7] INFO org.apache.jackrabbit.core.RepositoryImpl - shutting down workspace
'default'...
328716 [Thread-7] INFO org.apache.jackrabbit.core.observation.ObservationDispatcher - Notification
of EventListeners stopped.
328716 [IndexMerger] INFO org.apache.jackrabbit.core.query.lucene.IndexMerger - IndexMerger
terminated
330904 [Thread-7] INFO org.apache.jackrabbit.core.query.lucene.SearchIndex - Index closed:
target/repository/workspaces/default/index
342944 [Thread-7] INFO org.apache.jackrabbit.core.persistence.db.DerbyPersistenceManager -
Database 'target/repository/workspaces/default/db' shutdown.
342945 [Thread-7] INFO org.apache.jackrabbit.core.RepositoryImpl - workspace 'default' has
been shutdown
346905 [Thread-7] INFO org.apache.jackrabbit.core.persistence.db.DerbyPersistenceManager -
Database 'target/repository/version/db' shutdown.
346906 [Thread-7] INFO org.apache.jackrabbit.core.RepositoryImpl - Repository has been shutdown
[INFO] [bundle:bundle]
[WARNING] Warning building bundle org.apache.sling:org.apache.sling.jcr.resource:bundle:2.0.0-incubator-SNAPSHOT
: Instructions for Private-Package that are never used: org\.kxml2\.io, org\.xmlpull\.v1
[INFO] Preparing source:jar
[WARNING] Removing: jar from forked lifecycle, to prevent recursive invocation.
[INFO] [enforcer:enforce {execution: enforce-java}]
[INFO] [source:jar {execution: attach-sources}]
[INFO] Building jar: /home/continuum/data/working-directory/298/target/org.apache.sling.jcr.resource-2.0.0-incubator-SNAPSHOT-sources.jar
[INFO] [install:install]
[INFO] Installing /home/continuum/data/working-directory/298/target/org.apache.sling.jcr.resource-2.0.0-incubator-SNAPSHOT.jar
to /home/continuum/.m2/repository/org/apache/sling/org.apache.sling.jcr.resource/2.0.0-incubator-SNAPSHOT/org.apache.sling.jcr.resource-2.0.0-incubator-SNAPSHOT.jar
[INFO] Installing /home/continuum/data/working-directory/298/target/org.apache.sling.jcr.resource-2.0.0-incubator-SNAPSHOT-sources.jar
to /home/continuum/.m2/repository/org/apache/sling/org.apache.sling.jcr.resource/2.0.0-incubator-SNAPSHOT/org.apache.sling.jcr.resource-2.0.0-incubator-SNAPSHOT-sources.jar
[INFO] [bundle:install]
[INFO] Parsing file:/home/continuum/.m2/repository/repository.xml
[INFO] Installing org/apache/sling/org.apache.sling.jcr.resource/2.0.0-incubator-SNAPSHOT/org.apache.sling.jcr.resource-2.0.0-incubator-SNAPSHOT.jar
[INFO] Writing OBR metadata
[INFO] ------------------------------------------------------------------------
[INFO] BUILD SUCCESSFUL
[INFO] ------------------------------------------------------------------------
[INFO] Total time: 6 minutes 17 seconds
[INFO] Finished at: Wed Apr 09 04:42:20 PDT 2008
[INFO] Final Memory: 14M/32M
[INFO] ------------------------------------------------------------------------

****************************************************************************



Mime
View raw message