incubator-sling-commits mailing list archives

Site index · List index
Message view « Date » · « Thread »
Top « Date » · « Thread »
From Continuum VMBuild Server <contin...@apache.org>
Subject [continuum] BUILD FAILURE: Sling - Sling JSON Library
Date Fri, 04 Apr 2008 17:19:50 GMT
Online report : http://vmbuild.apache.org/continuum/buildResult.action?buildId=73186&projectId=287

Build statistics:
  State: Failed
  Previous State: Ok
  Started at: Fri 4 Apr 2008 10:19:16 -0700
  Finished at: Fri 4 Apr 2008 10:19:40 -0700
  Total time: 24s
  Build Trigger: Schedule
  Build Number: 36
  Exit code: 1
  Building machine hostname: vmbuild.apache.org
  Operating system : Linux(unknown)
  Java Home version : 
          java version "1.6.0_05"
          Java(TM) SE Runtime Environment (build 1.6.0_05-b13)
          Java HotSpot(TM) Client VM (build 10.0-b19, mixed mode, sharing)
        
  Builder version :
          Maven version: 2.0.7
          Java version: 1.6.0_05
          OS name: "linux" version: "2.6.20-16-server" arch: "i386"
    
****************************************************************************
SCM Changes:
****************************************************************************
Changed: cziegeler @ Fri 4 Apr 2008 09:05:04 -0700
Comment: Write lengths of binaries correctly and prefix it with a colon instead of a star.
Files changed:
  /incubator/sling/trunk/commons/json/src/main/java/org/apache/sling/commons/json/jcr/JsonItemWriter.java
( 644750 )

****************************************************************************
Dependencies Changes:
****************************************************************************
No dependencies changed


****************************************************************************
Build Defintion:
****************************************************************************
POM filename: pom.xml
Goals: clean install   
Arguments: --batch-mode --non-recursive
Build Fresh: false
Always Build: false
Default Build Definition: true
Schedule: DEFAULT_SCHEDULE
Description: 


****************************************************************************
Test Summary:
****************************************************************************
Tests: 2
Failures: 1
Total time: 47

****************************************************************************
Output:
****************************************************************************
[INFO] Scanning for projects...
[INFO] ----------------------------------------------------------------------------
[INFO] Building Sling - Sling JSON Library
[INFO]    task-segment: [clean, install]
[INFO] ----------------------------------------------------------------------------
[INFO] [clean:clean]
[INFO] Deleting directory /home/continuum/data/working-directory/287/target
[INFO] Deleting directory /home/continuum/data/working-directory/287/target/classes
[INFO] Deleting directory /home/continuum/data/working-directory/287/target/test-classes
[INFO] Deleting directory /home/continuum/data/working-directory/287/target/site
[INFO] snapshot org.apache.sling:org.apache.sling.commons.testing:2.0.0-incubator-SNAPSHOT:
checking for updates from apache.snapshots
[INFO] snapshot org.apache.sling:org.apache.sling.jcr.api:2.0.0-incubator-SNAPSHOT: checking
for updates from apache.snapshots
[INFO] [enforcer:enforce {execution: enforce-java}]
[INFO] [resources:resources]
[INFO] Using default encoding to copy filtered resources.
[INFO] [compiler:compile]
[INFO] Compiling 15 source files to /home/continuum/data/working-directory/287/target/classes
[INFO] [resources:testResources]
[INFO] Using default encoding to copy filtered resources.
[INFO] [compiler:testCompile]
[INFO] Compiling 1 source file to /home/continuum/data/working-directory/287/target/test-classes
[INFO] [surefire:test]
[INFO] Surefire report directory: /home/continuum/data/working-directory/287/target/surefire-reports

-------------------------------------------------------
 T E S T S
-------------------------------------------------------
Running org.apache.sling.commons.json.jcr.JsonItemWriterTest
Tests run: 2, Failures: 0, Errors: 1, Skipped: 0, Time elapsed: 0.054 sec <<< FAILURE!

Results :

Tests in error: 
  testMultivalued(org.apache.sling.commons.json.jcr.JsonItemWriterTest)

Tests run: 2, Failures: 0, Errors: 1, Skipped: 0

[INFO] ------------------------------------------------------------------------
[ERROR] BUILD FAILURE
[INFO] ------------------------------------------------------------------------
[INFO] There are test failures.
[INFO] ------------------------------------------------------------------------
[INFO] For more information, run Maven with the -e switch
[INFO] ------------------------------------------------------------------------
[INFO] Total time: 15 seconds
[INFO] Finished at: Fri Apr 04 10:19:40 PDT 2008
[INFO] Final Memory: 10M/23M
[INFO] ------------------------------------------------------------------------

****************************************************************************



Mime
View raw message