incubator-sling-commits mailing list archives

Site index · List index
Message view « Date » · « Thread »
Top « Date » · « Thread »
From Continuum VMBuild Server <contin...@apache.org>
Subject [continuum] BUILD FAILURE: Sling Launchpad Web Application
Date Fri, 07 Mar 2008 14:45:15 GMT
Online report : http://vmbuild.apache.org/continuum/buildResult.action?buildId=62350&projectId=535

Build statistics:
  State: Failed
  Previous State: Ok
  Started at: Fri 7 Mar 2008 06:41:43 -0800
  Finished at: Fri 7 Mar 2008 06:44:48 -0800
  Total time: 3m 5s
  Build Trigger: Schedule
  Build Number: 9
  Exit code: 1
  Building machine hostname: vmbuild.apache.org
  Operating system : Linux(unknown)
  Java Home version : 
          java version "1.6.0"
          Java(TM) SE Runtime Environment (build 1.6.0-b105)
          Java HotSpot(TM) Client VM (build 1.6.0-b105, mixed mode, sharing)
        
  Builder version :
          Maven version: 2.0.7
          Java version: 1.6.0
          OS name: "linux" version: "2.6.20-16-server" arch: "i386"
    
****************************************************************************
SCM Changes:
****************************************************************************
No files changed

****************************************************************************
Dependencies Changes:
****************************************************************************
org.apache.sling:org.apache.sling.launchpad.app:2.0.0-incubator-SNAPSHOT


****************************************************************************
Build Defintion:
****************************************************************************
POM filename: pom.xml
Goals: clean install   
Arguments: --batch-mode --non-recursive
Build Fresh: false
Always Build: false
Default Build Definition: true
Schedule: DEFAULT_SCHEDULE
Description: 


****************************************************************************
Test Summary:
****************************************************************************
Tests: 128
Failures: 128
Total time: 79652

****************************************************************************
Output:
****************************************************************************
[INFO] Scanning for projects...
[INFO] ----------------------------------------------------------------------------
[INFO] Building Sling Launchpad Web Application
[INFO]    task-segment: [clean, install]
[INFO] ----------------------------------------------------------------------------
[INFO] [clean:clean]
[INFO] Deleting directory /home/continuum/data/working-directory/535/target
[INFO] Deleting directory /home/continuum/data/working-directory/535/target/classes
[INFO] Deleting directory /home/continuum/data/working-directory/535/target/test-classes
[INFO] Deleting directory /home/continuum/data/working-directory/535/target/site
[INFO] [enforcer:enforce {execution: enforce-java}]
[INFO] [dependency:unpack-dependencies {execution: unpack-dependencies}]
[INFO] Expanding: /home/continuum/.m2/repository/org/apache/sling/org.apache.sling.launchpad.app/2.0.0-incubator-SNAPSHOT/org.apache.sling.launchpad.app-2.0.0-incubator-SNAPSHOT.jar
into /home/continuum/data/working-directory/535/target/launchpad-app
[INFO] Expanding: /home/continuum/.m2/repository/org/eclipse/equinox/http/servlet/1.0.0-v20070606/servlet-1.0.0-v20070606.jar
into /home/continuum/data/working-directory/535/target/launchpad-app
[INFO] [dependency:copy-dependencies {execution: copy-dependencies}]
[INFO] Copying org.apache.sling.launchpad.app-2.0.0-incubator-SNAPSHOT.jar to /home/continuum/data/working-directory/535/target/org.apache.sling.launchpad.webapp-2.0.0-incubator-SNAPSHOT/WEB-INF/resources/bundles/org.apache.sling.launchpad.app-2.0.0-incubator-SNAPSHOT.jar
[INFO] Copying org.apache.sling.scripting.javascript-2.0.0-incubator-SNAPSHOT.jar to /home/continuum/data/working-directory/535/target/org.apache.sling.launchpad.webapp-2.0.0-incubator-SNAPSHOT/WEB-INF/resources/bundles/org.apache.sling.scripting.javascript-2.0.0-incubator-SNAPSHOT.jar
[INFO] Copying org.apache.sling.ujax-2.0.0-incubator-SNAPSHOT.jar to /home/continuum/data/working-directory/535/target/org.apache.sling.launchpad.webapp-2.0.0-incubator-SNAPSHOT/WEB-INF/resources/bundles/org.apache.sling.ujax-2.0.0-incubator-SNAPSHOT.jar
[INFO] [resources:resources]
[INFO] Using default encoding to copy filtered resources.
[INFO] [compiler:compile]
[INFO] Compiling 2 source files to /home/continuum/data/working-directory/535/target/classes
[INFO] [resources:testResources]
[INFO] Using default encoding to copy filtered resources.
[INFO] [compiler:testCompile]
[INFO] Compiling 37 source files to /home/continuum/data/working-directory/535/target/test-classes
[INFO] [surefire:test]
[INFO] Surefire report directory: /home/continuum/data/working-directory/535/target/surefire-reports

-------------------------------------------------------
 T E S T S
-------------------------------------------------------
There are no tests to run.

Results :

Tests run: 0, Failures: 0, Errors: 0, Skipped: 0

[INFO] [war:war]
[INFO] Exploding webapp...
[INFO] Assembling webapp org.apache.sling.launchpad.webapp in /home/continuum/data/working-directory/535/target/org.apache.sling.launchpad.webapp-2.0.0-incubator-SNAPSHOT
[INFO] Copy webapp webResources to /home/continuum/data/working-directory/535/target/org.apache.sling.launchpad.webapp-2.0.0-incubator-SNAPSHOT
[INFO] Copy webapp webResources to /home/continuum/data/working-directory/535/target/org.apache.sling.launchpad.webapp-2.0.0-incubator-SNAPSHOT
[INFO] Copy webapp webResources to /home/continuum/data/working-directory/535/target/org.apache.sling.launchpad.webapp-2.0.0-incubator-SNAPSHOT
[INFO] Generating war /home/continuum/data/working-directory/535/target/org.apache.sling.launchpad.webapp-2.0.0-incubator-SNAPSHOT.war
[INFO] Building war: /home/continuum/data/working-directory/535/target/org.apache.sling.launchpad.webapp-2.0.0-incubator-SNAPSHOT.war
[INFO] Preparing source:jar
[WARNING] Removing: jar from forked lifecycle, to prevent recursive invocation.
[INFO] [enforcer:enforce {execution: enforce-java}]
[INFO] [source:jar {execution: attach-sources}]
[INFO] Building jar: /home/continuum/data/working-directory/535/target/org.apache.sling.launchpad.webapp-2.0.0-incubator-SNAPSHOT-sources.jar
[INFO] [cargo:start {execution: start-container}]
[INFO] [beddedLocalContainer] Jetty 6.x Embedded starting...
2008-03-07 06:42:48.728::INFO:  Logging to STDERR via org.mortbay.log.StdErrLog
2008-03-07 06:42:48.823::INFO:  jetty-6.1.1rc1
2008-03-07 06:42:50.892::INFO:  Extract jar:file:/home/continuum/data/working-directory/535/target/org.apache.sling.launchpad.webapp-2.0.0-incubator-SNAPSHOT.war!/
to /tmp/Jetty_0_0_0_0_8888_org.apache.sling.launchpad.webapp-2.0.0-incubator-SNAPSHOT.war__org_apache_sling_launchpad_webapp-2_0_0-incubator-SNAPSHOT__tvdn0n/webapp
2008-03-07 06:43:01.265:/org.apache.sling.launchpad.webapp-2.0.0-incubator-SNAPSHOT:INFO:
 sling: Servlet sling initialized
2008-03-07 06:43:01.289::INFO:  Extract jar:file:/tmp/cargo/conf/cargocpc.war!/ to /tmp/Jetty_0_0_0_0_8888_cargocpc.war__cargocpc__rw8xgv/webapp
2008-03-07 06:43:08.575::INFO:  Started SelectChannelConnector @ 0.0.0.0:8888
[INFO] [beddedLocalContainer] Jetty 6.x Embedded started on port [8888]
[INFO] [surefire:test {execution: surefire-integration-test}]
[INFO] Surefire report directory: /home/continuum/data/working-directory/535/target/surefire-reports

-------------------------------------------------------
 T E S T S
-------------------------------------------------------
Running org.apache.sling.launchpad.webapp.integrationtest.ujax.PostServletMoveTest
log4j:WARN No appenders could be found for logger (org.apache.commons.httpclient.HttpClient).
log4j:WARN Please initialize the log4j system properly.
Checking if the required Sling services are started...
(base URLs=http://localhost:8888/org.apache.sling.launchpad.webapp-2.0.0-incubator-SNAPSHOT
and http://localhost:8888/org.apache.sling.launchpad.webapp-2.0.0-incubator-SNAPSHOT/dav/default)
Server does not seem to be ready, after 60000 msec, got the following 93 Exceptions:java.io.IOException:
Expected status code 302 for POST, got 200, URL=http://localhost:8888/org.apache.sling.launchpad.webapp-2.0.0-incubator-SNAPSHOT/WaitForSlingStartup_1204901011993
java.io.IOException: Expected status code 302 for POST, got 200, URL=http://localhost:8888/org.apache.sling.launchpad.webapp-2.0.0-incubator-SNAPSHOT/WaitForSlingStartup_1204901017941
java.io.IOException: Expected status code 302 for POST, got 200, URL=http://localhost:8888/org.apache.sling.launchpad.webapp-2.0.0-incubator-SNAPSHOT/WaitForSlingStartup_1204901018471
java.io.IOException: Expected status code 302 for POST, got 200, URL=http://localhost:8888/org.apache.sling.launchpad.webapp-2.0.0-incubator-SNAPSHOT/WaitForSlingStartup_1204901019021
java.io.IOException: Expected status code 302 for POST, got 200, URL=http://localhost:8888/org.apache.sling.launchpad.webapp-2.0.0-incubator-SNAPSHOT/WaitForSlingStartup_1204901019561
java.io.IOException: Expected status code 302 for POST, got 200, URL=http://localhost:8888/org.apache.sling.launchpad.webapp-2.0.0-incubator-SNAPSHOT/WaitForSlingStartup_1204901020091
java.io.IOException: Expected status code 302 for POST, got 200, URL=http://localhost:8888/org.apache.sling.launchpad.webapp-2.0.0-incubator-SNAPSHOT/WaitForSlingStartup_1204901020631
java.io.IOException: Expected status code 302 for POST, got 200, URL=http://localhost:8888/org.apache.sling.launchpad.webapp-2.0.0-incubator-SNAPSHOT/WaitForSlingStartup_1204901021171
java.io.IOException: Expected status code 302 for POST, got 200, URL=http://localhost:8888/org.apache.sling.launchpad.webapp-2.0.0-incubator-SNAPSHOT/WaitForSlingStartup_1204901021721
java.io.IOException: Expected status code 302 for POST, got 200, URL=http://localhost:8888/org.apache.sling.launchpad.webapp-2.0.0-incubator-SNAPSHOT/WaitForSlingStartup_1204901022251
java.io.IOException: Expected status code 302 for POST, got 200, URL=http://localhost:8888/org.apache.sling.launchpad.webapp-2.0.0-incubator-SNAPSHOT/WaitForSlingStartup_1204901022791
java.io.IOException: Expected status code 302 for POST, got 200, URL=http://localhost:8888/org.apache.sling.launchpad.webapp-2.0.0-incubator-SNAPSHOT/WaitForSlingStartup_1204901023321
java.io.IOException: Expected status code 302 for POST, got 200, URL=http://localhost:8888/org.apache.sling.launchpad.webapp-2.0.0-incubator-SNAPSHOT/WaitForSlingStartup_1204901023851
java.io.IOException: Expected status code 302 for POST, got 200, URL=http://localhost:8888/org.apache.sling.launchpad.webapp-2.0.0-incubator-SNAPSHOT/WaitForSlingStartup_1204901024381
java.io.IOException: Expected status code 302 for POST, got 200, URL=http://localhost:8888/org.apache.sling.launchpad.webapp-2.0.0-incubator-SNAPSHOT/WaitForSlingStartup_1204901024911
java.io.IOException: Expected status code 302 for POST, got 200, URL=http://localhost:8888/org.apache.sling.launchpad.webapp-2.0.0-incubator-SNAPSHOT/WaitForSlingStartup_1204901025441
java.io.IOException: Expected status code 302 for POST, got 200, URL=http://localhost:8888/org.apache.sling.launchpad.webapp-2.0.0-incubator-SNAPSHOT/WaitForSlingStartup_1204901025971
java.io.IOException: Expected status code 302 for POST, got 200, URL=http://localhost:8888/org.apache.sling.launchpad.webapp-2.0.0-incubator-SNAPSHOT/WaitForSlingStartup_1204901027951
java.io.IOException: Expected status code 302 for POST, got 200, URL=http://localhost:8888/org.apache.sling.launchpad.webapp-2.0.0-incubator-SNAPSHOT/WaitForSlingStartup_1204901028481
java.io.IOException: Expected status code 302 for POST, got 200, URL=http://localhost:8888/org.apache.sling.launchpad.webapp-2.0.0-incubator-SNAPSHOT/WaitForSlingStartup_1204901031611
java.io.IOException: Expected status code 302 for POST, got 200, URL=http://localhost:8888/org.apache.sling.launchpad.webapp-2.0.0-incubator-SNAPSHOT/WaitForSlingStartup_1204901032141
java.io.IOException: Expected status code 302 for POST, got 200, URL=http://localhost:8888/org.apache.sling.launchpad.webapp-2.0.0-incubator-SNAPSHOT/WaitForSlingStartup_1204901032671
java.io.IOException: Expected status code 302 for POST, got 200, URL=http://localhost:8888/org.apache.sling.launchpad.webapp-2.0.0-incubator-SNAPSHOT/WaitForSlingStartup_1204901033201
java.io.IOException: Expected status code 302 for POST, got 200, URL=http://localhost:8888/org.apache.sling.launchpad.webapp-2.0.0-incubator-SNAPSHOT/WaitForSlingStartup_1204901033731
java.io.IOException: Expected status code 302 for POST, got 200, URL=http://localhost:8888/org.apache.sling.launchpad.webapp-2.0.0-incubator-SNAPSHOT/WaitForSlingStartup_1204901034261
java.io.IOException: Expected status code 302 for POST, got 200, URL=http://localhost:8888/org.apache.sling.launchpad.webapp-2.0.0-incubator-SNAPSHOT/WaitForSlingStartup_1204901034801
java.io.IOException: Expected status code 302 for POST, got 200, URL=http://localhost:8888/org.apache.sling.launchpad.webapp-2.0.0-incubator-SNAPSHOT/WaitForSlingStartup_1204901035331
java.io.IOException: Expected status code 302 for POST, got 200, URL=http://localhost:8888/org.apache.sling.launchpad.webapp-2.0.0-incubator-SNAPSHOT/WaitForSlingStartup_1204901035871
java.io.IOException: Expected status code 302 for POST, got 200, URL=http://localhost:8888/org.apache.sling.launchpad.webapp-2.0.0-incubator-SNAPSHOT/WaitForSlingStartup_1204901036401
java.io.IOException: Expected status code 302 for POST, got 200, URL=http://localhost:8888/org.apache.sling.launchpad.webapp-2.0.0-incubator-SNAPSHOT/WaitForSlingStartup_1204901036921
java.io.IOException: Expected status code 302 for POST, got 200, URL=http://localhost:8888/org.apache.sling.launchpad.webapp-2.0.0-incubator-SNAPSHOT/WaitForSlingStartup_1204901037451
java.io.IOException: Expected status code 302 for POST, got 200, URL=http://localhost:8888/org.apache.sling.launchpad.webapp-2.0.0-incubator-SNAPSHOT/WaitForSlingStartup_1204901037971
java.io.IOException: Expected status code 302 for POST, got 200, URL=http://localhost:8888/org.apache.sling.launchpad.webapp-2.0.0-incubator-SNAPSHOT/WaitForSlingStartup_1204901038501
java.io.IOException: Expected status code 302 for POST, got 200, URL=http://localhost:8888/org.apache.sling.launchpad.webapp-2.0.0-incubator-SNAPSHOT/WaitForSlingStartup_1204901039031
java.io.IOException: Expected status code 302 for POST, got 200, URL=http://localhost:8888/org.apache.sling.launchpad.webapp-2.0.0-incubator-SNAPSHOT/WaitForSlingStartup_1204901039561
java.io.IOException: Expected status code 302 for POST, got 200, URL=http://localhost:8888/org.apache.sling.launchpad.webapp-2.0.0-incubator-SNAPSHOT/WaitForSlingStartup_1204901040091
java.io.IOException: Expected status code 302 for POST, got 200, URL=http://localhost:8888/org.apache.sling.launchpad.webapp-2.0.0-incubator-SNAPSHOT/WaitForSlingStartup_1204901040621
java.io.IOException: Expected status code 302 for POST, got 200, URL=http://localhost:8888/org.apache.sling.launchpad.webapp-2.0.0-incubator-SNAPSHOT/WaitForSlingStartup_1204901041151
java.io.IOException: Expected status code 302 for POST, got 200, URL=http://localhost:8888/org.apache.sling.launchpad.webapp-2.0.0-incubator-SNAPSHOT/WaitForSlingStartup_1204901041681
java.io.IOException: Expected status code 302 for POST, got 200, URL=http://localhost:8888/org.apache.sling.launchpad.webapp-2.0.0-incubator-SNAPSHOT/WaitForSlingStartup_1204901042211
java.io.IOException: Expected status code 302 for POST, got 200, URL=http://localhost:8888/org.apache.sling.launchpad.webapp-2.0.0-incubator-SNAPSHOT/WaitForSlingStartup_1204901042741
java.io.IOException: Expected status code 302 for POST, got 200, URL=http://localhost:8888/org.apache.sling.launchpad.webapp-2.0.0-incubator-SNAPSHOT/WaitForSlingStartup_1204901043271
java.io.IOException: Expected status code 302 for POST, got 200, URL=http://localhost:8888/org.apache.sling.launchpad.webapp-2.0.0-incubator-SNAPSHOT/WaitForSlingStartup_1204901043801
java.io.IOException: Expected status code 302 for POST, got 200, URL=http://localhost:8888/org.apache.sling.launchpad.webapp-2.0.0-incubator-SNAPSHOT/WaitForSlingStartup_1204901044321
java.io.IOException: Expected status code 302 for POST, got 200, URL=http://localhost:8888/org.apache.sling.launchpad.webapp-2.0.0-incubator-SNAPSHOT/WaitForSlingStartup_1204901044841
java.io.IOException: Expected status code 302 for POST, got 200, URL=http://localhost:8888/org.apache.sling.launchpad.webapp-2.0.0-incubator-SNAPSHOT/WaitForSlingStartup_1204901045361
java.io.IOException: Expected status code 302 for POST, got 200, URL=http://localhost:8888/org.apache.sling.launchpad.webapp-2.0.0-incubator-SNAPSHOT/WaitForSlingStartup_1204901045891
java.io.IOException: Expected status code 302 for POST, got 200, URL=http://localhost:8888/org.apache.sling.launchpad.webapp-2.0.0-incubator-SNAPSHOT/WaitForSlingStartup_1204901046421
java.io.IOException: Expected status code 302 for POST, got 200, URL=http://localhost:8888/org.apache.sling.launchpad.webapp-2.0.0-incubator-SNAPSHOT/WaitForSlingStartup_1204901046951
java.io.IOException: Expected status code 302 for POST, got 200, URL=http://localhost:8888/org.apache.sling.launchpad.webapp-2.0.0-incubator-SNAPSHOT/WaitForSlingStartup_1204901047501
java.io.IOException: Expected status code 302 for POST, got 200, URL=http://localhost:8888/org.apache.sling.launchpad.webapp-2.0.0-incubator-SNAPSHOT/WaitForSlingStartup_1204901048041
java.io.IOException: Expected status code 302 for POST, got 200, URL=http://localhost:8888/org.apache.sling.launchpad.webapp-2.0.0-incubator-SNAPSHOT/WaitForSlingStartup_1204901048571
java.io.IOException: Expected status code 302 for POST, got 200, URL=http://localhost:8888/org.apache.sling.launchpad.webapp-2.0.0-incubator-SNAPSHOT/WaitForSlingStartup_1204901049101
java.io.IOException: Expected status code 302 for POST, got 200, URL=http://localhost:8888/org.apache.sling.launchpad.webapp-2.0.0-incubator-SNAPSHOT/WaitForSlingStartup_1204901049631
java.io.IOException: Expected status code 302 for POST, got 200, URL=http://localhost:8888/org.apache.sling.launchpad.webapp-2.0.0-incubator-SNAPSHOT/WaitForSlingStartup_1204901050161
java.io.IOException: Expected status code 302 for POST, got 200, URL=http://localhost:8888/org.apache.sling.launchpad.webapp-2.0.0-incubator-SNAPSHOT/WaitForSlingStartup_1204901050691
java.io.IOException: Expected status code 302 for POST, got 200, URL=http://localhost:8888/org.apache.sling.launchpad.webapp-2.0.0-incubator-SNAPSHOT/WaitForSlingStartup_1204901051221
java.io.IOException: Expected status code 302 for POST, got 200, URL=http://localhost:8888/org.apache.sling.launchpad.webapp-2.0.0-incubator-SNAPSHOT/WaitForSlingStartup_1204901051741
java.io.IOException: Expected status code 302 for POST, got 200, URL=http://localhost:8888/org.apache.sling.launchpad.webapp-2.0.0-incubator-SNAPSHOT/WaitForSlingStartup_1204901052271
java.io.IOException: Expected status code 302 for POST, got 200, URL=http://localhost:8888/org.apache.sling.launchpad.webapp-2.0.0-incubator-SNAPSHOT/WaitForSlingStartup_1204901052802
java.io.IOException: Expected status code 302 for POST, got 200, URL=http://localhost:8888/org.apache.sling.launchpad.webapp-2.0.0-incubator-SNAPSHOT/WaitForSlingStartup_1204901053331
java.io.IOException: Expected status code 302 for POST, got 200, URL=http://localhost:8888/org.apache.sling.launchpad.webapp-2.0.0-incubator-SNAPSHOT/WaitForSlingStartup_1204901055302
java.io.IOException: Expected status code 302 for POST, got 200, URL=http://localhost:8888/org.apache.sling.launchpad.webapp-2.0.0-incubator-SNAPSHOT/WaitForSlingStartup_1204901055832
java.io.IOException: Expected status code 302 for POST, got 200, URL=http://localhost:8888/org.apache.sling.launchpad.webapp-2.0.0-incubator-SNAPSHOT/WaitForSlingStartup_1204901056362
java.io.IOException: Expected status code 302 for POST, got 200, URL=http://localhost:8888/org.apache.sling.launchpad.webapp-2.0.0-incubator-SNAPSHOT/WaitForSlingStartup_1204901056902
java.io.IOException: Expected status code 302 for POST, got 200, URL=http://localhost:8888/org.apache.sling.launchpad.webapp-2.0.0-incubator-SNAPSHOT/WaitForSlingStartup_1204901057432
java.io.IOException: Expected status code 302 for POST, got 200, URL=http://localhost:8888/org.apache.sling.launchpad.webapp-2.0.0-incubator-SNAPSHOT/WaitForSlingStartup_1204901057962
java.io.IOException: Expected status code 302 for POST, got 200, URL=http://localhost:8888/org.apache.sling.launchpad.webapp-2.0.0-incubator-SNAPSHOT/WaitForSlingStartup_1204901058492
java.io.IOException: Expected status code 302 for POST, got 200, URL=http://localhost:8888/org.apache.sling.launchpad.webapp-2.0.0-incubator-SNAPSHOT/WaitForSlingStartup_1204901059022
java.io.IOException: Expected status code 302 for POST, got 200, URL=http://localhost:8888/org.apache.sling.launchpad.webapp-2.0.0-incubator-SNAPSHOT/WaitForSlingStartup_1204901059552
java.io.IOException: Expected status code 302 for POST, got 200, URL=http://localhost:8888/org.apache.sling.launchpad.webapp-2.0.0-incubator-SNAPSHOT/WaitForSlingStartup_1204901060082
java.io.IOException: Expected status code 302 for POST, got 200, URL=http://localhost:8888/org.apache.sling.launchpad.webapp-2.0.0-incubator-SNAPSHOT/WaitForSlingStartup_1204901060612
java.io.IOException: Expected status code 302 for POST, got 200, URL=http://localhost:8888/org.apache.sling.launchpad.webapp-2.0.0-incubator-SNAPSHOT/WaitForSlingStartup_1204901061132
java.io.IOException: Expected status code 302 for POST, got 200, URL=http://localhost:8888/org.apache.sling.launchpad.webapp-2.0.0-incubator-SNAPSHOT/WaitForSlingStartup_1204901061652
java.io.IOException: Expected status code 302 for POST, got 200, URL=http://localhost:8888/org.apache.sling.launchpad.webapp-2.0.0-incubator-SNAPSHOT/WaitForSlingStartup_1204901062172
java.io.IOException: Expected status code 302 for POST, got 200, URL=http://localhost:8888/org.apache.sling.launchpad.webapp-2.0.0-incubator-SNAPSHOT/WaitForSlingStartup_1204901062702
java.io.IOException: Expected status code 302 for POST, got 200, URL=http://localhost:8888/org.apache.sling.launchpad.webapp-2.0.0-incubator-SNAPSHOT/WaitForSlingStartup_1204901063222
java.io.IOException: Expected status code 302 for POST, got 200, URL=http://localhost:8888/org.apache.sling.launchpad.webapp-2.0.0-incubator-SNAPSHOT/WaitForSlingStartup_1204901063742
java.io.IOException: Expected status code 302 for POST, got 200, URL=http://localhost:8888/org.apache.sling.launchpad.webapp-2.0.0-incubator-SNAPSHOT/WaitForSlingStartup_1204901064272
java.io.IOException: Expected status code 302 for POST, got 200, URL=http://localhost:8888/org.apache.sling.launchpad.webapp-2.0.0-incubator-SNAPSHOT/WaitForSlingStartup_1204901064792
java.io.IOException: Expected status code 302 for POST, got 200, URL=http://localhost:8888/org.apache.sling.launchpad.webapp-2.0.0-incubator-SNAPSHOT/WaitForSlingStartup_1204901065482
java.io.IOException: Expected status code 302 for POST, got 200, URL=http://localhost:8888/org.apache.sling.launchpad.webapp-2.0.0-incubator-SNAPSHOT/WaitForSlingStartup_1204901066082
java.io.IOException: Expected status code 302 for POST, got 200, URL=http://localhost:8888/org.apache.sling.launchpad.webapp-2.0.0-incubator-SNAPSHOT/WaitForSlingStartup_1204901066612
java.io.IOException: Expected status code 302 for POST, got 200, URL=http://localhost:8888/org.apache.sling.launchpad.webapp-2.0.0-incubator-SNAPSHOT/WaitForSlingStartup_1204901067152
java.io.IOException: Expected status code 302 for POST, got 200, URL=http://localhost:8888/org.apache.sling.launchpad.webapp-2.0.0-incubator-SNAPSHOT/WaitForSlingStartup_1204901067672
java.io.IOException: Expected status code 302 for POST, got 200, URL=http://localhost:8888/org.apache.sling.launchpad.webapp-2.0.0-incubator-SNAPSHOT/WaitForSlingStartup_1204901068242
java.io.IOException: Expected status code 302 for POST, got 200, URL=http://localhost:8888/org.apache.sling.launchpad.webapp-2.0.0-incubator-SNAPSHOT/WaitForSlingStartup_1204901068762
java.io.IOException: Expected status code 302 for POST, got 200, URL=http://localhost:8888/org.apache.sling.launchpad.webapp-2.0.0-incubator-SNAPSHOT/WaitForSlingStartup_1204901069292
java.io.IOException: Expected status code 302 for POST, got 200, URL=http://localhost:8888/org.apache.sling.launchpad.webapp-2.0.0-incubator-SNAPSHOT/WaitForSlingStartup_1204901069832
java.io.IOException: Expected status code 302 for POST, got 200, URL=http://localhost:8888/org.apache.sling.launchpad.webapp-2.0.0-incubator-SNAPSHOT/WaitForSlingStartup_1204901070352
java.io.IOException: Expected status code 302 for POST, got 200, URL=http://localhost:8888/org.apache.sling.launchpad.webapp-2.0.0-incubator-SNAPSHOT/WaitForSlingStartup_1204901070872
java.io.IOException: Expected status code 302 for POST, got 200, URL=http://localhost:8888/org.apache.sling.launchpad.webapp-2.0.0-incubator-SNAPSHOT/WaitForSlingStartup_1204901071402
java.io.IOException: Expected status code 302 for POST, got 200, URL=http://localhost:8888/org.apache.sling.launchpad.webapp-2.0.0-incubator-SNAPSHOT/WaitForSlingStartup_1204901071922

Tests run: 5, Failures: 5, Errors: 0, Skipped: 0, Time elapsed: 79.373 sec <<< FAILURE!
Running org.apache.sling.launchpad.webapp.integrationtest.JavascriptWrappersTest
Tests run: 1, Failures: 1, Errors: 0, Skipped: 0, Time elapsed: 0.005 sec <<< FAILURE!
Running org.apache.sling.launchpad.webapp.integrationtest.StaticContentTest
Tests run: 2, Failures: 2, Errors: 0, Skipped: 0, Time elapsed: 0.007 sec <<< FAILURE!
Running org.apache.sling.launchpad.webapp.integrationtest.GeneratedNodeNameTest
Tests run: 4, Failures: 4, Errors: 0, Skipped: 0, Time elapsed: 0.009 sec <<< FAILURE!
Running org.apache.sling.launchpad.webapp.integrationtest.JsonRenderingTest
Tests run: 8, Failures: 8, Errors: 0, Skipped: 0, Time elapsed: 0.015 sec <<< FAILURE!
Running org.apache.sling.launchpad.webapp.integrationtest.UploadFileTest
Tests run: 3, Failures: 3, Errors: 0, Skipped: 0, Time elapsed: 0.037 sec <<< FAILURE!
Running org.apache.sling.launchpad.webapp.integrationtest.MkdirTest
Tests run: 2, Failures: 2, Errors: 0, Skipped: 0, Time elapsed: 0.024 sec <<< FAILURE!
Running org.apache.sling.launchpad.webapp.integrationtest.ujax.PostServletCreateTest
Tests run: 8, Failures: 8, Errors: 0, Skipped: 0, Time elapsed: 0.045 sec <<< FAILURE!
Running org.apache.sling.launchpad.webapp.integrationtest.ujax.UjaxDateValuesTest
Tests run: 1, Failures: 1, Errors: 0, Skipped: 0, Time elapsed: 0.005 sec <<< FAILURE!
Running org.apache.sling.launchpad.webapp.integrationtest.ujax.UjaxAutoPropertiesTest
Tests run: 3, Failures: 3, Errors: 0, Skipped: 0, Time elapsed: 0.008 sec <<< FAILURE!
Running org.apache.sling.launchpad.webapp.integrationtest.apt.SimpleAptRenderingTest
Tests run: 1, Failures: 1, Errors: 0, Skipped: 0, Time elapsed: 0.008 sec <<< FAILURE!
Running org.apache.sling.launchpad.webapp.integrationtest.ujax.PostServletUpdateTest
Tests run: 4, Failures: 4, Errors: 0, Skipped: 0, Time elapsed: 0.011 sec <<< FAILURE!
Running org.apache.sling.launchpad.webapp.integrationtest.ValueFromTest
Tests run: 3, Failures: 3, Errors: 0, Skipped: 0, Time elapsed: 0.015 sec <<< FAILURE!
Running org.apache.sling.launchpad.webapp.integrationtest.IncludeTest
Tests run: 5, Failures: 5, Errors: 0, Skipped: 0, Time elapsed: 0.008 sec <<< FAILURE!
Running org.apache.sling.launchpad.webapp.integrationtest.GetWithSuffixTest
Tests run: 4, Failures: 4, Errors: 0, Skipped: 0, Time elapsed: 0.008 sec <<< FAILURE!
Running org.apache.sling.launchpad.webapp.integrationtest.JspScriptingTest
Tests run: 4, Failures: 4, Errors: 0, Skipped: 0, Time elapsed: 0.012 sec <<< FAILURE!
Running org.apache.sling.launchpad.webapp.integrationtest.NodetypeRenderingTest
Tests run: 6, Failures: 6, Errors: 0, Skipped: 0, Time elapsed: 0.014 sec <<< FAILURE!
Running org.apache.sling.launchpad.webapp.integrationtest.InitialContentTest
Tests run: 1, Failures: 1, Errors: 0, Skipped: 0, Time elapsed: 0.002 sec <<< FAILURE!
Running org.apache.sling.launchpad.webapp.integrationtest.SlingResourceTypeRenderingTest
Tests run: 9, Failures: 9, Errors: 0, Skipped: 0, Time elapsed: 0.018 sec <<< FAILURE!
Running org.apache.sling.launchpad.webapp.integrationtest.PropertyRenderingTest
Tests run: 6, Failures: 6, Errors: 0, Skipped: 0, Time elapsed: 0.013 sec <<< FAILURE!
Running org.apache.sling.launchpad.webapp.integrationtest.JsonQueryServletTest
Tests run: 7, Failures: 7, Errors: 0, Skipped: 0, Time elapsed: 0.017 sec <<< FAILURE!
Running org.apache.sling.launchpad.webapp.integrationtest.CreateNodeTest
Tests run: 6, Failures: 6, Errors: 0, Skipped: 0, Time elapsed: 0.013 sec <<< FAILURE!
Running org.apache.sling.launchpad.webapp.integrationtest.ujax.PostServletOrderTest
Tests run: 9, Failures: 9, Errors: 0, Skipped: 0, Time elapsed: 0.018 sec <<< FAILURE!
Running org.apache.sling.launchpad.webapp.integrationtest.RedirectTest
Tests run: 4, Failures: 4, Errors: 0, Skipped: 0, Time elapsed: 0.013 sec <<< FAILURE!
Running org.apache.sling.launchpad.webapp.integrationtest.FileUploadTest
Tests run: 1, Failures: 1, Errors: 0, Skipped: 0, Time elapsed: 0.004 sec <<< FAILURE!
Running org.apache.sling.launchpad.webapp.integrationtest.ujax.PostServletDeleteTest
Tests run: 1, Failures: 1, Errors: 0, Skipped: 0, Time elapsed: 0.006 sec <<< FAILURE!
Running org.apache.sling.launchpad.webapp.integrationtest.ujax.UjaxSessionInfoTest
Tests run: 2, Failures: 2, Errors: 0, Skipped: 0, Time elapsed: 0.009 sec <<< FAILURE!
Running org.apache.sling.launchpad.webapp.integrationtest.ujax.UjaxDefaultValuesTest
Tests run: 4, Failures: 4, Errors: 0, Skipped: 0, Time elapsed: 0.007 sec <<< FAILURE!
Running org.apache.sling.launchpad.webapp.integrationtest.ScriptBuiltinObjectsTest
Tests run: 1, Failures: 1, Errors: 0, Skipped: 0, Time elapsed: 0.004 sec <<< FAILURE!
Running org.apache.sling.launchpad.webapp.integrationtest.SyntheticResourceTest
Tests run: 1, Failures: 1, Errors: 0, Skipped: 0, Time elapsed: 0.003 sec <<< FAILURE!
Running org.apache.sling.launchpad.webapp.integrationtest.StreamServletTest
Tests run: 4, Failures: 4, Errors: 0, Skipped: 0, Time elapsed: 0.022 sec <<< FAILURE!
Running org.apache.sling.launchpad.webapp.integrationtest.PostRedirectTest
Tests run: 6, Failures: 6, Errors: 0, Skipped: 0, Time elapsed: 0.017 sec <<< FAILURE!
Running org.apache.sling.launchpad.webapp.integrationtest.HttpPingTest
Tests run: 2, Failures: 2, Errors: 0, Skipped: 0, Time elapsed: 0.006 sec <<< FAILURE!

Results :

Failed tests: 
  testMoveNodeAbsolute(org.apache.sling.launchpad.webapp.integrationtest.ujax.PostServletMoveTest)
  testMoveNodeRelative(org.apache.sling.launchpad.webapp.integrationtest.ujax.PostServletMoveTest)
  testMoveNodeNew(org.apache.sling.launchpad.webapp.integrationtest.ujax.PostServletMoveTest)
  testMoveNodeExistingFail(org.apache.sling.launchpad.webapp.integrationtest.ujax.PostServletMoveTest)
  testMoveNodeExistingReplace(org.apache.sling.launchpad.webapp.integrationtest.ujax.PostServletMoveTest)
  testRecursiveDump(org.apache.sling.launchpad.webapp.integrationtest.JavascriptWrappersTest)
  testWebInfForbidden(org.apache.sling.launchpad.webapp.integrationtest.StaticContentTest)
  testMetaInfForbidden(org.apache.sling.launchpad.webapp.integrationtest.StaticContentTest)
  testTitle(org.apache.sling.launchpad.webapp.integrationtest.GeneratedNodeNameTest)
  testTitleWithSavePrefix(org.apache.sling.launchpad.webapp.integrationtest.GeneratedNodeNameTest)
  testCollision(org.apache.sling.launchpad.webapp.integrationtest.GeneratedNodeNameTest)
  testNoParams(org.apache.sling.launchpad.webapp.integrationtest.GeneratedNodeNameTest)
  testAssertJavascript(org.apache.sling.launchpad.webapp.integrationtest.JsonRenderingTest)
  testNonRecursive(org.apache.sling.launchpad.webapp.integrationtest.JsonRenderingTest)
  testRecursiveOneLevel(org.apache.sling.launchpad.webapp.integrationtest.JsonRenderingTest)
  testRecursiveZeroLevels(org.apache.sling.launchpad.webapp.integrationtest.JsonRenderingTest)
  testRecursiveInfinity(org.apache.sling.launchpad.webapp.integrationtest.JsonRenderingTest)
  testInvalidLevel(org.apache.sling.launchpad.webapp.integrationtest.JsonRenderingTest)
  testEscapedStrings(org.apache.sling.launchpad.webapp.integrationtest.JsonRenderingTest)
  testAccentedStrings(org.apache.sling.launchpad.webapp.integrationtest.JsonRenderingTest)
  testDistinctResource(org.apache.sling.launchpad.webapp.integrationtest.UploadFileTest)
  testDistinctResourceWithType(org.apache.sling.launchpad.webapp.integrationtest.UploadFileTest)
  testDistinctFile(org.apache.sling.launchpad.webapp.integrationtest.UploadFileTest)
  testMkdir(org.apache.sling.launchpad.webapp.integrationtest.MkdirTest)
  testMkdirDeep(org.apache.sling.launchpad.webapp.integrationtest.MkdirTest)
  testCreateNode(org.apache.sling.launchpad.webapp.integrationtest.ujax.PostServletCreateTest)
  testPostPathIsUnique(org.apache.sling.launchpad.webapp.integrationtest.ujax.PostServletCreateTest)
  testCreateNodeAtSpecificUrl(org.apache.sling.launchpad.webapp.integrationtest.ujax.PostServletCreateTest)
  testCreateNodeAtDeepUrl(org.apache.sling.launchpad.webapp.integrationtest.ujax.PostServletCreateTest)
  testCreateWithData(org.apache.sling.launchpad.webapp.integrationtest.ujax.PostServletCreateTest)
  testCreateSubnodeProperty(org.apache.sling.launchpad.webapp.integrationtest.ujax.PostServletCreateTest)
  testDefaultSavePrefix(org.apache.sling.launchpad.webapp.integrationtest.ujax.PostServletCreateTest)
  testCustomSavePrefix(org.apache.sling.launchpad.webapp.integrationtest.ujax.PostServletCreateTest)
  testDateValues(org.apache.sling.launchpad.webapp.integrationtest.ujax.UjaxDateValuesTest)
  testPostPathIsUnique(org.apache.sling.launchpad.webapp.integrationtest.ujax.UjaxAutoPropertiesTest)
  testCreatedAndModified(org.apache.sling.launchpad.webapp.integrationtest.ujax.UjaxAutoPropertiesTest)
  testWithSpecificValues(org.apache.sling.launchpad.webapp.integrationtest.ujax.UjaxAutoPropertiesTest)
  testAptDocument(org.apache.sling.launchpad.webapp.integrationtest.apt.SimpleAptRenderingTest)
  testPostPathIsUnique(org.apache.sling.launchpad.webapp.integrationtest.ujax.PostServletUpdateTest)
  testUpdateWithChanges(org.apache.sling.launchpad.webapp.integrationtest.ujax.PostServletUpdateTest)
  testUpdateNoChanges(org.apache.sling.launchpad.webapp.integrationtest.ujax.PostServletUpdateTest)
  testUpdateSomeChanges(org.apache.sling.launchpad.webapp.integrationtest.ujax.PostServletUpdateTest)
  testWithoutValueFrom(org.apache.sling.launchpad.webapp.integrationtest.ValueFromTest)
  testWithValueFrom(org.apache.sling.launchpad.webapp.integrationtest.ValueFromTest)
  testWithValueFromAndMissingField(org.apache.sling.launchpad.webapp.integrationtest.ValueFromTest)
  testWithoutInclude(org.apache.sling.launchpad.webapp.integrationtest.IncludeTest)
  testWithInclude(org.apache.sling.launchpad.webapp.integrationtest.IncludeTest)
  testWithIncludeAndExtension(org.apache.sling.launchpad.webapp.integrationtest.IncludeTest)
  testInfiniteLoopDetection(org.apache.sling.launchpad.webapp.integrationtest.IncludeTest)
  testForcedResourceType(org.apache.sling.launchpad.webapp.integrationtest.IncludeTest)
  testWithExactUrl(org.apache.sling.launchpad.webapp.integrationtest.GetWithSuffixTest)
  testGETScript(org.apache.sling.launchpad.webapp.integrationtest.GetWithSuffixTest)
  testWithExtraPathA(org.apache.sling.launchpad.webapp.integrationtest.GetWithSuffixTest)
  testWithExtraPathB(org.apache.sling.launchpad.webapp.integrationtest.GetWithSuffixTest)
  testRtNoScript(org.apache.sling.launchpad.webapp.integrationtest.JspScriptingTest)
  testUnstructuredNoScript(org.apache.sling.launchpad.webapp.integrationtest.JspScriptingTest)
  testRtJsp(org.apache.sling.launchpad.webapp.integrationtest.JspScriptingTest)
  testUnstructuredJsp(org.apache.sling.launchpad.webapp.integrationtest.JspScriptingTest)
  testWithoutScriptTxt(org.apache.sling.launchpad.webapp.integrationtest.NodetypeRenderingTest)
  testWithoutScriptHtml(org.apache.sling.launchpad.webapp.integrationtest.NodetypeRenderingTest)
  testMiniScriptHtml(org.apache.sling.launchpad.webapp.integrationtest.NodetypeRenderingTest)
  testEspHtml(org.apache.sling.launchpad.webapp.integrationtest.NodetypeRenderingTest)
  testEspXml(org.apache.sling.launchpad.webapp.integrationtest.NodetypeRenderingTest)
  testEspPlain(org.apache.sling.launchpad.webapp.integrationtest.NodetypeRenderingTest)
  testIndex(org.apache.sling.launchpad.webapp.integrationtest.InitialContentTest)
  testWithoutScriptTxt(org.apache.sling.launchpad.webapp.integrationtest.SlingResourceTypeRenderingTest)
  testWithoutScriptHtml(org.apache.sling.launchpad.webapp.integrationtest.SlingResourceTypeRenderingTest)
  testEspHtml(org.apache.sling.launchpad.webapp.integrationtest.SlingResourceTypeRenderingTest)
  testEspXml(org.apache.sling.launchpad.webapp.integrationtest.SlingResourceTypeRenderingTest)
  testEspPlain(org.apache.sling.launchpad.webapp.integrationtest.SlingResourceTypeRenderingTest)
  testEspJavaCode(org.apache.sling.launchpad.webapp.integrationtest.SlingResourceTypeRenderingTest)
  testEspHtmlInAppsFolder(org.apache.sling.launchpad.webapp.integrationtest.SlingResourceTypeRenderingTest)
  testEspHtmlWithSelectors(org.apache.sling.launchpad.webapp.integrationtest.SlingResourceTypeRenderingTest)
  testEspJs(org.apache.sling.launchpad.webapp.integrationtest.SlingResourceTypeRenderingTest)
  testNodeAccess(org.apache.sling.launchpad.webapp.integrationtest.PropertyRenderingTest)
  testTextJson(org.apache.sling.launchpad.webapp.integrationtest.PropertyRenderingTest)
  testTextHtml(org.apache.sling.launchpad.webapp.integrationtest.PropertyRenderingTest)
  testTextTxt(org.apache.sling.launchpad.webapp.integrationtest.PropertyRenderingTest)
  testTextNoExt(org.apache.sling.launchpad.webapp.integrationtest.PropertyRenderingTest)
  testResourceTypeNoExt(org.apache.sling.launchpad.webapp.integrationtest.PropertyRenderingTest)
  testFolderQuery(org.apache.sling.launchpad.webapp.integrationtest.JsonQueryServletTest)
  testSubFolderQuery(org.apache.sling.launchpad.webapp.integrationtest.JsonQueryServletTest)
  testDefaultQueryType(org.apache.sling.launchpad.webapp.integrationtest.JsonQueryServletTest)
  testSql(org.apache.sling.launchpad.webapp.integrationtest.JsonQueryServletTest)
  testOffset(org.apache.sling.launchpad.webapp.integrationtest.JsonQueryServletTest)
  testRows(org.apache.sling.launchpad.webapp.integrationtest.JsonQueryServletTest)
  testPropertyParam(org.apache.sling.launchpad.webapp.integrationtest.JsonQueryServletTest)
  testCreateNode(org.apache.sling.launchpad.webapp.integrationtest.CreateNodeTest)
  testCreateNodeMultipart(org.apache.sling.launchpad.webapp.integrationtest.CreateNodeTest)
  testCreateNodeWithNodeType(org.apache.sling.launchpad.webapp.integrationtest.CreateNodeTest)
  testCreateNewNodeWithNodeType(org.apache.sling.launchpad.webapp.integrationtest.CreateNodeTest)
  testDeepCreateNodeWithNodeType(org.apache.sling.launchpad.webapp.integrationtest.CreateNodeTest)
  testCreateEmptyNode(org.apache.sling.launchpad.webapp.integrationtest.CreateNodeTest)
  testStandardOrder(org.apache.sling.launchpad.webapp.integrationtest.ujax.PostServletOrderTest)
  testOrderFirst(org.apache.sling.launchpad.webapp.integrationtest.ujax.PostServletOrderTest)
  testOrderLast(org.apache.sling.launchpad.webapp.integrationtest.ujax.PostServletOrderTest)
  testOrderBefore(org.apache.sling.launchpad.webapp.integrationtest.ujax.PostServletOrderTest)
  testOrderAfter(org.apache.sling.launchpad.webapp.integrationtest.ujax.PostServletOrderTest)
  testOrderIntToBack(org.apache.sling.launchpad.webapp.integrationtest.ujax.PostServletOrderTest)
  testOrderIntToFront(org.apache.sling.launchpad.webapp.integrationtest.ujax.PostServletOrderTest)
  testOrderIntZero(org.apache.sling.launchpad.webapp.integrationtest.ujax.PostServletOrderTest)
  testOrderIntOOB(org.apache.sling.launchpad.webapp.integrationtest.ujax.PostServletOrderTest)
  testRedirect302(org.apache.sling.launchpad.webapp.integrationtest.RedirectTest)
  testRedirect404(org.apache.sling.launchpad.webapp.integrationtest.RedirectTest)
  testRedirectJson(org.apache.sling.launchpad.webapp.integrationtest.RedirectTest)
  testRedirectJson2(org.apache.sling.launchpad.webapp.integrationtest.RedirectTest)
  testUploadAndDelete(org.apache.sling.launchpad.webapp.integrationtest.FileUploadTest)
  testDelete(org.apache.sling.launchpad.webapp.integrationtest.ujax.PostServletDeleteTest)
  testSessionInfo(org.apache.sling.launchpad.webapp.integrationtest.ujax.UjaxSessionInfoTest)
  testNonexistentUjaxUrl(org.apache.sling.launchpad.webapp.integrationtest.ujax.UjaxSessionInfoTest)
  testDefaultBehaviour(org.apache.sling.launchpad.webapp.integrationtest.ujax.UjaxDefaultValuesTest)
  testWithSpecificDefault(org.apache.sling.launchpad.webapp.integrationtest.ujax.UjaxDefaultValuesTest)
  testWithIgnore(org.apache.sling.launchpad.webapp.integrationtest.ujax.UjaxDefaultValuesTest)
  testWithNull(org.apache.sling.launchpad.webapp.integrationtest.ujax.UjaxDefaultValuesTest)
  testEspBuiltinObjects(org.apache.sling.launchpad.webapp.integrationtest.ScriptBuiltinObjectsTest)
  testNoSyntheticResourceTest(org.apache.sling.launchpad.webapp.integrationtest.SyntheticResourceTest)
  testPlainTextFile(org.apache.sling.launchpad.webapp.integrationtest.StreamServletTest)
  testHtmlFile(org.apache.sling.launchpad.webapp.integrationtest.StreamServletTest)
  testJavascriptFile(org.apache.sling.launchpad.webapp.integrationtest.StreamServletTest)
  testJsonFile(org.apache.sling.launchpad.webapp.integrationtest.StreamServletTest)
  testForcedRedirect(org.apache.sling.launchpad.webapp.integrationtest.PostRedirectTest)
  testDefaultRedirect(org.apache.sling.launchpad.webapp.integrationtest.PostRedirectTest)
  testMagicStarRedirect(org.apache.sling.launchpad.webapp.integrationtest.PostRedirectTest)
  testMagicStarRedirectPrefix(org.apache.sling.launchpad.webapp.integrationtest.PostRedirectTest)
  testMagicStarRedirectSuffix(org.apache.sling.launchpad.webapp.integrationtest.PostRedirectTest)
  testMagicStarRedirectPrefixSuffix(org.apache.sling.launchpad.webapp.integrationtest.PostRedirectTest)
  testWebServerRoot(org.apache.sling.launchpad.webapp.integrationtest.HttpPingTest)
  test404(org.apache.sling.launchpad.webapp.integrationtest.HttpPingTest)

Tests run: 128, Failures: 128, Errors: 0, Skipped: 0

[INFO] ------------------------------------------------------------------------
[ERROR] BUILD FAILURE
[INFO] ------------------------------------------------------------------------
[INFO] There are test failures.
[INFO] ------------------------------------------------------------------------
[INFO] For more information, run Maven with the -e switch
[INFO] ------------------------------------------------------------------------
[INFO] Total time: 2 minutes 41 seconds
[INFO] Finished at: Fri Mar 07 06:44:33 PST 2008
2008-03-07 06:44:33.313::INFO:  Shutdown hook executing
[INFO] Final Memory: 17M/32M
[INFO] ------------------------------------------------------------------------
2008-03-07 06:44:44.090::INFO:  Shutdown hook complete

****************************************************************************



Mime
View raw message