incubator-sling-commits mailing list archives

Site index · List index
Message view « Date » · « Thread »
Top « Date » · « Thread »
From Continuum VMBuild Server <contin...@apache.org>
Subject [continuum] BUILD FAILURE: Sling Launchpad Web Application
Date Fri, 08 Feb 2008 19:19:46 GMT
Online report : http://vmbuild.apache.org/continuum/buildResult.action?buildId=48142&projectId=349

Build statistics:
  State: Failed
  Previous State: Failed
  Started at: Fri 8 Feb 2008 11:16:23 -0800
  Finished at: Fri 8 Feb 2008 11:19:37 -0800
  Total time: 3m 13s
  Build Trigger: Schedule
  Build Number: 0
  Exit code: 1
  Building machine hostname: vmbuild.apache.org
  Operating system : Linux(unknown)
  Java Home version : 
          java version "1.6.0"
          Java(TM) SE Runtime Environment (build 1.6.0-b105)
          Java HotSpot(TM) Client VM (build 1.6.0-b105, mixed mode, sharing)
        
  Builder version :
          Maven version: 2.0.7
          Java version: 1.6.0
          OS name: "linux" version: "2.6.20-16-server" arch: "i386"
    
****************************************************************************
SCM Changes:
****************************************************************************
Changed: bdelacretaz @ Fri 8 Feb 2008 09:38:51 -0800
Comment: SLING-240 - Improve iteration of child Resources in ScriptableResource, work in progress
Files changed:
  /incubator/sling/trunk/launchpad/launchpad-webapp/src/test/java/org/apache/sling/launchpad/webapp/integrationtest/HttpTestBase.java
( 619952 )
  /incubator/sling/trunk/launchpad/launchpad-webapp/src/test/java/org/apache/sling/launchpad/webapp/integrationtest/JavascriptWrappersTest.java
( 619952 )
  /incubator/sling/trunk/launchpad/launchpad-webapp/src/test/resources/integration-test/dump-resource.js
( 619952 )
  /incubator/sling/trunk/scripting/javascript/src/main/java/org/apache/sling/scripting/javascript/wrapper/ScriptableResource.java
( 619952 )

****************************************************************************
Dependencies Changes:
****************************************************************************
org.apache.sling:org.apache.sling.scripting.javascript:2.0.0-incubator-SNAPSHOT


****************************************************************************
Build Defintion:
****************************************************************************
POM filename: pom.xml
Goals: clean install   
Arguments: --batch-mode --non-recursive
Build Fresh: false
Always Build: false
Default Build Definition: true
Schedule: DEFAULT_SCHEDULE
Description: 


****************************************************************************
Test Summary:
****************************************************************************
Tests: 0
Failures: 0
Total time: 0

****************************************************************************
Output:
****************************************************************************
[INFO] Scanning for projects...
WAGON_VERSION: 1.0-beta-1
[INFO] ----------------------------------------------------------------------------
[INFO] Building Sling Launchpad Web Application
[INFO]    task-segment: [clean, install]
[INFO] ----------------------------------------------------------------------------
[INFO] [clean:clean]
[INFO] Deleting directory /home/continuum/data/working-directory/349/target
[INFO] Deleting directory /home/continuum/data/working-directory/349/target/classes
[INFO] Deleting directory /home/continuum/data/working-directory/349/target/test-classes
[INFO] Deleting directory /home/continuum/data/working-directory/349/target/site
[INFO] [enforcer:enforce {execution: enforce-java}]
[INFO] [dependency:unpack-dependencies {execution: unpack-dependencies}]
[INFO] Expanding: /home/continuum/.m2/repository/org/apache/sling/org.apache.sling.launcher.webapp/2.0.0-incubator-SNAPSHOT/org.apache.sling.launcher.webapp-2.0.0-incubator-SNAPSHOT.war
into /home/continuum/data/working-directory/349/target/launcher-webapp
[INFO] Expanding: /home/continuum/.m2/repository/org/eclipse/equinox/http/servlet/1.0.0-v20070606/servlet-1.0.0-v20070606.jar
into /home/continuum/data/working-directory/349/target/launcher-webapp
[INFO] [dependency:copy-dependencies {execution: copy-dependencies}]
[INFO] Copying org.apache.felix.framework-1.0.3.jar to /home/continuum/data/working-directory/349/target/org.apache.sling.launchpad.webapp-2.0.0-incubator-SNAPSHOT/WEB-INF/resources/bundles/org.apache.felix.framework-1.0.3.jar
[INFO] Copying org.osgi.compendium-1.0.0.jar to /home/continuum/data/working-directory/349/target/org.apache.sling.launchpad.webapp-2.0.0-incubator-SNAPSHOT/WEB-INF/resources/bundles/org.osgi.compendium-1.0.0.jar
[INFO] Copying org.osgi.core-1.0.0.jar to /home/continuum/data/working-directory/349/target/org.apache.sling.launchpad.webapp-2.0.0-incubator-SNAPSHOT/WEB-INF/resources/bundles/org.osgi.core-1.0.0.jar
[INFO] Copying org.apache.felix.commons.cglib-full-2.0.2-0001-SNAPSHOT.jar to /home/continuum/data/working-directory/349/target/org.apache.sling.launchpad.webapp-2.0.0-incubator-SNAPSHOT/WEB-INF/resources/bundles/org.apache.felix.commons.cglib-full-2.0.2-0001-SNAPSHOT.jar
[INFO] Copying org.apache.felix.commons.commons-beanutils-1.7.0-0001-SNAPSHOT.jar to /home/continuum/data/working-directory/349/target/org.apache.sling.launchpad.webapp-2.0.0-incubator-SNAPSHOT/WEB-INF/resources/bundles/org.apache.felix.commons.commons-beanutils-1.7.0-0001-SNAPSHOT.jar
[INFO] Copying org.apache.felix.commons.commons-codec-1.3.0-0001-SNAPSHOT.jar to /home/continuum/data/working-directory/349/target/org.apache.sling.launchpad.webapp-2.0.0-incubator-SNAPSHOT/WEB-INF/resources/bundles/org.apache.felix.commons.commons-codec-1.3.0-0001-SNAPSHOT.jar
[INFO] Copying org.apache.felix.commons.commons-collections-3.2.0-0001-SNAPSHOT.jar to /home/continuum/data/working-directory/349/target/org.apache.sling.launchpad.webapp-2.0.0-incubator-SNAPSHOT/WEB-INF/resources/bundles/org.apache.felix.commons.commons-collections-3.2.0-0001-SNAPSHOT.jar
[INFO] Copying org.apache.felix.commons.commons-el-1.0.0-0001-SNAPSHOT.jar to /home/continuum/data/working-directory/349/target/org.apache.sling.launchpad.webapp-2.0.0-incubator-SNAPSHOT/WEB-INF/resources/bundles/org.apache.felix.commons.commons-el-1.0.0-0001-SNAPSHOT.jar
[INFO] Copying org.apache.felix.commons.commons-fileupload-1.1.1-0001-SNAPSHOT.jar to /home/continuum/data/working-directory/349/target/org.apache.sling.launchpad.webapp-2.0.0-incubator-SNAPSHOT/WEB-INF/resources/bundles/org.apache.felix.commons.commons-fileupload-1.1.1-0001-SNAPSHOT.jar
[INFO] Copying org.apache.felix.commons.commons-httpclient-3.0.1-0001-SNAPSHOT.jar to /home/continuum/data/working-directory/349/target/org.apache.sling.launchpad.webapp-2.0.0-incubator-SNAPSHOT/WEB-INF/resources/bundles/org.apache.felix.commons.commons-httpclient-3.0.1-0001-SNAPSHOT.jar
[INFO] Copying org.apache.felix.commons.commons-io-1.3.2-0002-SNAPSHOT.jar to /home/continuum/data/working-directory/349/target/org.apache.sling.launchpad.webapp-2.0.0-incubator-SNAPSHOT/WEB-INF/resources/bundles/org.apache.felix.commons.commons-io-1.3.2-0002-SNAPSHOT.jar
[INFO] Copying org.apache.felix.commons.jsp-api-2.0.0-0001-SNAPSHOT.jar to /home/continuum/data/working-directory/349/target/org.apache.sling.launchpad.webapp-2.0.0-incubator-SNAPSHOT/WEB-INF/resources/bundles/org.apache.felix.commons.jsp-api-2.0.0-0001-SNAPSHOT.jar
[INFO] Copying org.apache.felix.commons.xml-apis-1.3.4-0002-SNAPSHOT.jar to /home/continuum/data/working-directory/349/target/org.apache.sling.launchpad.webapp-2.0.0-incubator-SNAPSHOT/WEB-INF/resources/bundles/org.apache.felix.commons.xml-apis-1.3.4-0002-SNAPSHOT.jar
[INFO] Copying jackrabbit-jcr-commons-1.5-SNAPSHOT.jar to /home/continuum/data/working-directory/349/target/org.apache.sling.launchpad.webapp-2.0.0-incubator-SNAPSHOT/WEB-INF/resources/bundles/jackrabbit-jcr-commons-1.5-SNAPSHOT.jar
[INFO] Copying org.apache.sling.adapter-2.0.0-incubator-SNAPSHOT.jar to /home/continuum/data/working-directory/349/target/org.apache.sling.launchpad.webapp-2.0.0-incubator-SNAPSHOT/WEB-INF/resources/bundles/org.apache.sling.adapter-2.0.0-incubator-SNAPSHOT.jar
[INFO] Copying org.apache.sling.api-2.0.0-incubator-SNAPSHOT.jar to /home/continuum/data/working-directory/349/target/org.apache.sling.launchpad.webapp-2.0.0-incubator-SNAPSHOT/WEB-INF/resources/bundles/org.apache.sling.api-2.0.0-incubator-SNAPSHOT.jar
[INFO] Copying org.apache.sling.commons.json-2.0.0-incubator-SNAPSHOT.jar to /home/continuum/data/working-directory/349/target/org.apache.sling.launchpad.webapp-2.0.0-incubator-SNAPSHOT/WEB-INF/resources/bundles/org.apache.sling.commons.json-2.0.0-incubator-SNAPSHOT.jar
[INFO] Copying org.apache.sling.commons.mime-2.0.0-incubator-SNAPSHOT.jar to /home/continuum/data/working-directory/349/target/org.apache.sling.launchpad.webapp-2.0.0-incubator-SNAPSHOT/WEB-INF/resources/bundles/org.apache.sling.commons.mime-2.0.0-incubator-SNAPSHOT.jar
[INFO] Copying org.apache.sling.core-2.0.0-incubator-SNAPSHOT.jar to /home/continuum/data/working-directory/349/target/org.apache.sling.launchpad.webapp-2.0.0-incubator-SNAPSHOT/WEB-INF/resources/bundles/org.apache.sling.core-2.0.0-incubator-SNAPSHOT.jar
[INFO] Copying org.apache.sling.jcr.api-2.0.0-incubator-SNAPSHOT.jar to /home/continuum/data/working-directory/349/target/org.apache.sling.launchpad.webapp-2.0.0-incubator-SNAPSHOT/WEB-INF/resources/bundles/org.apache.sling.jcr.api-2.0.0-incubator-SNAPSHOT.jar
[INFO] Copying org.apache.sling.jcr.classloader-2.0.0-incubator-SNAPSHOT.jar to /home/continuum/data/working-directory/349/target/org.apache.sling.launchpad.webapp-2.0.0-incubator-SNAPSHOT/WEB-INF/resources/bundles/org.apache.sling.jcr.classloader-2.0.0-incubator-SNAPSHOT.jar
[INFO] Copying org.apache.sling.jcr.jackrabbit.server-2.0.0-incubator-SNAPSHOT.jar to /home/continuum/data/working-directory/349/target/org.apache.sling.launchpad.webapp-2.0.0-incubator-SNAPSHOT/WEB-INF/resources/bundles/org.apache.sling.jcr.jackrabbit.server-2.0.0-incubator-SNAPSHOT.jar
[INFO] Copying org.apache.sling.jcr.ocm-2.0.0-incubator-SNAPSHOT.jar to /home/continuum/data/working-directory/349/target/org.apache.sling.launchpad.webapp-2.0.0-incubator-SNAPSHOT/WEB-INF/resources/bundles/org.apache.sling.jcr.ocm-2.0.0-incubator-SNAPSHOT.jar
[INFO] Copying org.apache.sling.jcr.resource-2.0.0-incubator-SNAPSHOT.jar to /home/continuum/data/working-directory/349/target/org.apache.sling.launchpad.webapp-2.0.0-incubator-SNAPSHOT/WEB-INF/resources/bundles/org.apache.sling.jcr.resource-2.0.0-incubator-SNAPSHOT.jar
[INFO] Copying org.apache.sling.jcr.webdav-2.0.0-incubator-SNAPSHOT.jar to /home/continuum/data/working-directory/349/target/org.apache.sling.launchpad.webapp-2.0.0-incubator-SNAPSHOT/WEB-INF/resources/bundles/org.apache.sling.jcr.webdav-2.0.0-incubator-SNAPSHOT.jar
[INFO] Copying org.apache.sling.launcher.webapp-2.0.0-incubator-SNAPSHOT.war to /home/continuum/data/working-directory/349/target/org.apache.sling.launchpad.webapp-2.0.0-incubator-SNAPSHOT/WEB-INF/resources/bundles/org.apache.sling.launcher.webapp-2.0.0-incubator-SNAPSHOT.war
[INFO] Copying org.apache.sling.launchpad.servlets-2.0.0-incubator-SNAPSHOT.jar to /home/continuum/data/working-directory/349/target/org.apache.sling.launchpad.webapp-2.0.0-incubator-SNAPSHOT/WEB-INF/resources/bundles/org.apache.sling.launchpad.servlets-2.0.0-incubator-SNAPSHOT.jar
[INFO] Copying org.apache.sling.osgi.commons-2.0.0-incubator-SNAPSHOT.jar to /home/continuum/data/working-directory/349/target/org.apache.sling.launchpad.webapp-2.0.0-incubator-SNAPSHOT/WEB-INF/resources/bundles/org.apache.sling.osgi.commons-2.0.0-incubator-SNAPSHOT.jar
[INFO] Copying org.apache.sling.scripting.api-2.0.0-incubator-SNAPSHOT.jar to /home/continuum/data/working-directory/349/target/org.apache.sling.launchpad.webapp-2.0.0-incubator-SNAPSHOT/WEB-INF/resources/bundles/org.apache.sling.scripting.api-2.0.0-incubator-SNAPSHOT.jar
[INFO] Copying org.apache.sling.scripting.javascript-2.0.0-incubator-SNAPSHOT.jar to /home/continuum/data/working-directory/349/target/org.apache.sling.launchpad.webapp-2.0.0-incubator-SNAPSHOT/WEB-INF/resources/bundles/org.apache.sling.scripting.javascript-2.0.0-incubator-SNAPSHOT.jar
[INFO] Copying org.apache.sling.scripting.jsp-2.0.0-incubator-SNAPSHOT.jar to /home/continuum/data/working-directory/349/target/org.apache.sling.launchpad.webapp-2.0.0-incubator-SNAPSHOT/WEB-INF/resources/bundles/org.apache.sling.scripting.jsp-2.0.0-incubator-SNAPSHOT.jar
[INFO] Copying org.apache.sling.scripting.jsp.taglib-2.0.0-incubator-SNAPSHOT.jar to /home/continuum/data/working-directory/349/target/org.apache.sling.launchpad.webapp-2.0.0-incubator-SNAPSHOT/WEB-INF/resources/bundles/org.apache.sling.scripting.jsp.taglib-2.0.0-incubator-SNAPSHOT.jar
[INFO] Copying org.apache.sling.scripting.resolver-2.0.0-incubator-SNAPSHOT.jar to /home/continuum/data/working-directory/349/target/org.apache.sling.launchpad.webapp-2.0.0-incubator-SNAPSHOT/WEB-INF/resources/bundles/org.apache.sling.scripting.resolver-2.0.0-incubator-SNAPSHOT.jar
[INFO] Copying org.apache.sling.servlet.resolver-2.0.0-incubator-SNAPSHOT.jar to /home/continuum/data/working-directory/349/target/org.apache.sling.launchpad.webapp-2.0.0-incubator-SNAPSHOT/WEB-INF/resources/bundles/org.apache.sling.servlet.resolver-2.0.0-incubator-SNAPSHOT.jar
[INFO] [resources:resources]
[INFO] Using default encoding to copy filtered resources.
[INFO] [compiler:compile]
[INFO] No sources to compile
[INFO] [resources:testResources]
[INFO] Using default encoding to copy filtered resources.
[INFO] [compiler:testCompile]
[INFO] Compiling 31 source files to /home/continuum/data/working-directory/349/target/test-classes
[INFO] [surefire:test]
[INFO] Surefire report directory: /home/continuum/data/working-directory/349/target/surefire-reports

-------------------------------------------------------
 T E S T S
-------------------------------------------------------
There are no tests to run.

Results :

Tests run: 0, Failures: 0, Errors: 0, Skipped: 0

[INFO] [war:war]
[INFO] Exploding webapp...
[INFO] Assembling webapp org.apache.sling.launchpad.webapp in /home/continuum/data/working-directory/349/target/org.apache.sling.launchpad.webapp-2.0.0-incubator-SNAPSHOT
[INFO] Copy webapp webResources to /home/continuum/data/working-directory/349/target/org.apache.sling.launchpad.webapp-2.0.0-incubator-SNAPSHOT
[INFO] Copy webapp webResources to /home/continuum/data/working-directory/349/target/org.apache.sling.launchpad.webapp-2.0.0-incubator-SNAPSHOT
[INFO] Copy webapp webResources to /home/continuum/data/working-directory/349/target/org.apache.sling.launchpad.webapp-2.0.0-incubator-SNAPSHOT
[INFO] Expanding: /home/continuum/.m2/repository/org/apache/sling/org.apache.sling.launcher.webapp/2.0.0-incubator-SNAPSHOT/org.apache.sling.launcher.webapp-2.0.0-incubator-SNAPSHOT.war
into /home/continuum/data/working-directory/349/target/war/work/org.apache.sling.launcher.webapp-2.0.0-incubator-SNAPSHOT
[INFO] Overlaying 1 war(s).
[INFO] Generating war /home/continuum/data/working-directory/349/target/org.apache.sling.launchpad.webapp-2.0.0-incubator-SNAPSHOT.war
[INFO] Building war: /home/continuum/data/working-directory/349/target/org.apache.sling.launchpad.webapp-2.0.0-incubator-SNAPSHOT.war
[INFO] Preparing source:jar
[WARNING] Removing: jar from forked lifecycle, to prevent recursive invocation.
[INFO] [enforcer:enforce {execution: enforce-java}]
[INFO] [source:jar {execution: attach-sources}]
[INFO] Building jar: /home/continuum/data/working-directory/349/target/org.apache.sling.launchpad.webapp-2.0.0-incubator-SNAPSHOT-sources.jar
[INFO] [cargo:start {execution: start-container}]
[INFO] [beddedLocalContainer] Jetty 6.x Embedded starting...
2008-02-08 11:17:33.585::INFO:  Logging to STDERR via org.mortbay.log.StdErrLog
2008-02-08 11:17:33.665::INFO:  jetty-6.1.1rc1
2008-02-08 11:17:34.063::INFO:  Extract jar:file:/home/continuum/data/working-directory/349/target/org.apache.sling.launchpad.webapp-2.0.0-incubator-SNAPSHOT.war!/
to /tmp/Jetty_0_0_0_0_8080_org.apache.sling.launchpad.webapp-2.0.0-incubator-SNAPSHOT.war__org_apache_sling_launchpad_webapp-2_0_0-incubator-SNAPSHOT__ybspfb/webapp
2008-02-08 11:17:44.231:/org.apache.sling.launchpad.webapp-2.0.0-incubator-SNAPSHOT:INFO:
 sling: Servlet sling initialized
2008-02-08 11:17:44.234::INFO:  Extract jar:file:/home/continuum/data/working-directory/349/target/jetty6x/cargocpc.war!/
to /tmp/Jetty_0_0_0_0_8080_cargocpc.war__cargocpc__xflgf3/webapp
2008-02-08 11:17:48.724::WARN:  failed SelectChannelConnector @ 0.0.0.0:8080
java.net.BindException: Address already in use
	at sun.nio.ch.Net.bind(Native Method)
	at sun.nio.ch.ServerSocketChannelImpl.bind(ServerSocketChannelImpl.java:119)
	at sun.nio.ch.ServerSocketAdaptor.bind(ServerSocketAdaptor.java:59)
	at org.mortbay.jetty.nio.SelectChannelConnector.open(SelectChannelConnector.java:198)
	at org.mortbay.jetty.AbstractConnector.doStart(AbstractConnector.java:251)
	at org.mortbay.jetty.nio.SelectChannelConnector.doStart(SelectChannelConnector.java:233)
	at org.mortbay.component.AbstractLifeCycle.start(AbstractLifeCycle.java:40)
	at org.mortbay.jetty.Server.doStart(Server.java:221)
	at org.mortbay.component.AbstractLifeCycle.start(AbstractLifeCycle.java:40)
	at sun.reflect.NativeMethodAccessorImpl.invoke0(Native Method)
	at sun.reflect.NativeMethodAccessorImpl.invoke(NativeMethodAccessorImpl.java:39)
	at sun.reflect.DelegatingMethodAccessorImpl.invoke(DelegatingMethodAccessorImpl.java:25)
	at java.lang.reflect.Method.invoke(Method.java:597)
	at org.codehaus.cargo.container.jetty.internal.JettyExecutorThread.run(JettyExecutorThread.java:68)
2008-02-08 11:17:48.725::WARN:  failed Server@5a9c5d
java.net.BindException: Address already in use
	at sun.nio.ch.Net.bind(Native Method)
	at sun.nio.ch.ServerSocketChannelImpl.bind(ServerSocketChannelImpl.java:119)
	at sun.nio.ch.ServerSocketAdaptor.bind(ServerSocketAdaptor.java:59)
	at org.mortbay.jetty.nio.SelectChannelConnector.open(SelectChannelConnector.java:198)
	at org.mortbay.jetty.AbstractConnector.doStart(AbstractConnector.java:251)
	at org.mortbay.jetty.nio.SelectChannelConnector.doStart(SelectChannelConnector.java:233)
	at org.mortbay.component.AbstractLifeCycle.start(AbstractLifeCycle.java:40)
	at org.mortbay.jetty.Server.doStart(Server.java:221)
	at org.mortbay.component.AbstractLifeCycle.start(AbstractLifeCycle.java:40)
	at sun.reflect.NativeMethodAccessorImpl.invoke0(Native Method)
	at sun.reflect.NativeMethodAccessorImpl.invoke(NativeMethodAccessorImpl.java:39)
	at sun.reflect.DelegatingMethodAccessorImpl.invoke(DelegatingMethodAccessorImpl.java:25)
	at java.lang.reflect.Method.invoke(Method.java:597)
	at org.codehaus.cargo.container.jetty.internal.JettyExecutorThread.run(JettyExecutorThread.java:68)
Exception in thread "Thread-3" org.codehaus.cargo.container.ContainerException: Failed to
start the Jetty container
	at org.codehaus.cargo.container.jetty.internal.JettyExecutorThread.run(JettyExecutorThread.java:102)
Caused by: java.lang.reflect.InvocationTargetException
	at sun.reflect.NativeMethodAccessorImpl.invoke0(Native Method)
	at sun.reflect.NativeMethodAccessorImpl.invoke(NativeMethodAccessorImpl.java:39)
	at sun.reflect.DelegatingMethodAccessorImpl.invoke(DelegatingMethodAccessorImpl.java:25)
	at java.lang.reflect.Method.invoke(Method.java:597)
	at org.codehaus.cargo.container.jetty.internal.JettyExecutorThread.run(JettyExecutorThread.java:68)
Caused by: java.net.BindException: Address already in use
	at sun.nio.ch.Net.bind(Native Method)
	at sun.nio.ch.ServerSocketChannelImpl.bind(ServerSocketChannelImpl.java:119)
	at sun.nio.ch.ServerSocketAdaptor.bind(ServerSocketAdaptor.java:59)
	at org.mortbay.jetty.nio.SelectChannelConnector.open(SelectChannelConnector.java:198)
	at org.mortbay.jetty.AbstractConnector.doStart(AbstractConnector.java:251)
	at org.mortbay.jetty.nio.SelectChannelConnector.doStart(SelectChannelConnector.java:233)
	at org.mortbay.component.AbstractLifeCycle.start(AbstractLifeCycle.java:40)
	at org.mortbay.jetty.Server.doStart(Server.java:221)
	at org.mortbay.component.AbstractLifeCycle.start(AbstractLifeCycle.java:40)
	... 5 more
java.lang.reflect.InvocationTargetException
	at sun.reflect.NativeMethodAccessorImpl.invoke0(Native Method)
	at sun.reflect.NativeMethodAccessorImpl.invoke(NativeMethodAccessorImpl.java:39)
	at sun.reflect.DelegatingMethodAccessorImpl.invoke(DelegatingMethodAccessorImpl.java:25)
	at java.lang.reflect.Method.invoke(Method.java:597)
	at org.codehaus.cargo.container.jetty.internal.JettyExecutorThread.run(JettyExecutorThread.java:68)
Caused by: java.net.BindException: Address already in use
	at sun.nio.ch.Net.bind(Native Method)
	at sun.nio.ch.ServerSocketChannelImpl.bind(ServerSocketChannelImpl.java:119)
	at sun.nio.ch.ServerSocketAdaptor.bind(ServerSocketAdaptor.java:59)
	at org.mortbay.jetty.nio.SelectChannelConnector.open(SelectChannelConnector.java:198)
	at org.mortbay.jetty.AbstractConnector.doStart(AbstractConnector.java:251)
	at org.mortbay.jetty.nio.SelectChannelConnector.doStart(SelectChannelConnector.java:233)
	at org.mortbay.component.AbstractLifeCycle.start(AbstractLifeCycle.java:40)
	at org.mortbay.jetty.Server.doStart(Server.java:221)
	at org.mortbay.component.AbstractLifeCycle.start(AbstractLifeCycle.java:40)
	... 5 more
[INFO] ------------------------------------------------------------------------
[ERROR] FATAL ERROR
[INFO] ------------------------------------------------------------------------
[INFO] Failed to start the Jetty 6.x Embedded container.
Deployable [http://localhost:8080/cargocpc/index.html] failed to finish deploying within the
timeout period [120000]. The Deployable state is thus unknown.
[INFO] ------------------------------------------------------------------------
[INFO] Trace
org.codehaus.cargo.container.ContainerException: Failed to start the Jetty 6.x Embedded container.
	at org.codehaus.cargo.container.spi.AbstractLocalContainer.start(AbstractLocalContainer.java:160)
	at org.codehaus.cargo.maven2.ContainerStartMojo.doExecute(ContainerStartMojo.java:61)
	at org.codehaus.cargo.maven2.AbstractCargoMojo.execute(AbstractCargoMojo.java:243)
	at org.apache.maven.plugin.DefaultPluginManager.executeMojo(DefaultPluginManager.java:443)
	at org.apache.maven.lifecycle.DefaultLifecycleExecutor.executeGoals(DefaultLifecycleExecutor.java:539)
	at org.apache.maven.lifecycle.DefaultLifecycleExecutor.executeGoalWithLifecycle(DefaultLifecycleExecutor.java:480)
	at org.apache.maven.lifecycle.DefaultLifecycleExecutor.executeGoal(DefaultLifecycleExecutor.java:459)
	at org.apache.maven.lifecycle.DefaultLifecycleExecutor.executeGoalAndHandleFailures(DefaultLifecycleExecutor.java:311)
	at org.apache.maven.lifecycle.DefaultLifecycleExecutor.executeTaskSegments(DefaultLifecycleExecutor.java:278)
	at org.apache.maven.lifecycle.DefaultLifecycleExecutor.execute(DefaultLifecycleExecutor.java:143)
	at org.apache.maven.DefaultMaven.doExecute(DefaultMaven.java:334)
	at org.apache.maven.DefaultMaven.execute(DefaultMaven.java:125)
	at org.apache.maven.cli.MavenCli.main(MavenCli.java:280)
	at sun.reflect.NativeMethodAccessorImpl.invoke0(Native Method)
	at sun.reflect.NativeMethodAccessorImpl.invoke(NativeMethodAccessorImpl.java:39)
	at sun.reflect.DelegatingMethodAccessorImpl.invoke(DelegatingMethodAccessorImpl.java:25)
	at java.lang.reflect.Method.invoke(Method.java:597)
	at org.codehaus.classworlds.Launcher.launchEnhanced(Launcher.java:315)
	at org.codehaus.classworlds.Launcher.launch(Launcher.java:255)
	at org.codehaus.classworlds.Launcher.mainWithExitCode(Launcher.java:430)
	at org.codehaus.classworlds.Launcher.main(Launcher.java:375)
Caused by: org.codehaus.cargo.container.ContainerException: Deployable [http://localhost:8080/cargocpc/index.html]
failed to finish deploying within the timeout period [120000]. The Deployable state is thus
unknown.
	at org.codehaus.cargo.container.spi.deployer.DeployerWatchdog.watch(DeployerWatchdog.java:111)
	at org.codehaus.cargo.container.spi.AbstractLocalContainer.waitForCompletion(AbstractLocalContainer.java:212)
	at org.codehaus.cargo.container.spi.AbstractLocalContainer.start(AbstractLocalContainer.java:155)
	... 20 more
org.codehaus.cargo.container.ContainerException: Deployable [http://localhost:8080/cargocpc/index.html]
failed to finish deploying within the timeout period [120000]. The Deployable state is thus
unknown.
	at org.codehaus.cargo.container.spi.deployer.DeployerWatchdog.watch(DeployerWatchdog.java:111)
	at org.codehaus.cargo.container.spi.AbstractLocalContainer.waitForCompletion(AbstractLocalContainer.java:212)
	at org.codehaus.cargo.container.spi.AbstractLocalContainer.start(AbstractLocalContainer.java:155)
	at org.codehaus.cargo.maven2.ContainerStartMojo.doExecute(ContainerStartMojo.java:61)
	at org.codehaus.cargo.maven2.AbstractCargoMojo.execute(AbstractCargoMojo.java:243)
	at org.apache.maven.plugin.DefaultPluginManager.executeMojo(DefaultPluginManager.java:443)
	at org.apache.maven.lifecycle.DefaultLifecycleExecutor.executeGoals(DefaultLifecycleExecutor.java:539)
	at org.apache.maven.lifecycle.DefaultLifecycleExecutor.executeGoalWithLifecycle(DefaultLifecycleExecutor.java:480)
	at org.apache.maven.lifecycle.DefaultLifecycleExecutor.executeGoal(DefaultLifecycleExecutor.java:459)
	at org.apache.maven.lifecycle.DefaultLifecycleExecutor.executeGoalAndHandleFailures(DefaultLifecycleExecutor.java:311)
	at org.apache.maven.lifecycle.DefaultLifecycleExecutor.executeTaskSegments(DefaultLifecycleExecutor.java:278)
	at org.apache.maven.lifecycle.DefaultLifecycleExecutor.execute(DefaultLifecycleExecutor.java:143)
	at org.apache.maven.DefaultMaven.doExecute(DefaultMaven.java:334)
	at org.apache.maven.DefaultMaven.execute(DefaultMaven.java:125)
	at org.apache.maven.cli.MavenCli.main(MavenCli.java:280)
	at sun.reflect.NativeMethodAccessorImpl.invoke0(Native Method)
	at sun.reflect.NativeMethodAccessorImpl.invoke(NativeMethodAccessorImpl.java:39)
	at sun.reflect.DelegatingMethodAccessorImpl.invoke(DelegatingMethodAccessorImpl.java:25)
	at java.lang.reflect.Method.invoke(Method.java:597)
	at org.codehaus.classworlds.Launcher.launchEnhanced(Launcher.java:315)
	at org.codehaus.classworlds.Launcher.launch(Launcher.java:255)
	at org.codehaus.classworlds.Launcher.mainWithExitCode(Launcher.java:430)
	at org.codehaus.classworlds.Launcher.main(Launcher.java:375)
[INFO] ------------------------------------------------------------------------
[INFO] Total time: 3 minutes 3 seconds
[INFO] Finished at: Fri Feb 08 11:19:33 PST 2008
[INFO] Final Memory: 25M/48M
[INFO] ------------------------------------------------------------------------
2008-02-08 11:19:34.097::INFO:  Shutdown hook executing
2008-02-08 11:19:35.398::INFO:  Shutdown hook complete

****************************************************************************



Mime
View raw message