incubator-sling-commits mailing list archives

Site index · List index
Message view « Date » · « Thread »
Top « Date » · « Thread »
From Continuum VMBuild Server <contin...@apache.org>
Subject [continuum] BUILD FAILURE: Sling Launchpad Web Application
Date Wed, 27 Feb 2008 12:49:21 GMT
Online report : http://vmbuild.apache.org/continuum/buildResult.action?buildId=56492&projectId=349

Build statistics:
  State: Failed
  Previous State: Ok
  Started at: Wed 27 Feb 2008 04:45:57 -0800
  Finished at: Wed 27 Feb 2008 04:49:06 -0800
  Total time: 3m 8s
  Build Trigger: Schedule
  Build Number: 25
  Exit code: 1
  Building machine hostname: vmbuild.apache.org
  Operating system : Linux(unknown)
  Java Home version : 
          java version "1.6.0"
          Java(TM) SE Runtime Environment (build 1.6.0-b105)
          Java HotSpot(TM) Client VM (build 1.6.0-b105, mixed mode, sharing)
        
  Builder version :
          Maven version: 2.0.7
          Java version: 1.6.0
          OS name: "linux" version: "2.6.20-16-server" arch: "i386"
    
****************************************************************************
SCM Changes:
****************************************************************************
No files changed

****************************************************************************
Dependencies Changes:
****************************************************************************
org.apache.sling:org.apache.sling.launchpad.servlets:2.0.0-incubator-SNAPSHOT

org.apache.sling:org.apache.sling.scripting.jsp.taglib:2.0.0-incubator-SNAPSHOT

org.apache.sling:org.apache.sling.jcr.resource:2.0.0-incubator-SNAPSHOT

org.apache.sling:org.apache.sling.core:2.0.0-incubator-SNAPSHOT

org.apache.sling:org.apache.sling.jcr.ocm:2.0.0-incubator-SNAPSHOT

org.apache.sling:org.apache.sling.servlet.resolver:2.0.0-incubator-SNAPSHOT


****************************************************************************
Build Defintion:
****************************************************************************
POM filename: pom.xml
Goals: clean install   
Arguments: --batch-mode --non-recursive
Build Fresh: false
Always Build: false
Default Build Definition: true
Schedule: DEFAULT_SCHEDULE
Description: 


****************************************************************************
Test Summary:
****************************************************************************
Tests: 108
Failures: 108
Total time: 61537

****************************************************************************
Output:
****************************************************************************
[INFO] Scanning for projects...
[INFO] ----------------------------------------------------------------------------
[INFO] Building Sling Launchpad Web Application
[INFO]    task-segment: [clean, install]
[INFO] ----------------------------------------------------------------------------
[INFO] [clean:clean]
[INFO] Deleting directory /home/continuum/data/working-directory/349/target
[INFO] Deleting directory /home/continuum/data/working-directory/349/target/classes
[INFO] Deleting directory /home/continuum/data/working-directory/349/target/test-classes
[INFO] Deleting directory /home/continuum/data/working-directory/349/target/site
[INFO] [enforcer:enforce {execution: enforce-java}]
[INFO] [dependency:unpack-dependencies {execution: unpack-dependencies}]
[INFO] Expanding: /home/continuum/.m2/repository/org/apache/sling/org.apache.sling.launcher.webapp/2.0.0-incubator-SNAPSHOT/org.apache.sling.launcher.webapp-2.0.0-incubator-SNAPSHOT.war into /home/continuum/data/working-directory/349/target/launcher-webapp
[INFO] Expanding: /home/continuum/.m2/repository/org/eclipse/equinox/http/servlet/1.0.0-v20070606/servlet-1.0.0-v20070606.jar into /home/continuum/data/working-directory/349/target/launcher-webapp
[INFO] [dependency:copy-dependencies {execution: copy-dependencies}]
[INFO] Copying org.apache.felix.framework-1.0.3.jar to /home/continuum/data/working-directory/349/target/org.apache.sling.launchpad.webapp-2.0.0-incubator-SNAPSHOT/WEB-INF/resources/bundles/org.apache.felix.framework-1.0.3.jar
[INFO] Copying org.osgi.compendium-1.0.0.jar to /home/continuum/data/working-directory/349/target/org.apache.sling.launchpad.webapp-2.0.0-incubator-SNAPSHOT/WEB-INF/resources/bundles/org.osgi.compendium-1.0.0.jar
[INFO] Copying org.osgi.core-1.0.0.jar to /home/continuum/data/working-directory/349/target/org.apache.sling.launchpad.webapp-2.0.0-incubator-SNAPSHOT/WEB-INF/resources/bundles/org.osgi.core-1.0.0.jar
[INFO] Copying org.apache.felix.commons.cglib-full-2.0.2-0001-SNAPSHOT.jar to /home/continuum/data/working-directory/349/target/org.apache.sling.launchpad.webapp-2.0.0-incubator-SNAPSHOT/WEB-INF/resources/bundles/org.apache.felix.commons.cglib-full-2.0.2-0001-SNAPSHOT.jar
[INFO] Copying org.apache.felix.commons.commons-beanutils-1.7.0-0001-SNAPSHOT.jar to /home/continuum/data/working-directory/349/target/org.apache.sling.launchpad.webapp-2.0.0-incubator-SNAPSHOT/WEB-INF/resources/bundles/org.apache.felix.commons.commons-beanutils-1.7.0-0001-SNAPSHOT.jar
[INFO] Copying org.apache.felix.commons.commons-codec-1.3.0-0001-SNAPSHOT.jar to /home/continuum/data/working-directory/349/target/org.apache.sling.launchpad.webapp-2.0.0-incubator-SNAPSHOT/WEB-INF/resources/bundles/org.apache.felix.commons.commons-codec-1.3.0-0001-SNAPSHOT.jar
[INFO] Copying org.apache.felix.commons.commons-collections-3.2.0-0001-SNAPSHOT.jar to /home/continuum/data/working-directory/349/target/org.apache.sling.launchpad.webapp-2.0.0-incubator-SNAPSHOT/WEB-INF/resources/bundles/org.apache.felix.commons.commons-collections-3.2.0-0001-SNAPSHOT.jar
[INFO] Copying org.apache.felix.commons.commons-el-1.0.0-0001-SNAPSHOT.jar to /home/continuum/data/working-directory/349/target/org.apache.sling.launchpad.webapp-2.0.0-incubator-SNAPSHOT/WEB-INF/resources/bundles/org.apache.felix.commons.commons-el-1.0.0-0001-SNAPSHOT.jar
[INFO] Copying org.apache.felix.commons.commons-fileupload-1.1.1-0001-SNAPSHOT.jar to /home/continuum/data/working-directory/349/target/org.apache.sling.launchpad.webapp-2.0.0-incubator-SNAPSHOT/WEB-INF/resources/bundles/org.apache.felix.commons.commons-fileupload-1.1.1-0001-SNAPSHOT.jar
[INFO] Copying org.apache.felix.commons.commons-httpclient-3.0.1-0001-SNAPSHOT.jar to /home/continuum/data/working-directory/349/target/org.apache.sling.launchpad.webapp-2.0.0-incubator-SNAPSHOT/WEB-INF/resources/bundles/org.apache.felix.commons.commons-httpclient-3.0.1-0001-SNAPSHOT.jar
[INFO] Copying org.apache.felix.commons.commons-io-1.3.2-0002-SNAPSHOT.jar to /home/continuum/data/working-directory/349/target/org.apache.sling.launchpad.webapp-2.0.0-incubator-SNAPSHOT/WEB-INF/resources/bundles/org.apache.felix.commons.commons-io-1.3.2-0002-SNAPSHOT.jar
[INFO] Copying org.apache.felix.commons.jsp-api-2.0.0-0001-SNAPSHOT.jar to /home/continuum/data/working-directory/349/target/org.apache.sling.launchpad.webapp-2.0.0-incubator-SNAPSHOT/WEB-INF/resources/bundles/org.apache.felix.commons.jsp-api-2.0.0-0001-SNAPSHOT.jar
[INFO] Copying jackrabbit-jcr-commons-1.5-SNAPSHOT.jar to /home/continuum/data/working-directory/349/target/org.apache.sling.launchpad.webapp-2.0.0-incubator-SNAPSHOT/WEB-INF/resources/bundles/jackrabbit-jcr-commons-1.5-SNAPSHOT.jar
[INFO] Copying org.apache.sling.adapter-2.0.0-incubator-SNAPSHOT.jar to /home/continuum/data/working-directory/349/target/org.apache.sling.launchpad.webapp-2.0.0-incubator-SNAPSHOT/WEB-INF/resources/bundles/org.apache.sling.adapter-2.0.0-incubator-SNAPSHOT.jar
[INFO] Copying org.apache.sling.api-2.0.0-incubator-SNAPSHOT.jar to /home/continuum/data/working-directory/349/target/org.apache.sling.launchpad.webapp-2.0.0-incubator-SNAPSHOT/WEB-INF/resources/bundles/org.apache.sling.api-2.0.0-incubator-SNAPSHOT.jar
[INFO] Copying org.apache.sling.commons.json-2.0.0-incubator-SNAPSHOT.jar to /home/continuum/data/working-directory/349/target/org.apache.sling.launchpad.webapp-2.0.0-incubator-SNAPSHOT/WEB-INF/resources/bundles/org.apache.sling.commons.json-2.0.0-incubator-SNAPSHOT.jar
[INFO] Copying org.apache.sling.commons.mime-2.0.0-incubator-SNAPSHOT.jar to /home/continuum/data/working-directory/349/target/org.apache.sling.launchpad.webapp-2.0.0-incubator-SNAPSHOT/WEB-INF/resources/bundles/org.apache.sling.commons.mime-2.0.0-incubator-SNAPSHOT.jar
[INFO] Copying org.apache.sling.core-2.0.0-incubator-SNAPSHOT.jar to /home/continuum/data/working-directory/349/target/org.apache.sling.launchpad.webapp-2.0.0-incubator-SNAPSHOT/WEB-INF/resources/bundles/org.apache.sling.core-2.0.0-incubator-SNAPSHOT.jar
[INFO] Copying org.apache.sling.jcr.api-2.0.0-incubator-SNAPSHOT.jar to /home/continuum/data/working-directory/349/target/org.apache.sling.launchpad.webapp-2.0.0-incubator-SNAPSHOT/WEB-INF/resources/bundles/org.apache.sling.jcr.api-2.0.0-incubator-SNAPSHOT.jar
[INFO] Copying org.apache.sling.jcr.base-2.0.0-incubator-SNAPSHOT.jar to /home/continuum/data/working-directory/349/target/org.apache.sling.launchpad.webapp-2.0.0-incubator-SNAPSHOT/WEB-INF/resources/bundles/org.apache.sling.jcr.base-2.0.0-incubator-SNAPSHOT.jar
[INFO] Copying org.apache.sling.jcr.classloader-2.0.0-incubator-SNAPSHOT.jar to /home/continuum/data/working-directory/349/target/org.apache.sling.launchpad.webapp-2.0.0-incubator-SNAPSHOT/WEB-INF/resources/bundles/org.apache.sling.jcr.classloader-2.0.0-incubator-SNAPSHOT.jar
[INFO] Copying org.apache.sling.jcr.jackrabbit.server-2.0.0-incubator-SNAPSHOT.jar to /home/continuum/data/working-directory/349/target/org.apache.sling.launchpad.webapp-2.0.0-incubator-SNAPSHOT/WEB-INF/resources/bundles/org.apache.sling.jcr.jackrabbit.server-2.0.0-incubator-SNAPSHOT.jar
[INFO] Copying org.apache.sling.jcr.ocm-2.0.0-incubator-SNAPSHOT.jar to /home/continuum/data/working-directory/349/target/org.apache.sling.launchpad.webapp-2.0.0-incubator-SNAPSHOT/WEB-INF/resources/bundles/org.apache.sling.jcr.ocm-2.0.0-incubator-SNAPSHOT.jar
[INFO] Copying org.apache.sling.jcr.resource-2.0.0-incubator-SNAPSHOT.jar to /home/continuum/data/working-directory/349/target/org.apache.sling.launchpad.webapp-2.0.0-incubator-SNAPSHOT/WEB-INF/resources/bundles/org.apache.sling.jcr.resource-2.0.0-incubator-SNAPSHOT.jar
[INFO] Copying org.apache.sling.jcr.webdav-2.0.0-incubator-SNAPSHOT.jar to /home/continuum/data/working-directory/349/target/org.apache.sling.launchpad.webapp-2.0.0-incubator-SNAPSHOT/WEB-INF/resources/bundles/org.apache.sling.jcr.webdav-2.0.0-incubator-SNAPSHOT.jar
[INFO] Copying org.apache.sling.launcher.webapp-2.0.0-incubator-SNAPSHOT.war to /home/continuum/data/working-directory/349/target/org.apache.sling.launchpad.webapp-2.0.0-incubator-SNAPSHOT/WEB-INF/resources/bundles/org.apache.sling.launcher.webapp-2.0.0-incubator-SNAPSHOT.war
[INFO] Copying org.apache.sling.launchpad.content-2.0.0-incubator-SNAPSHOT.jar to /home/continuum/data/working-directory/349/target/org.apache.sling.launchpad.webapp-2.0.0-incubator-SNAPSHOT/WEB-INF/resources/bundles/org.apache.sling.launchpad.content-2.0.0-incubator-SNAPSHOT.jar
[INFO] Copying org.apache.sling.launchpad.servlets-2.0.0-incubator-SNAPSHOT.jar to /home/continuum/data/working-directory/349/target/org.apache.sling.launchpad.webapp-2.0.0-incubator-SNAPSHOT/WEB-INF/resources/bundles/org.apache.sling.launchpad.servlets-2.0.0-incubator-SNAPSHOT.jar
[INFO] Copying org.apache.sling.osgi.commons-2.0.0-incubator-SNAPSHOT.jar to /home/continuum/data/working-directory/349/target/org.apache.sling.launchpad.webapp-2.0.0-incubator-SNAPSHOT/WEB-INF/resources/bundles/org.apache.sling.osgi.commons-2.0.0-incubator-SNAPSHOT.jar
[INFO] Copying org.apache.sling.scripting.api-2.0.0-incubator-SNAPSHOT.jar to /home/continuum/data/working-directory/349/target/org.apache.sling.launchpad.webapp-2.0.0-incubator-SNAPSHOT/WEB-INF/resources/bundles/org.apache.sling.scripting.api-2.0.0-incubator-SNAPSHOT.jar
[INFO] Copying org.apache.sling.scripting.javascript-2.0.0-incubator-SNAPSHOT.jar to /home/continuum/data/working-directory/349/target/org.apache.sling.launchpad.webapp-2.0.0-incubator-SNAPSHOT/WEB-INF/resources/bundles/org.apache.sling.scripting.javascript-2.0.0-incubator-SNAPSHOT.jar
[INFO] Copying org.apache.sling.scripting.jsp-2.0.0-incubator-SNAPSHOT.jar to /home/continuum/data/working-directory/349/target/org.apache.sling.launchpad.webapp-2.0.0-incubator-SNAPSHOT/WEB-INF/resources/bundles/org.apache.sling.scripting.jsp-2.0.0-incubator-SNAPSHOT.jar
[INFO] Copying org.apache.sling.scripting.jsp.taglib-2.0.0-incubator-SNAPSHOT.jar to /home/continuum/data/working-directory/349/target/org.apache.sling.launchpad.webapp-2.0.0-incubator-SNAPSHOT/WEB-INF/resources/bundles/org.apache.sling.scripting.jsp.taglib-2.0.0-incubator-SNAPSHOT.jar
[INFO] Copying org.apache.sling.scripting.resolver-2.0.0-incubator-SNAPSHOT.jar to /home/continuum/data/working-directory/349/target/org.apache.sling.launchpad.webapp-2.0.0-incubator-SNAPSHOT/WEB-INF/resources/bundles/org.apache.sling.scripting.resolver-2.0.0-incubator-SNAPSHOT.jar
[INFO] Copying org.apache.sling.servlet.resolver-2.0.0-incubator-SNAPSHOT.jar to /home/continuum/data/working-directory/349/target/org.apache.sling.launchpad.webapp-2.0.0-incubator-SNAPSHOT/WEB-INF/resources/bundles/org.apache.sling.servlet.resolver-2.0.0-incubator-SNAPSHOT.jar
[INFO] Copying org.apache.sling.servlets.default-2.0.0-incubator-SNAPSHOT.jar to /home/continuum/data/working-directory/349/target/org.apache.sling.launchpad.webapp-2.0.0-incubator-SNAPSHOT/WEB-INF/resources/bundles/org.apache.sling.servlets.default-2.0.0-incubator-SNAPSHOT.jar
[INFO] [resources:resources]
[INFO] Using default encoding to copy filtered resources.
[INFO] [compiler:compile]
[INFO] No sources to compile
[INFO] [resources:testResources]
[INFO] Using default encoding to copy filtered resources.
[INFO] [compiler:testCompile]
[INFO] Compiling 35 source files to /home/continuum/data/working-directory/349/target/test-classes
[INFO] [surefire:test]
[INFO] Surefire report directory: /home/continuum/data/working-directory/349/target/surefire-reports

-------------------------------------------------------
 T E S T S
-------------------------------------------------------
There are no tests to run.

Results :

Tests run: 0, Failures: 0, Errors: 0, Skipped: 0

[INFO] [war:war]
[INFO] Exploding webapp...
[INFO] Assembling webapp org.apache.sling.launchpad.webapp in /home/continuum/data/working-directory/349/target/org.apache.sling.launchpad.webapp-2.0.0-incubator-SNAPSHOT
[INFO] Copy webapp webResources to /home/continuum/data/working-directory/349/target/org.apache.sling.launchpad.webapp-2.0.0-incubator-SNAPSHOT
[INFO] Copy webapp webResources to /home/continuum/data/working-directory/349/target/org.apache.sling.launchpad.webapp-2.0.0-incubator-SNAPSHOT
[INFO] Copy webapp webResources to /home/continuum/data/working-directory/349/target/org.apache.sling.launchpad.webapp-2.0.0-incubator-SNAPSHOT
[INFO] Expanding: /home/continuum/.m2/repository/org/apache/sling/org.apache.sling.launcher.webapp/2.0.0-incubator-SNAPSHOT/org.apache.sling.launcher.webapp-2.0.0-incubator-SNAPSHOT.war into /home/continuum/data/working-directory/349/target/war/work/org.apache.sling.launcher.webapp-2.0.0-incubator-SNAPSHOT
[INFO] Overlaying 1 war(s).
[INFO] Generating war /home/continuum/data/working-directory/349/target/org.apache.sling.launchpad.webapp-2.0.0-incubator-SNAPSHOT.war
[INFO] Building war: /home/continuum/data/working-directory/349/target/org.apache.sling.launchpad.webapp-2.0.0-incubator-SNAPSHOT.war
[INFO] Preparing source:jar
[WARNING] Removing: jar from forked lifecycle, to prevent recursive invocation.
[INFO] [enforcer:enforce {execution: enforce-java}]
[INFO] [source:jar {execution: attach-sources}]
[INFO] Building jar: /home/continuum/data/working-directory/349/target/org.apache.sling.launchpad.webapp-2.0.0-incubator-SNAPSHOT-sources.jar
[INFO] [cargo:start {execution: start-container}]
[INFO] [beddedLocalContainer] Jetty 6.x Embedded starting...
2008-02-27 04:47:06.631::INFO:  Logging to STDERR via org.mortbay.log.StdErrLog
2008-02-27 04:47:06.894::INFO:  jetty-6.1.1rc1
2008-02-27 04:47:08.250::INFO:  Extract jar:file:/home/continuum/data/working-directory/349/target/org.apache.sling.launchpad.webapp-2.0.0-incubator-SNAPSHOT.war!/ to /tmp/Jetty_0_0_0_0_8888_org.apache.sling.launchpad.webapp-2.0.0-incubator-SNAPSHOT.war__org_apache_sling_launchpad_webapp-2_0_0-incubator-SNAPSHOT__tvdn0n/webapp
2008-02-27 04:47:40.131:/org.apache.sling.launchpad.webapp-2.0.0-incubator-SNAPSHOT:INFO:  sling: Servlet sling initialized
2008-02-27 04:47:40.172::INFO:  Extract jar:file:/tmp/cargo/conf/cargocpc.war!/ to /tmp/Jetty_0_0_0_0_8888_cargocpc.war__cargocpc__rw8xgv/webapp
2008-02-27 04:47:41.011::INFO:  Started SelectChannelConnector @ 0.0.0.0:8888
[INFO] [beddedLocalContainer] Jetty 6.x Embedded started on port [8888]
[INFO] [surefire:test {execution: surefire-integration-test}]
[INFO] Surefire report directory: /home/continuum/data/working-directory/349/target/surefire-reports

-------------------------------------------------------
 T E S T S
-------------------------------------------------------
Running org.apache.sling.launchpad.webapp.integrationtest.JavascriptWrappersTest
log4j:WARN No appenders could be found for logger (org.apache.commons.httpclient.HttpClient).
log4j:WARN Please initialize the log4j system properly.
Checking if the required Sling services are started...
(base URLs=http://localhost:8888/org.apache.sling.launchpad.webapp-2.0.0-incubator-SNAPSHOT and http://localhost:8888/org.apache.sling.launchpad.webapp-2.0.0-incubator-SNAPSHOT/dav/default)
Server does not seem to be ready, after 60000 msec, got the following 115 Exceptions:java.io.IOException: Expected status code 302 for POST, got 404, URL=http://localhost:8888/org.apache.sling.launchpad.webapp-2.0.0-incubator-SNAPSHOT/WaitForSlingStartup_1204116477516
java.io.IOException: Expected status code 302 for POST, got 404, URL=http://localhost:8888/org.apache.sling.launchpad.webapp-2.0.0-incubator-SNAPSHOT/WaitForSlingStartup_1204116478201
java.io.IOException: Expected status code 302 for POST, got 404, URL=http://localhost:8888/org.apache.sling.launchpad.webapp-2.0.0-incubator-SNAPSHOT/WaitForSlingStartup_1204116478730
java.io.IOException: Expected status code 302 for POST, got 404, URL=http://localhost:8888/org.apache.sling.launchpad.webapp-2.0.0-incubator-SNAPSHOT/WaitForSlingStartup_1204116479260
java.io.IOException: Expected status code 302 for POST, got 404, URL=http://localhost:8888/org.apache.sling.launchpad.webapp-2.0.0-incubator-SNAPSHOT/WaitForSlingStartup_1204116479801
java.io.IOException: Expected status code 302 for POST, got 404, URL=http://localhost:8888/org.apache.sling.launchpad.webapp-2.0.0-incubator-SNAPSHOT/WaitForSlingStartup_1204116480360
java.io.IOException: Expected status code 302 for POST, got 404, URL=http://localhost:8888/org.apache.sling.launchpad.webapp-2.0.0-incubator-SNAPSHOT/WaitForSlingStartup_1204116480880
java.io.IOException: Expected status code 302 for POST, got 404, URL=http://localhost:8888/org.apache.sling.launchpad.webapp-2.0.0-incubator-SNAPSHOT/WaitForSlingStartup_1204116481410
java.io.IOException: Expected status code 302 for POST, got 404, URL=http://localhost:8888/org.apache.sling.launchpad.webapp-2.0.0-incubator-SNAPSHOT/WaitForSlingStartup_1204116481941
java.io.IOException: Expected status code 302 for POST, got 404, URL=http://localhost:8888/org.apache.sling.launchpad.webapp-2.0.0-incubator-SNAPSHOT/WaitForSlingStartup_1204116482480
java.io.IOException: Expected status code 302 for POST, got 404, URL=http://localhost:8888/org.apache.sling.launchpad.webapp-2.0.0-incubator-SNAPSHOT/WaitForSlingStartup_1204116483000
java.io.IOException: Expected status code 302 for POST, got 404, URL=http://localhost:8888/org.apache.sling.launchpad.webapp-2.0.0-incubator-SNAPSHOT/WaitForSlingStartup_1204116483530
java.io.IOException: Expected status code 302 for POST, got 404, URL=http://localhost:8888/org.apache.sling.launchpad.webapp-2.0.0-incubator-SNAPSHOT/WaitForSlingStartup_1204116484060
java.io.IOException: Expected status code 302 for POST, got 404, URL=http://localhost:8888/org.apache.sling.launchpad.webapp-2.0.0-incubator-SNAPSHOT/WaitForSlingStartup_1204116484580
java.io.IOException: Expected status code 302 for POST, got 404, URL=http://localhost:8888/org.apache.sling.launchpad.webapp-2.0.0-incubator-SNAPSHOT/WaitForSlingStartup_1204116485110
java.io.IOException: Expected status code 302 for POST, got 404, URL=http://localhost:8888/org.apache.sling.launchpad.webapp-2.0.0-incubator-SNAPSHOT/WaitForSlingStartup_1204116485630
java.io.IOException: Expected status code 302 for POST, got 404, URL=http://localhost:8888/org.apache.sling.launchpad.webapp-2.0.0-incubator-SNAPSHOT/WaitForSlingStartup_1204116486190
java.io.IOException: Expected status code 302 for POST, got 404, URL=http://localhost:8888/org.apache.sling.launchpad.webapp-2.0.0-incubator-SNAPSHOT/WaitForSlingStartup_1204116486720
java.io.IOException: Expected status code 302 for POST, got 404, URL=http://localhost:8888/org.apache.sling.launchpad.webapp-2.0.0-incubator-SNAPSHOT/WaitForSlingStartup_1204116487260
java.io.IOException: Expected status code 302 for POST, got 404, URL=http://localhost:8888/org.apache.sling.launchpad.webapp-2.0.0-incubator-SNAPSHOT/WaitForSlingStartup_1204116487780
java.io.IOException: Expected status code 302 for POST, got 404, URL=http://localhost:8888/org.apache.sling.launchpad.webapp-2.0.0-incubator-SNAPSHOT/WaitForSlingStartup_1204116488300
java.io.IOException: Expected status code 302 for POST, got 404, URL=http://localhost:8888/org.apache.sling.launchpad.webapp-2.0.0-incubator-SNAPSHOT/WaitForSlingStartup_1204116488820
java.io.IOException: Expected status code 302 for POST, got 404, URL=http://localhost:8888/org.apache.sling.launchpad.webapp-2.0.0-incubator-SNAPSHOT/WaitForSlingStartup_1204116489340
java.io.IOException: Expected status code 302 for POST, got 404, URL=http://localhost:8888/org.apache.sling.launchpad.webapp-2.0.0-incubator-SNAPSHOT/WaitForSlingStartup_1204116489860
java.io.IOException: Expected status code 302 for POST, got 404, URL=http://localhost:8888/org.apache.sling.launchpad.webapp-2.0.0-incubator-SNAPSHOT/WaitForSlingStartup_1204116490380
java.io.IOException: Expected status code 302 for POST, got 404, URL=http://localhost:8888/org.apache.sling.launchpad.webapp-2.0.0-incubator-SNAPSHOT/WaitForSlingStartup_1204116490900
java.io.IOException: Expected status code 302 for POST, got 404, URL=http://localhost:8888/org.apache.sling.launchpad.webapp-2.0.0-incubator-SNAPSHOT/WaitForSlingStartup_1204116491430
java.io.IOException: Expected status code 302 for POST, got 404, URL=http://localhost:8888/org.apache.sling.launchpad.webapp-2.0.0-incubator-SNAPSHOT/WaitForSlingStartup_1204116491950
java.io.IOException: Expected status code 302 for POST, got 404, URL=http://localhost:8888/org.apache.sling.launchpad.webapp-2.0.0-incubator-SNAPSHOT/WaitForSlingStartup_1204116492470
java.io.IOException: Expected status code 302 for POST, got 404, URL=http://localhost:8888/org.apache.sling.launchpad.webapp-2.0.0-incubator-SNAPSHOT/WaitForSlingStartup_1204116492991
java.io.IOException: Expected status code 302 for POST, got 404, URL=http://localhost:8888/org.apache.sling.launchpad.webapp-2.0.0-incubator-SNAPSHOT/WaitForSlingStartup_1204116493520
java.io.IOException: Expected status code 302 for POST, got 404, URL=http://localhost:8888/org.apache.sling.launchpad.webapp-2.0.0-incubator-SNAPSHOT/WaitForSlingStartup_1204116494050
java.io.IOException: Expected status code 302 for POST, got 404, URL=http://localhost:8888/org.apache.sling.launchpad.webapp-2.0.0-incubator-SNAPSHOT/WaitForSlingStartup_1204116494580
java.io.IOException: Expected status code 302 for POST, got 404, URL=http://localhost:8888/org.apache.sling.launchpad.webapp-2.0.0-incubator-SNAPSHOT/WaitForSlingStartup_1204116495110
java.io.IOException: Expected status code 302 for POST, got 404, URL=http://localhost:8888/org.apache.sling.launchpad.webapp-2.0.0-incubator-SNAPSHOT/WaitForSlingStartup_1204116495641
java.io.IOException: Expected status code 302 for POST, got 404, URL=http://localhost:8888/org.apache.sling.launchpad.webapp-2.0.0-incubator-SNAPSHOT/WaitForSlingStartup_1204116496161
java.io.IOException: Expected status code 302 for POST, got 404, URL=http://localhost:8888/org.apache.sling.launchpad.webapp-2.0.0-incubator-SNAPSHOT/WaitForSlingStartup_1204116496690
java.io.IOException: Expected status code 302 for POST, got 404, URL=http://localhost:8888/org.apache.sling.launchpad.webapp-2.0.0-incubator-SNAPSHOT/WaitForSlingStartup_1204116497210
java.io.IOException: Expected status code 302 for POST, got 404, URL=http://localhost:8888/org.apache.sling.launchpad.webapp-2.0.0-incubator-SNAPSHOT/WaitForSlingStartup_1204116497730
java.io.IOException: Expected status code 302 for POST, got 404, URL=http://localhost:8888/org.apache.sling.launchpad.webapp-2.0.0-incubator-SNAPSHOT/WaitForSlingStartup_1204116498250
java.io.IOException: Expected status code 302 for POST, got 404, URL=http://localhost:8888/org.apache.sling.launchpad.webapp-2.0.0-incubator-SNAPSHOT/WaitForSlingStartup_1204116498770
java.io.IOException: Expected status code 302 for POST, got 404, URL=http://localhost:8888/org.apache.sling.launchpad.webapp-2.0.0-incubator-SNAPSHOT/WaitForSlingStartup_1204116499300
java.io.IOException: Expected status code 302 for POST, got 404, URL=http://localhost:8888/org.apache.sling.launchpad.webapp-2.0.0-incubator-SNAPSHOT/WaitForSlingStartup_1204116499820
java.io.IOException: Expected status code 302 for POST, got 404, URL=http://localhost:8888/org.apache.sling.launchpad.webapp-2.0.0-incubator-SNAPSHOT/WaitForSlingStartup_1204116500340
java.io.IOException: Expected status code 302 for POST, got 404, URL=http://localhost:8888/org.apache.sling.launchpad.webapp-2.0.0-incubator-SNAPSHOT/WaitForSlingStartup_1204116500870
java.io.IOException: Expected status code 302 for POST, got 404, URL=http://localhost:8888/org.apache.sling.launchpad.webapp-2.0.0-incubator-SNAPSHOT/WaitForSlingStartup_1204116501390
java.io.IOException: Expected status code 302 for POST, got 404, URL=http://localhost:8888/org.apache.sling.launchpad.webapp-2.0.0-incubator-SNAPSHOT/WaitForSlingStartup_1204116501910
java.io.IOException: Expected status code 302 for POST, got 404, URL=http://localhost:8888/org.apache.sling.launchpad.webapp-2.0.0-incubator-SNAPSHOT/WaitForSlingStartup_1204116502430
java.io.IOException: Expected status code 302 for POST, got 404, URL=http://localhost:8888/org.apache.sling.launchpad.webapp-2.0.0-incubator-SNAPSHOT/WaitForSlingStartup_1204116502950
java.io.IOException: Expected status code 302 for POST, got 404, URL=http://localhost:8888/org.apache.sling.launchpad.webapp-2.0.0-incubator-SNAPSHOT/WaitForSlingStartup_1204116503480
java.io.IOException: Expected status code 302 for POST, got 404, URL=http://localhost:8888/org.apache.sling.launchpad.webapp-2.0.0-incubator-SNAPSHOT/WaitForSlingStartup_1204116504000
java.io.IOException: Expected status code 302 for POST, got 404, URL=http://localhost:8888/org.apache.sling.launchpad.webapp-2.0.0-incubator-SNAPSHOT/WaitForSlingStartup_1204116504520
java.io.IOException: Expected status code 302 for POST, got 404, URL=http://localhost:8888/org.apache.sling.launchpad.webapp-2.0.0-incubator-SNAPSHOT/WaitForSlingStartup_1204116505050
java.io.IOException: Expected status code 302 for POST, got 404, URL=http://localhost:8888/org.apache.sling.launchpad.webapp-2.0.0-incubator-SNAPSHOT/WaitForSlingStartup_1204116505570
java.io.IOException: Expected status code 302 for POST, got 404, URL=http://localhost:8888/org.apache.sling.launchpad.webapp-2.0.0-incubator-SNAPSHOT/WaitForSlingStartup_1204116506100
java.io.IOException: Expected status code 302 for POST, got 404, URL=http://localhost:8888/org.apache.sling.launchpad.webapp-2.0.0-incubator-SNAPSHOT/WaitForSlingStartup_1204116506620
java.io.IOException: Expected status code 302 for POST, got 404, URL=http://localhost:8888/org.apache.sling.launchpad.webapp-2.0.0-incubator-SNAPSHOT/WaitForSlingStartup_1204116507140
java.io.IOException: Expected status code 302 for POST, got 404, URL=http://localhost:8888/org.apache.sling.launchpad.webapp-2.0.0-incubator-SNAPSHOT/WaitForSlingStartup_1204116507660
java.io.IOException: Expected status code 302 for POST, got 404, URL=http://localhost:8888/org.apache.sling.launchpad.webapp-2.0.0-incubator-SNAPSHOT/WaitForSlingStartup_1204116508180
java.io.IOException: Expected status code 302 for POST, got 404, URL=http://localhost:8888/org.apache.sling.launchpad.webapp-2.0.0-incubator-SNAPSHOT/WaitForSlingStartup_1204116508710
java.io.IOException: Expected status code 302 for POST, got 404, URL=http://localhost:8888/org.apache.sling.launchpad.webapp-2.0.0-incubator-SNAPSHOT/WaitForSlingStartup_1204116509230
java.io.IOException: Expected status code 302 for POST, got 404, URL=http://localhost:8888/org.apache.sling.launchpad.webapp-2.0.0-incubator-SNAPSHOT/WaitForSlingStartup_1204116509750
java.io.IOException: Expected status code 302 for POST, got 404, URL=http://localhost:8888/org.apache.sling.launchpad.webapp-2.0.0-incubator-SNAPSHOT/WaitForSlingStartup_1204116510280
java.io.IOException: Expected status code 302 for POST, got 404, URL=http://localhost:8888/org.apache.sling.launchpad.webapp-2.0.0-incubator-SNAPSHOT/WaitForSlingStartup_1204116510800
java.io.IOException: Expected status code 302 for POST, got 404, URL=http://localhost:8888/org.apache.sling.launchpad.webapp-2.0.0-incubator-SNAPSHOT/WaitForSlingStartup_1204116511320
java.io.IOException: Expected status code 302 for POST, got 404, URL=http://localhost:8888/org.apache.sling.launchpad.webapp-2.0.0-incubator-SNAPSHOT/WaitForSlingStartup_1204116511840
java.io.IOException: Expected status code 302 for POST, got 404, URL=http://localhost:8888/org.apache.sling.launchpad.webapp-2.0.0-incubator-SNAPSHOT/WaitForSlingStartup_1204116512360
java.io.IOException: Expected status code 302 for POST, got 404, URL=http://localhost:8888/org.apache.sling.launchpad.webapp-2.0.0-incubator-SNAPSHOT/WaitForSlingStartup_1204116512880
java.io.IOException: Expected status code 302 for POST, got 404, URL=http://localhost:8888/org.apache.sling.launchpad.webapp-2.0.0-incubator-SNAPSHOT/WaitForSlingStartup_1204116513400
java.io.IOException: Expected status code 302 for POST, got 404, URL=http://localhost:8888/org.apache.sling.launchpad.webapp-2.0.0-incubator-SNAPSHOT/WaitForSlingStartup_1204116513920
java.io.IOException: Expected status code 302 for POST, got 404, URL=http://localhost:8888/org.apache.sling.launchpad.webapp-2.0.0-incubator-SNAPSHOT/WaitForSlingStartup_1204116514440
java.io.IOException: Expected status code 302 for POST, got 404, URL=http://localhost:8888/org.apache.sling.launchpad.webapp-2.0.0-incubator-SNAPSHOT/WaitForSlingStartup_1204116514960
java.io.IOException: Expected status code 302 for POST, got 404, URL=http://localhost:8888/org.apache.sling.launchpad.webapp-2.0.0-incubator-SNAPSHOT/WaitForSlingStartup_1204116515500
java.io.IOException: Expected status code 302 for POST, got 404, URL=http://localhost:8888/org.apache.sling.launchpad.webapp-2.0.0-incubator-SNAPSHOT/WaitForSlingStartup_1204116516020
java.io.IOException: Expected status code 302 for POST, got 404, URL=http://localhost:8888/org.apache.sling.launchpad.webapp-2.0.0-incubator-SNAPSHOT/WaitForSlingStartup_1204116516540
java.io.IOException: Expected status code 302 for POST, got 404, URL=http://localhost:8888/org.apache.sling.launchpad.webapp-2.0.0-incubator-SNAPSHOT/WaitForSlingStartup_1204116517060
java.io.IOException: Expected status code 302 for POST, got 404, URL=http://localhost:8888/org.apache.sling.launchpad.webapp-2.0.0-incubator-SNAPSHOT/WaitForSlingStartup_1204116517580
java.io.IOException: Expected status code 302 for POST, got 404, URL=http://localhost:8888/org.apache.sling.launchpad.webapp-2.0.0-incubator-SNAPSHOT/WaitForSlingStartup_1204116518100
java.io.IOException: Expected status code 302 for POST, got 404, URL=http://localhost:8888/org.apache.sling.launchpad.webapp-2.0.0-incubator-SNAPSHOT/WaitForSlingStartup_1204116518630
java.io.IOException: Expected status code 302 for POST, got 404, URL=http://localhost:8888/org.apache.sling.launchpad.webapp-2.0.0-incubator-SNAPSHOT/WaitForSlingStartup_1204116519150
java.io.IOException: Expected status code 302 for POST, got 404, URL=http://localhost:8888/org.apache.sling.launchpad.webapp-2.0.0-incubator-SNAPSHOT/WaitForSlingStartup_1204116519670
java.io.IOException: Expected status code 302 for POST, got 404, URL=http://localhost:8888/org.apache.sling.launchpad.webapp-2.0.0-incubator-SNAPSHOT/WaitForSlingStartup_1204116520190
java.io.IOException: Expected status code 302 for POST, got 404, URL=http://localhost:8888/org.apache.sling.launchpad.webapp-2.0.0-incubator-SNAPSHOT/WaitForSlingStartup_1204116520720
java.io.IOException: Expected status code 302 for POST, got 404, URL=http://localhost:8888/org.apache.sling.launchpad.webapp-2.0.0-incubator-SNAPSHOT/WaitForSlingStartup_1204116521240
java.io.IOException: Expected status code 302 for POST, got 404, URL=http://localhost:8888/org.apache.sling.launchpad.webapp-2.0.0-incubator-SNAPSHOT/WaitForSlingStartup_1204116521760
java.io.IOException: Expected status code 302 for POST, got 404, URL=http://localhost:8888/org.apache.sling.launchpad.webapp-2.0.0-incubator-SNAPSHOT/WaitForSlingStartup_1204116522280
java.io.IOException: Expected status code 302 for POST, got 404, URL=http://localhost:8888/org.apache.sling.launchpad.webapp-2.0.0-incubator-SNAPSHOT/WaitForSlingStartup_1204116522800
java.io.IOException: Expected status code 302 for POST, got 404, URL=http://localhost:8888/org.apache.sling.launchpad.webapp-2.0.0-incubator-SNAPSHOT/WaitForSlingStartup_1204116523320
java.io.IOException: Expected status code 302 for POST, got 404, URL=http://localhost:8888/org.apache.sling.launchpad.webapp-2.0.0-incubator-SNAPSHOT/WaitForSlingStartup_1204116523840
java.io.IOException: Expected status code 302 for POST, got 404, URL=http://localhost:8888/org.apache.sling.launchpad.webapp-2.0.0-incubator-SNAPSHOT/WaitForSlingStartup_1204116524360
java.io.IOException: Expected status code 302 for POST, got 404, URL=http://localhost:8888/org.apache.sling.launchpad.webapp-2.0.0-incubator-SNAPSHOT/WaitForSlingStartup_1204116524880
java.io.IOException: Expected status code 302 for POST, got 404, URL=http://localhost:8888/org.apache.sling.launchpad.webapp-2.0.0-incubator-SNAPSHOT/WaitForSlingStartup_1204116525400
java.io.IOException: Expected status code 302 for POST, got 404, URL=http://localhost:8888/org.apache.sling.launchpad.webapp-2.0.0-incubator-SNAPSHOT/WaitForSlingStartup_1204116525920
java.io.IOException: Expected status code 302 for POST, got 404, URL=http://localhost:8888/org.apache.sling.launchpad.webapp-2.0.0-incubator-SNAPSHOT/WaitForSlingStartup_1204116526440
java.io.IOException: Expected status code 302 for POST, got 404, URL=http://localhost:8888/org.apache.sling.launchpad.webapp-2.0.0-incubator-SNAPSHOT/WaitForSlingStartup_1204116526960
java.io.IOException: Expected status code 302 for POST, got 404, URL=http://localhost:8888/org.apache.sling.launchpad.webapp-2.0.0-incubator-SNAPSHOT/WaitForSlingStartup_1204116527480
java.io.IOException: Expected status code 302 for POST, got 404, URL=http://localhost:8888/org.apache.sling.launchpad.webapp-2.0.0-incubator-SNAPSHOT/WaitForSlingStartup_1204116528000
java.io.IOException: Expected status code 302 for POST, got 404, URL=http://localhost:8888/org.apache.sling.launchpad.webapp-2.0.0-incubator-SNAPSHOT/WaitForSlingStartup_1204116528520
java.io.IOException: Expected status code 302 for POST, got 404, URL=http://localhost:8888/org.apache.sling.launchpad.webapp-2.0.0-incubator-SNAPSHOT/WaitForSlingStartup_1204116529050
java.io.IOException: Expected status code 302 for POST, got 404, URL=http://localhost:8888/org.apache.sling.launchpad.webapp-2.0.0-incubator-SNAPSHOT/WaitForSlingStartup_1204116529570
java.io.IOException: Expected status code 302 for POST, got 404, URL=http://localhost:8888/org.apache.sling.launchpad.webapp-2.0.0-incubator-SNAPSHOT/WaitForSlingStartup_1204116530090
java.io.IOException: Expected status code 302 for POST, got 404, URL=http://localhost:8888/org.apache.sling.launchpad.webapp-2.0.0-incubator-SNAPSHOT/WaitForSlingStartup_1204116530610
java.io.IOException: Expected status code 302 for POST, got 404, URL=http://localhost:8888/org.apache.sling.launchpad.webapp-2.0.0-incubator-SNAPSHOT/WaitForSlingStartup_1204116531140
java.io.IOException: Expected status code 302 for POST, got 404, URL=http://localhost:8888/org.apache.sling.launchpad.webapp-2.0.0-incubator-SNAPSHOT/WaitForSlingStartup_1204116531670
java.io.IOException: Expected status code 302 for POST, got 404, URL=http://localhost:8888/org.apache.sling.launchpad.webapp-2.0.0-incubator-SNAPSHOT/WaitForSlingStartup_1204116532190
java.io.IOException: Expected status code 302 for POST, got 404, URL=http://localhost:8888/org.apache.sling.launchpad.webapp-2.0.0-incubator-SNAPSHOT/WaitForSlingStartup_1204116532710
java.io.IOException: Expected status code 302 for POST, got 404, URL=http://localhost:8888/org.apache.sling.launchpad.webapp-2.0.0-incubator-SNAPSHOT/WaitForSlingStartup_1204116533230
java.io.IOException: Expected status code 302 for POST, got 404, URL=http://localhost:8888/org.apache.sling.launchpad.webapp-2.0.0-incubator-SNAPSHOT/WaitForSlingStartup_1204116533750
java.io.IOException: Expected status code 302 for POST, got 404, URL=http://localhost:8888/org.apache.sling.launchpad.webapp-2.0.0-incubator-SNAPSHOT/WaitForSlingStartup_1204116534280
java.io.IOException: Expected status code 302 for POST, got 404, URL=http://localhost:8888/org.apache.sling.launchpad.webapp-2.0.0-incubator-SNAPSHOT/WaitForSlingStartup_1204116534800
java.io.IOException: Expected status code 302 for POST, got 404, URL=http://localhost:8888/org.apache.sling.launchpad.webapp-2.0.0-incubator-SNAPSHOT/WaitForSlingStartup_1204116535320
java.io.IOException: Expected status code 302 for POST, got 404, URL=http://localhost:8888/org.apache.sling.launchpad.webapp-2.0.0-incubator-SNAPSHOT/WaitForSlingStartup_1204116535843
java.io.IOException: Expected status code 302 for POST, got 404, URL=http://localhost:8888/org.apache.sling.launchpad.webapp-2.0.0-incubator-SNAPSHOT/WaitForSlingStartup_1204116536370
java.io.IOException: Expected status code 302 for POST, got 404, URL=http://localhost:8888/org.apache.sling.launchpad.webapp-2.0.0-incubator-SNAPSHOT/WaitForSlingStartup_1204116536900
java.io.IOException: Expected status code 302 for POST, got 404, URL=http://localhost:8888/org.apache.sling.launchpad.webapp-2.0.0-incubator-SNAPSHOT/WaitForSlingStartup_1204116537420

Tests run: 1, Failures: 1, Errors: 0, Skipped: 0, Time elapsed: 61.323 sec <<< FAILURE!
Running org.apache.sling.launchpad.webapp.integrationtest.StaticContentTest
Tests run: 2, Failures: 2, Errors: 0, Skipped: 0, Time elapsed: 0.014 sec <<< FAILURE!
Running org.apache.sling.launchpad.webapp.integrationtest.ujax.PostServletMoveTest
Tests run: 3, Failures: 3, Errors: 0, Skipped: 0, Time elapsed: 0.015 sec <<< FAILURE!
Running org.apache.sling.launchpad.webapp.integrationtest.GeneratedNodeNameTest
Tests run: 4, Failures: 4, Errors: 0, Skipped: 0, Time elapsed: 0.013 sec <<< FAILURE!
Running org.apache.sling.launchpad.webapp.integrationtest.JsonRenderingTest
Tests run: 8, Failures: 8, Errors: 0, Skipped: 0, Time elapsed: 0.021 sec <<< FAILURE!
Running org.apache.sling.launchpad.webapp.integrationtest.UploadFileTest
Tests run: 3, Failures: 3, Errors: 0, Skipped: 0, Time elapsed: 0.005 sec <<< FAILURE!
Running org.apache.sling.launchpad.webapp.integrationtest.MkdirTest
Tests run: 2, Failures: 2, Errors: 0, Skipped: 0, Time elapsed: 0.011 sec <<< FAILURE!
Running org.apache.sling.launchpad.webapp.integrationtest.ujax.PostServletCreateTest
Tests run: 8, Failures: 8, Errors: 0, Skipped: 0, Time elapsed: 0.044 sec <<< FAILURE!
Running org.apache.sling.launchpad.webapp.integrationtest.ujax.UjaxDateValuesTest
Tests run: 1, Failures: 1, Errors: 0, Skipped: 0, Time elapsed: 0.004 sec <<< FAILURE!
Running org.apache.sling.launchpad.webapp.integrationtest.ujax.UjaxAutoPropertiesTest
Tests run: 3, Failures: 3, Errors: 0, Skipped: 0, Time elapsed: 0.009 sec <<< FAILURE!
Running org.apache.sling.launchpad.webapp.integrationtest.ujax.PostServletUpdateTest
Tests run: 4, Failures: 4, Errors: 0, Skipped: 0, Time elapsed: 0.014 sec <<< FAILURE!
Running org.apache.sling.launchpad.webapp.integrationtest.ValueFromTest
Tests run: 3, Failures: 3, Errors: 0, Skipped: 0, Time elapsed: 0.011 sec <<< FAILURE!
Running org.apache.sling.launchpad.webapp.integrationtest.IncludeTest
Tests run: 5, Failures: 5, Errors: 0, Skipped: 0, Time elapsed: 0.011 sec <<< FAILURE!
Running org.apache.sling.launchpad.webapp.integrationtest.GetWithSuffixTest
Tests run: 4, Failures: 4, Errors: 0, Skipped: 0, Time elapsed: 0.013 sec <<< FAILURE!
Running org.apache.sling.launchpad.webapp.integrationtest.JspScriptingTest
Tests run: 4, Failures: 4, Errors: 0, Skipped: 0, Time elapsed: 0.01 sec <<< FAILURE!
Running org.apache.sling.launchpad.webapp.integrationtest.NodetypeRenderingTest
Tests run: 6, Failures: 6, Errors: 0, Skipped: 0, Time elapsed: 0.019 sec <<< FAILURE!
Running org.apache.sling.launchpad.webapp.integrationtest.InitialContentTest
Tests run: 1, Failures: 1, Errors: 0, Skipped: 0, Time elapsed: 0.004 sec <<< FAILURE!
Running org.apache.sling.launchpad.webapp.integrationtest.SlingResourceTypeRenderingTest
Tests run: 9, Failures: 9, Errors: 0, Skipped: 0, Time elapsed: 0.019 sec <<< FAILURE!
Running org.apache.sling.launchpad.webapp.integrationtest.PropertyRenderingTest
Tests run: 6, Failures: 6, Errors: 0, Skipped: 0, Time elapsed: 0.012 sec <<< FAILURE!
Running org.apache.sling.launchpad.webapp.integrationtest.CreateNodeTest
Tests run: 2, Failures: 2, Errors: 0, Skipped: 0, Time elapsed: 0.006 sec <<< FAILURE!
Running org.apache.sling.launchpad.webapp.integrationtest.ujax.PostServletOrderTest
Tests run: 3, Failures: 3, Errors: 0, Skipped: 0, Time elapsed: 0.007 sec <<< FAILURE!
Running org.apache.sling.launchpad.webapp.integrationtest.RedirectTest
Tests run: 4, Failures: 4, Errors: 0, Skipped: 0, Time elapsed: 0.009 sec <<< FAILURE!
Running org.apache.sling.launchpad.webapp.integrationtest.FileUploadTest
Tests run: 1, Failures: 1, Errors: 0, Skipped: 0, Time elapsed: 0.005 sec <<< FAILURE!
Running org.apache.sling.launchpad.webapp.integrationtest.ujax.PostServletDeleteTest
Tests run: 1, Failures: 1, Errors: 0, Skipped: 0, Time elapsed: 0.006 sec <<< FAILURE!
Running org.apache.sling.launchpad.webapp.integrationtest.ujax.UjaxSessionInfoTest
Tests run: 2, Failures: 2, Errors: 0, Skipped: 0, Time elapsed: 0.005 sec <<< FAILURE!
Running org.apache.sling.launchpad.webapp.integrationtest.ujax.UjaxDefaultValuesTest
Tests run: 4, Failures: 4, Errors: 0, Skipped: 0, Time elapsed: 0.008 sec <<< FAILURE!
Running org.apache.sling.launchpad.webapp.integrationtest.ScriptBuiltinObjectsTest
Tests run: 1, Failures: 1, Errors: 0, Skipped: 0, Time elapsed: 0.005 sec <<< FAILURE!
Running org.apache.sling.launchpad.webapp.integrationtest.SyntheticResourceTest
Tests run: 1, Failures: 1, Errors: 0, Skipped: 0, Time elapsed: 0.001 sec <<< FAILURE!
Running org.apache.sling.launchpad.webapp.integrationtest.StreamServletTest
Tests run: 4, Failures: 4, Errors: 0, Skipped: 0, Time elapsed: 0.028 sec <<< FAILURE!
Running org.apache.sling.launchpad.webapp.integrationtest.PostRedirectTest
Tests run: 6, Failures: 6, Errors: 0, Skipped: 0, Time elapsed: 0.033 sec <<< FAILURE!
Running org.apache.sling.launchpad.webapp.integrationtest.HttpPingTest
Tests run: 2, Failures: 2, Errors: 0, Skipped: 0, Time elapsed: 0.022 sec <<< FAILURE!

Results :

Failed tests: 
  testRecursiveDump(org.apache.sling.launchpad.webapp.integrationtest.JavascriptWrappersTest)
  testWebInfForbidden(org.apache.sling.launchpad.webapp.integrationtest.StaticContentTest)
  testMetaInfForbidden(org.apache.sling.launchpad.webapp.integrationtest.StaticContentTest)
  testMoveNodeAbsolute(org.apache.sling.launchpad.webapp.integrationtest.ujax.PostServletMoveTest)
  testMoveNodeRelative(org.apache.sling.launchpad.webapp.integrationtest.ujax.PostServletMoveTest)
  testMoveNodeNew(org.apache.sling.launchpad.webapp.integrationtest.ujax.PostServletMoveTest)
  testTitle(org.apache.sling.launchpad.webapp.integrationtest.GeneratedNodeNameTest)
  testTitleWithSavePrefix(org.apache.sling.launchpad.webapp.integrationtest.GeneratedNodeNameTest)
  testCollision(org.apache.sling.launchpad.webapp.integrationtest.GeneratedNodeNameTest)
  testNoParams(org.apache.sling.launchpad.webapp.integrationtest.GeneratedNodeNameTest)
  testAssertJavascript(org.apache.sling.launchpad.webapp.integrationtest.JsonRenderingTest)
  testNonRecursive(org.apache.sling.launchpad.webapp.integrationtest.JsonRenderingTest)
  testRecursiveOneLevel(org.apache.sling.launchpad.webapp.integrationtest.JsonRenderingTest)
  testRecursiveZeroLevels(org.apache.sling.launchpad.webapp.integrationtest.JsonRenderingTest)
  testRecursiveInfinity(org.apache.sling.launchpad.webapp.integrationtest.JsonRenderingTest)
  testInvalidLevel(org.apache.sling.launchpad.webapp.integrationtest.JsonRenderingTest)
  testEscapedStrings(org.apache.sling.launchpad.webapp.integrationtest.JsonRenderingTest)
  testAccentedStrings(org.apache.sling.launchpad.webapp.integrationtest.JsonRenderingTest)
  testDistinctResource(org.apache.sling.launchpad.webapp.integrationtest.UploadFileTest)
  testDistinctResourceWithType(org.apache.sling.launchpad.webapp.integrationtest.UploadFileTest)
  testDistinctFile(org.apache.sling.launchpad.webapp.integrationtest.UploadFileTest)
  testMkdir(org.apache.sling.launchpad.webapp.integrationtest.MkdirTest)
  testMkdirDeep(org.apache.sling.launchpad.webapp.integrationtest.MkdirTest)
  testCreateNode(org.apache.sling.launchpad.webapp.integrationtest.ujax.PostServletCreateTest)
  testPostPathIsUnique(org.apache.sling.launchpad.webapp.integrationtest.ujax.PostServletCreateTest)
  testCreateNodeAtSpecificUrl(org.apache.sling.launchpad.webapp.integrationtest.ujax.PostServletCreateTest)
  testCreateNodeAtDeepUrl(org.apache.sling.launchpad.webapp.integrationtest.ujax.PostServletCreateTest)
  testCreateWithData(org.apache.sling.launchpad.webapp.integrationtest.ujax.PostServletCreateTest)
  testCreateSubnodeProperty(org.apache.sling.launchpad.webapp.integrationtest.ujax.PostServletCreateTest)
  testDefaultSavePrefix(org.apache.sling.launchpad.webapp.integrationtest.ujax.PostServletCreateTest)
  testCustomSavePrefix(org.apache.sling.launchpad.webapp.integrationtest.ujax.PostServletCreateTest)
  testDateValues(org.apache.sling.launchpad.webapp.integrationtest.ujax.UjaxDateValuesTest)
  testPostPathIsUnique(org.apache.sling.launchpad.webapp.integrationtest.ujax.UjaxAutoPropertiesTest)
  testCreatedAndModified(org.apache.sling.launchpad.webapp.integrationtest.ujax.UjaxAutoPropertiesTest)
  testWithSpecificValues(org.apache.sling.launchpad.webapp.integrationtest.ujax.UjaxAutoPropertiesTest)
  testPostPathIsUnique(org.apache.sling.launchpad.webapp.integrationtest.ujax.PostServletUpdateTest)
  testUpdateWithChanges(org.apache.sling.launchpad.webapp.integrationtest.ujax.PostServletUpdateTest)
  testUpdateNoChanges(org.apache.sling.launchpad.webapp.integrationtest.ujax.PostServletUpdateTest)
  testUpdateSomeChanges(org.apache.sling.launchpad.webapp.integrationtest.ujax.PostServletUpdateTest)
  testWithoutValueFrom(org.apache.sling.launchpad.webapp.integrationtest.ValueFromTest)
  testWithValueFrom(org.apache.sling.launchpad.webapp.integrationtest.ValueFromTest)
  testWithValueFromAndMissingField(org.apache.sling.launchpad.webapp.integrationtest.ValueFromTest)
  testWithoutInclude(org.apache.sling.launchpad.webapp.integrationtest.IncludeTest)
  testWithInclude(org.apache.sling.launchpad.webapp.integrationtest.IncludeTest)
  testWithIncludeAndExtension(org.apache.sling.launchpad.webapp.integrationtest.IncludeTest)
  testInfiniteLoopDetection(org.apache.sling.launchpad.webapp.integrationtest.IncludeTest)
  testForcedResourceType(org.apache.sling.launchpad.webapp.integrationtest.IncludeTest)
  testWithExactUrl(org.apache.sling.launchpad.webapp.integrationtest.GetWithSuffixTest)
  testGETScript(org.apache.sling.launchpad.webapp.integrationtest.GetWithSuffixTest)
  testWithExtraPathA(org.apache.sling.launchpad.webapp.integrationtest.GetWithSuffixTest)
  testWithExtraPathB(org.apache.sling.launchpad.webapp.integrationtest.GetWithSuffixTest)
  testRtNoScript(org.apache.sling.launchpad.webapp.integrationtest.JspScriptingTest)
  testUnstructuredNoScript(org.apache.sling.launchpad.webapp.integrationtest.JspScriptingTest)
  testRtJsp(org.apache.sling.launchpad.webapp.integrationtest.JspScriptingTest)
  testUnstructuredJsp(org.apache.sling.launchpad.webapp.integrationtest.JspScriptingTest)
  testWithoutScriptTxt(org.apache.sling.launchpad.webapp.integrationtest.NodetypeRenderingTest)
  testWithoutScriptHtml(org.apache.sling.launchpad.webapp.integrationtest.NodetypeRenderingTest)
  testMiniScriptHtml(org.apache.sling.launchpad.webapp.integrationtest.NodetypeRenderingTest)
  testEspHtml(org.apache.sling.launchpad.webapp.integrationtest.NodetypeRenderingTest)
  testEspXml(org.apache.sling.launchpad.webapp.integrationtest.NodetypeRenderingTest)
  testEspPlain(org.apache.sling.launchpad.webapp.integrationtest.NodetypeRenderingTest)
  testIndex(org.apache.sling.launchpad.webapp.integrationtest.InitialContentTest)
  testWithoutScriptTxt(org.apache.sling.launchpad.webapp.integrationtest.SlingResourceTypeRenderingTest)
  testWithoutScriptHtml(org.apache.sling.launchpad.webapp.integrationtest.SlingResourceTypeRenderingTest)
  testEspHtml(org.apache.sling.launchpad.webapp.integrationtest.SlingResourceTypeRenderingTest)
  testEspXml(org.apache.sling.launchpad.webapp.integrationtest.SlingResourceTypeRenderingTest)
  testEspPlain(org.apache.sling.launchpad.webapp.integrationtest.SlingResourceTypeRenderingTest)
  testEspJavaCode(org.apache.sling.launchpad.webapp.integrationtest.SlingResourceTypeRenderingTest)
  testEspHtmlInAppsFolder(org.apache.sling.launchpad.webapp.integrationtest.SlingResourceTypeRenderingTest)
  testEspHtmlWithSelectors(org.apache.sling.launchpad.webapp.integrationtest.SlingResourceTypeRenderingTest)
  testEspJs(org.apache.sling.launchpad.webapp.integrationtest.SlingResourceTypeRenderingTest)
  testNodeAccess(org.apache.sling.launchpad.webapp.integrationtest.PropertyRenderingTest)
  testTextJson(org.apache.sling.launchpad.webapp.integrationtest.PropertyRenderingTest)
  testTextHtml(org.apache.sling.launchpad.webapp.integrationtest.PropertyRenderingTest)
  testTextTxt(org.apache.sling.launchpad.webapp.integrationtest.PropertyRenderingTest)
  testTextNoExt(org.apache.sling.launchpad.webapp.integrationtest.PropertyRenderingTest)
  testResourceTypeNoExt(org.apache.sling.launchpad.webapp.integrationtest.PropertyRenderingTest)
  testCreateNode(org.apache.sling.launchpad.webapp.integrationtest.CreateNodeTest)
  testCreateNodeMultipart(org.apache.sling.launchpad.webapp.integrationtest.CreateNodeTest)
  testPostPathIsUnique(org.apache.sling.launchpad.webapp.integrationtest.ujax.PostServletOrderTest)
  testStandardOrder(org.apache.sling.launchpad.webapp.integrationtest.ujax.PostServletOrderTest)
  testZeroOrder(org.apache.sling.launchpad.webapp.integrationtest.ujax.PostServletOrderTest)
  testRedirect302(org.apache.sling.launchpad.webapp.integrationtest.RedirectTest)
  testRedirect404(org.apache.sling.launchpad.webapp.integrationtest.RedirectTest)
  testRedirectJson(org.apache.sling.launchpad.webapp.integrationtest.RedirectTest)
  testRedirectJson2(org.apache.sling.launchpad.webapp.integrationtest.RedirectTest)
  testUploadAndDelete(org.apache.sling.launchpad.webapp.integrationtest.FileUploadTest)
  testDelete(org.apache.sling.launchpad.webapp.integrationtest.ujax.PostServletDeleteTest)
  testSessionInfo(org.apache.sling.launchpad.webapp.integrationtest.ujax.UjaxSessionInfoTest)
  testNonexistentUjaxUrl(org.apache.sling.launchpad.webapp.integrationtest.ujax.UjaxSessionInfoTest)
  testDefaultBehaviour(org.apache.sling.launchpad.webapp.integrationtest.ujax.UjaxDefaultValuesTest)
  testWithSpecificDefault(org.apache.sling.launchpad.webapp.integrationtest.ujax.UjaxDefaultValuesTest)
  testWithIgnore(org.apache.sling.launchpad.webapp.integrationtest.ujax.UjaxDefaultValuesTest)
  testWithNull(org.apache.sling.launchpad.webapp.integrationtest.ujax.UjaxDefaultValuesTest)
  testEspBuiltinObjects(org.apache.sling.launchpad.webapp.integrationtest.ScriptBuiltinObjectsTest)
  testNoSyntheticResourceTest(org.apache.sling.launchpad.webapp.integrationtest.SyntheticResourceTest)
  testPlainTextFile(org.apache.sling.launchpad.webapp.integrationtest.StreamServletTest)
  testHtmlFile(org.apache.sling.launchpad.webapp.integrationtest.StreamServletTest)
  testJavascriptFile(org.apache.sling.launchpad.webapp.integrationtest.StreamServletTest)
  testJsonFile(org.apache.sling.launchpad.webapp.integrationtest.StreamServletTest)
  testForcedRedirect(org.apache.sling.launchpad.webapp.integrationtest.PostRedirectTest)
  testDefaultRedirect(org.apache.sling.launchpad.webapp.integrationtest.PostRedirectTest)
  testMagicStarRedirect(org.apache.sling.launchpad.webapp.integrationtest.PostRedirectTest)
  testMagicStarRedirectPrefix(org.apache.sling.launchpad.webapp.integrationtest.PostRedirectTest)
  testMagicStarRedirectSuffix(org.apache.sling.launchpad.webapp.integrationtest.PostRedirectTest)
  testMagicStarRedirectPrefixSuffix(org.apache.sling.launchpad.webapp.integrationtest.PostRedirectTest)
  testWebServerRoot(org.apache.sling.launchpad.webapp.integrationtest.HttpPingTest)
  test404(org.apache.sling.launchpad.webapp.integrationtest.HttpPingTest)

Tests run: 108, Failures: 108, Errors: 0, Skipped: 0

[INFO] ------------------------------------------------------------------------
[ERROR] BUILD FAILURE
[INFO] ------------------------------------------------------------------------
[INFO] There are test failures.
[INFO] ------------------------------------------------------------------------
[INFO] For more information, run Maven with the -e switch
[INFO] ------------------------------------------------------------------------
[INFO] Total time: 2 minutes 51 seconds
[INFO] Finished at: Wed Feb 27 04:48:58 PST 2008
[INFO] Final Memory: 23M/46M
[INFO] ------------------------------------------------------------------------
2008-02-27 04:48:59.197::INFO:  Shutdown hook executing
2008-02-27 04:49:04.283::INFO:  Shutdown hook complete

****************************************************************************



Mime
View raw message