incubator-sling-commits mailing list archives

Site index · List index
Message view « Date » · « Thread »
Top « Date » · « Thread »
From Continuum VMBuild Server <contin...@apache.org>
Subject [continuum] BUILD FAILURE: Sling - Resource Loading and Mapping Management
Date Fri, 22 Feb 2008 10:43:50 GMT
Online report : http://vmbuild.apache.org/continuum/buildResult.action?buildId=53899&projectId=298

Build statistics:
  State: Failed
  Previous State: Ok
  Started at: Fri 22 Feb 2008 02:42:43 -0800
  Finished at: Fri 22 Feb 2008 02:43:39 -0800
  Total time: 55s
  Build Trigger: Schedule
  Build Number: 64
  Exit code: 1
  Building machine hostname: vmbuild.apache.org
  Operating system : Linux(unknown)
  Java Home version : 
          java version "1.6.0"
          Java(TM) SE Runtime Environment (build 1.6.0-b105)
          Java HotSpot(TM) Client VM (build 1.6.0-b105, mixed mode, sharing)
        
  Builder version :
          Maven version: 2.0.7
          Java version: 1.6.0
          OS name: "linux" version: "2.6.20-16-server" arch: "i386"
    
****************************************************************************
SCM Changes:
****************************************************************************
Changed: fmeschbe @ Fri 22 Feb 2008 01:28:40 -0800
Comment: SLING-269 Allow requesting the root node without extension
Files changed:
  /incubator/sling/trunk/jcr/resource/src/main/java/org/apache/sling/jcr/resource/internal/helper/ResourcePathIterator.java
( 630127 )

****************************************************************************
Dependencies Changes:
****************************************************************************
No dependencies changed


****************************************************************************
Build Defintion:
****************************************************************************
POM filename: pom.xml
Goals: clean install   
Arguments: --batch-mode --non-recursive
Build Fresh: false
Always Build: false
Default Build Definition: true
Schedule: DEFAULT_SCHEDULE
Description: 


****************************************************************************
Test Summary:
****************************************************************************
Tests: 54
Failures: 3
Total time: 17717

****************************************************************************
Output:
****************************************************************************
[INFO] Scanning for projects...
WAGON_VERSION: 1.0-beta-1
[INFO] ----------------------------------------------------------------------------
[INFO] Building Sling - Resource Loading and Mapping Management
[INFO]    task-segment: [clean, install]
[INFO] ----------------------------------------------------------------------------
[INFO] snapshot org.apache.sling:maven-jcrocm-plugin:2.0.0-incubator-SNAPSHOT: checking for
updates from apache Snapshots
[INFO] snapshot org.apache.sling:maven-jcrocm-plugin:2.0.0-incubator-SNAPSHOT: checking for
updates from apache.snapshots
[INFO] [clean:clean]
[INFO] Deleting directory /home/continuum/data/working-directory/298/target
[INFO] Deleting directory /home/continuum/data/working-directory/298/target/classes
[INFO] Deleting directory /home/continuum/data/working-directory/298/target/test-classes
[INFO] Deleting directory /home/continuum/data/working-directory/298/target/site
[INFO] snapshot org.apache.sling:org.apache.sling.api:2.0.0-incubator-SNAPSHOT: checking for
updates from apache.snapshots
[INFO] snapshot org.apache.sling:org.apache.sling.commons.mime:2.0.0-incubator-SNAPSHOT: checking
for updates from apache.snapshots
[INFO] snapshot org.apache.sling:org.apache.sling.commons.json:2.0.0-incubator-SNAPSHOT: checking
for updates from apache.snapshots
[INFO] snapshot org.apache.sling:org.apache.sling.osgi.commons:2.0.0-incubator-SNAPSHOT: checking
for updates from apache.snapshots
[INFO] snapshot org.apache.sling:org.apache.sling.jcr.api:2.0.0-incubator-SNAPSHOT: checking
for updates from apache.snapshots
[INFO] snapshot org.apache.sling:org.apache.sling.adapter:2.0.0-incubator-SNAPSHOT: checking
for updates from apache.snapshots
[INFO] snapshot org.apache.sling:org.apache.sling.commons.testing:2.0.0-incubator-SNAPSHOT:
checking for updates from apache.snapshots
[INFO] [enforcer:enforce {execution: enforce-java}]
[INFO] [jcrocm:ocm {execution: generate-JCR-OCM-descriptor}]
[INFO] No Jackrabbit OCM Descriptors found in project
[INFO] [resources:resources]
[INFO] Using default encoding to copy filtered resources.
[INFO] [compiler:compile]
[INFO] Compiling 29 source files to /home/continuum/data/working-directory/298/target/classes
[INFO] [scr:scr {execution: generate-scr-scrdescriptor}]
[INFO] Generating 2 MetaType Descriptors to /home/continuum/data/working-directory/298/target/scr-plugin-generated/OSGI-INF/metatype/metatype.xml
[INFO] Generating 2 Service Component Descriptors to /home/continuum/data/working-directory/298/target/scr-plugin-generated/OSGI-INF/serviceComponents.xml
[INFO] [resources:testResources]
[INFO] Using default encoding to copy filtered resources.
[INFO] [compiler:testCompile]
[INFO] Compiling 7 source files to /home/continuum/data/working-directory/298/target/test-classes
[INFO] [surefire:test]
[INFO] Surefire report directory: /home/continuum/data/working-directory/298/target/surefire-reports

-------------------------------------------------------
 T E S T S
-------------------------------------------------------
Running org.apache.sling.jcr.resource.internal.helper.ResourcePathIteratorTest
Tests run: 15, Failures: 3, Errors: 0, Skipped: 0, Time elapsed: 0.083 sec <<< FAILURE!
Running org.apache.sling.jcr.resource.internal.helper.JcrNodeResourceIteratorTest
Tests run: 3, Failures: 0, Errors: 0, Skipped: 0, Time elapsed: 0.093 sec
Running org.apache.sling.jcr.resource.internal.helper.jcr.JcrNodeResourceTest
1005 [main] INFO org.apache.jackrabbit.core.RepositoryImpl - Starting repository...
1092 [main] INFO org.apache.jackrabbit.core.fs.local.LocalFileSystem - LocalFileSystem initialized
at path target/repository/repository
1438 [main] INFO org.apache.jackrabbit.core.nodetype.NodeTypeRegistry - no custom node type
definitions found
1440 [main] INFO org.apache.jackrabbit.core.fs.local.LocalFileSystem - LocalFileSystem initialized
at path target/repository/version
8415 [main] INFO org.apache.jackrabbit.core.persistence.db.DatabasePersistenceManager - Database:
Apache Derby / 10.2.1.6 - (452058)
8415 [main] INFO org.apache.jackrabbit.core.persistence.db.DatabasePersistenceManager - Driver:
Apache Derby Embedded JDBC Driver / 10.2.1.6 - (452058)
10382 [main] INFO org.apache.jackrabbit.core.fs.local.LocalFileSystem - LocalFileSystem initialized
at path target/repository/version/blobs
10502 [main] INFO org.apache.jackrabbit.core.RepositoryImpl - initializing workspace 'default'...
10503 [main] INFO org.apache.jackrabbit.core.fs.local.LocalFileSystem - LocalFileSystem initialized
at path target/repository/workspaces/default
13964 [main] INFO org.apache.jackrabbit.core.persistence.db.DatabasePersistenceManager - Database:
Apache Derby / 10.2.1.6 - (452058)
13964 [main] INFO org.apache.jackrabbit.core.persistence.db.DatabasePersistenceManager - Driver:
Apache Derby Embedded JDBC Driver / 10.2.1.6 - (452058)
14509 [main] INFO org.apache.jackrabbit.core.fs.local.LocalFileSystem - LocalFileSystem initialized
at path target/repository/workspaces/default/blobs
14600 [main] INFO org.apache.jackrabbit.core.RepositoryImpl - workspace 'default' initialized
15231 [main] INFO org.apache.jackrabbit.core.fs.local.LocalFileSystem - LocalFileSystem initialized
at path target/repository/repository/index
16761 [main] INFO org.apache.jackrabbit.core.query.lucene.SearchIndex - Index initialized:
target/repository/repository/index Version: 2
16765 [main] INFO org.apache.jackrabbit.core.fs.local.LocalFileSystem - LocalFileSystem initialized
at path target/repository/workspaces/default/index
16776 [main] INFO org.apache.jackrabbit.core.query.lucene.SearchIndex - Index initialized:
target/repository/workspaces/default/index Version: 2
16776 [main] INFO org.apache.jackrabbit.core.RepositoryImpl - Repository started
Tests run: 4, Failures: 0, Errors: 0, Skipped: 0, Time elapsed: 17.25 sec
Running org.apache.sling.jcr.resource.internal.JcrResourceResolverTest
17428 [main] INFO org.apache.sling.jcr.resource.internal.JcrResourceResolver - Could not resolve
URL /test1203677017871/missing to a Resource
17431 [main] INFO org.apache.sling.jcr.resource.internal.JcrResourceResolver - Could not resolve
URL /test12036770178711203677017888 to a Resource
17483 [main] INFO org.apache.sling.jcr.resource.internal.JcrResourceResolver - Could not resolve
URL /test1203677017910/nothing to a Resource
17483 [main] INFO org.apache.sling.jcr.resource.internal.JcrResourceResolver - Could not resolve
URL /test1203677017910/nothing to a Resource
Tests run: 4, Failures: 0, Errors: 0, Skipped: 0, Time elapsed: 0.257 sec
Running org.apache.sling.jcr.resource.internal.helper.ResourceProviderEntryTest
Tests run: 5, Failures: 0, Errors: 0, Skipped: 0, Time elapsed: 0.014 sec
Running org.apache.sling.jcr.resource.internal.loader.JsonReaderTest
Tests run: 19, Failures: 0, Errors: 0, Skipped: 0, Time elapsed: 0.067 sec
Running org.apache.sling.jcr.resource.JcrResourceUtilTest
17679 [main] ERROR org.apache.sling.jcr.resource.JcrResourceUtil - normalize: Path '/..' cannot
be resolved
17679 [main] ERROR org.apache.sling.jcr.resource.JcrResourceUtil - normalize: Path '/..' cannot
be resolved
17679 [main] ERROR org.apache.sling.jcr.resource.JcrResourceUtil - normalize: Path '/a/b/../../..'
cannot be resolved
17679 [main] ERROR org.apache.sling.jcr.resource.JcrResourceUtil - normalize: Path '/..' cannot
be resolved
17679 [main] ERROR org.apache.sling.jcr.resource.JcrResourceUtil - normalize: Path '/..' cannot
be resolved
17679 [main] ERROR org.apache.sling.jcr.resource.JcrResourceUtil - normalize: Path '/az/bz/../../..'
cannot be resolved
17679 [main] ERROR org.apache.sling.jcr.resource.JcrResourceUtil - normalize: Path '/a/b/../../../c'
cannot be resolved
17679 [main] ERROR org.apache.sling.jcr.resource.JcrResourceUtil - normalize: Path '/az/bz/../../../cz'
cannot be resolved
Tests run: 4, Failures: 0, Errors: 0, Skipped: 0, Time elapsed: 0.016 sec

Results :

Failed tests: 
  testEmpty(org.apache.sling.jcr.resource.internal.helper.ResourcePathIteratorTest)
  testRoot(org.apache.sling.jcr.resource.internal.helper.ResourcePathIteratorTest)
  testNull(org.apache.sling.jcr.resource.internal.helper.ResourcePathIteratorTest)

Tests run: 54, Failures: 3, Errors: 0, Skipped: 0

17683 [main] ERROR org.apache.sling.jcr.resource.JcrResourceUtil - normalize: Path 'a/b/../../../c'
cannot be resolved
17683 [main] ERROR org.apache.sling.jcr.resource.JcrResourceUtil - normalize: Not modifying
empty path
17684 [main] ERROR org.apache.sling.jcr.resource.JcrResourceUtil - normalize: Path '/..' cannot
be resolved
17693 [Thread-6] INFO org.apache.jackrabbit.core.RepositoryImpl - Shutting down repository...
17749 [IndexMerger] INFO org.apache.jackrabbit.core.query.lucene.IndexMerger - IndexMerger
terminated
17962 [Thread-6] INFO org.apache.jackrabbit.core.query.lucene.SearchIndex - Index closed:
target/repository/repository/index
17963 [Thread-6] INFO org.apache.jackrabbit.core.RepositoryImpl - shutting down workspace
'default'...
17963 [Thread-6] INFO org.apache.jackrabbit.core.observation.ObservationDispatcher - Notification
of EventListeners stopped.
17964 [IndexMerger] INFO org.apache.jackrabbit.core.query.lucene.IndexMerger - IndexMerger
terminated
17983 [Thread-6] INFO org.apache.jackrabbit.core.query.lucene.SearchIndex - Index closed:
target/repository/workspaces/default/index
18362 [Thread-6] INFO org.apache.jackrabbit.core.persistence.db.DerbyPersistenceManager -
Database 'target/repository/workspaces/default/db' shutdown.
18363 [Thread-6] INFO org.apache.jackrabbit.core.RepositoryImpl - workspace 'default' has
been shutdown
18474 [Thread-6] INFO org.apache.jackrabbit.core.persistence.db.DerbyPersistenceManager -
Database 'target/repository/version/db' shutdown.
18475 [Thread-6] INFO org.apache.jackrabbit.core.RepositoryImpl - Repository has been shutdown
[INFO] ------------------------------------------------------------------------
[ERROR] BUILD FAILURE
[INFO] ------------------------------------------------------------------------
[INFO] There are test failures.
[INFO] ------------------------------------------------------------------------
[INFO] For more information, run Maven with the -e switch
[INFO] ------------------------------------------------------------------------
[INFO] Total time: 45 seconds
[INFO] Finished at: Fri Feb 22 02:43:39 PST 2008
[INFO] Final Memory: 14M/30M
[INFO] ------------------------------------------------------------------------

****************************************************************************



Mime
View raw message