incubator-sling-commits mailing list archives

Site index · List index
Message view « Date » · « Thread »
Top « Date » · « Thread »
From Continuum VMBuild Server <contin...@apache.org>
Subject [continuum] BUILD FAILURE: Sling Launchpad Web Application
Date Mon, 18 Feb 2008 13:53:04 GMT
Online report : http://vmbuild.apache.org/continuum/buildResult.action?buildId=52347&projectId=349

Build statistics:
  State: Failed
  Previous State: Failed
  Started at: Mon 18 Feb 2008 05:50:34 -0800
  Finished at: Mon 18 Feb 2008 05:52:52 -0800
  Total time: 2m 18s
  Build Trigger: Schedule
  Build Number: 4
  Exit code: 1
  Building machine hostname: vmbuild.apache.org
  Operating system : Linux(unknown)
  Java Home version : 
          java version "1.6.0"
          Java(TM) SE Runtime Environment (build 1.6.0-b105)
          Java HotSpot(TM) Client VM (build 1.6.0-b105, mixed mode, sharing)
        
  Builder version :
          Maven version: 2.0.7
          Java version: 1.6.0
          OS name: "linux" version: "2.6.20-16-server" arch: "i386"
    
****************************************************************************
SCM Changes:
****************************************************************************
No files changed

****************************************************************************
Dependencies Changes:
****************************************************************************
org.apache.sling:org.apache.sling.scripting.javascript:2.0.0-incubator-SNAPSHOT


****************************************************************************
Build Defintion:
****************************************************************************
POM filename: pom.xml
Goals: clean install   
Arguments: --batch-mode --non-recursive
Build Fresh: false
Always Build: false
Default Build Definition: true
Schedule: DEFAULT_SCHEDULE
Description: 


****************************************************************************
Test Summary:
****************************************************************************
Tests: 103
Failures: 103
Total time: 11731

****************************************************************************
Output:
****************************************************************************
[INFO] Scanning for projects...
WAGON_VERSION: 1.0-beta-1
[INFO] ----------------------------------------------------------------------------
[INFO] Building Sling Launchpad Web Application
[INFO]    task-segment: [clean, install]
[INFO] ----------------------------------------------------------------------------
[INFO] [clean:clean]
[INFO] Deleting directory /home/continuum/data/working-directory/349/target
[INFO] Deleting directory /home/continuum/data/working-directory/349/target/classes
[INFO] Deleting directory /home/continuum/data/working-directory/349/target/test-classes
[INFO] Deleting directory /home/continuum/data/working-directory/349/target/site
[INFO] [enforcer:enforce {execution: enforce-java}]
[INFO] [dependency:unpack-dependencies {execution: unpack-dependencies}]
[INFO] Expanding: /home/continuum/.m2/repository/org/apache/sling/org.apache.sling.launcher.webapp/2.0.0-incubator-SNAPSHOT/org.apache.sling.launcher.webapp-2.0.0-incubator-SNAPSHOT.war
into /home/continuum/data/working-directory/349/target/launcher-webapp
[INFO] Expanding: /home/continuum/.m2/repository/org/eclipse/equinox/http/servlet/1.0.0-v20070606/servlet-1.0.0-v20070606.jar
into /home/continuum/data/working-directory/349/target/launcher-webapp
[INFO] [dependency:copy-dependencies {execution: copy-dependencies}]
[INFO] Copying org.apache.felix.framework-1.0.3.jar to /home/continuum/data/working-directory/349/target/org.apache.sling.launchpad.webapp-2.0.0-incubator-SNAPSHOT/WEB-INF/resources/bundles/org.apache.felix.framework-1.0.3.jar
[INFO] Copying org.osgi.compendium-1.0.0.jar to /home/continuum/data/working-directory/349/target/org.apache.sling.launchpad.webapp-2.0.0-incubator-SNAPSHOT/WEB-INF/resources/bundles/org.osgi.compendium-1.0.0.jar
[INFO] Copying org.osgi.core-1.0.0.jar to /home/continuum/data/working-directory/349/target/org.apache.sling.launchpad.webapp-2.0.0-incubator-SNAPSHOT/WEB-INF/resources/bundles/org.osgi.core-1.0.0.jar
[INFO] Copying org.apache.felix.commons.cglib-full-2.0.2-0001-SNAPSHOT.jar to /home/continuum/data/working-directory/349/target/org.apache.sling.launchpad.webapp-2.0.0-incubator-SNAPSHOT/WEB-INF/resources/bundles/org.apache.felix.commons.cglib-full-2.0.2-0001-SNAPSHOT.jar
[INFO] Copying org.apache.felix.commons.commons-beanutils-1.7.0-0001-SNAPSHOT.jar to /home/continuum/data/working-directory/349/target/org.apache.sling.launchpad.webapp-2.0.0-incubator-SNAPSHOT/WEB-INF/resources/bundles/org.apache.felix.commons.commons-beanutils-1.7.0-0001-SNAPSHOT.jar
[INFO] Copying org.apache.felix.commons.commons-codec-1.3.0-0001-SNAPSHOT.jar to /home/continuum/data/working-directory/349/target/org.apache.sling.launchpad.webapp-2.0.0-incubator-SNAPSHOT/WEB-INF/resources/bundles/org.apache.felix.commons.commons-codec-1.3.0-0001-SNAPSHOT.jar
[INFO] Copying org.apache.felix.commons.commons-collections-3.2.0-0001-SNAPSHOT.jar to /home/continuum/data/working-directory/349/target/org.apache.sling.launchpad.webapp-2.0.0-incubator-SNAPSHOT/WEB-INF/resources/bundles/org.apache.felix.commons.commons-collections-3.2.0-0001-SNAPSHOT.jar
[INFO] Copying org.apache.felix.commons.commons-el-1.0.0-0001-SNAPSHOT.jar to /home/continuum/data/working-directory/349/target/org.apache.sling.launchpad.webapp-2.0.0-incubator-SNAPSHOT/WEB-INF/resources/bundles/org.apache.felix.commons.commons-el-1.0.0-0001-SNAPSHOT.jar
[INFO] Copying org.apache.felix.commons.commons-fileupload-1.1.1-0001-SNAPSHOT.jar to /home/continuum/data/working-directory/349/target/org.apache.sling.launchpad.webapp-2.0.0-incubator-SNAPSHOT/WEB-INF/resources/bundles/org.apache.felix.commons.commons-fileupload-1.1.1-0001-SNAPSHOT.jar
[INFO] Copying org.apache.felix.commons.commons-httpclient-3.0.1-0001-SNAPSHOT.jar to /home/continuum/data/working-directory/349/target/org.apache.sling.launchpad.webapp-2.0.0-incubator-SNAPSHOT/WEB-INF/resources/bundles/org.apache.felix.commons.commons-httpclient-3.0.1-0001-SNAPSHOT.jar
[INFO] Copying org.apache.felix.commons.commons-io-1.3.2-0002-SNAPSHOT.jar to /home/continuum/data/working-directory/349/target/org.apache.sling.launchpad.webapp-2.0.0-incubator-SNAPSHOT/WEB-INF/resources/bundles/org.apache.felix.commons.commons-io-1.3.2-0002-SNAPSHOT.jar
[INFO] Copying org.apache.felix.commons.jsp-api-2.0.0-0001-SNAPSHOT.jar to /home/continuum/data/working-directory/349/target/org.apache.sling.launchpad.webapp-2.0.0-incubator-SNAPSHOT/WEB-INF/resources/bundles/org.apache.felix.commons.jsp-api-2.0.0-0001-SNAPSHOT.jar
[INFO] Copying org.apache.felix.commons.xml-apis-1.3.4-0002-SNAPSHOT.jar to /home/continuum/data/working-directory/349/target/org.apache.sling.launchpad.webapp-2.0.0-incubator-SNAPSHOT/WEB-INF/resources/bundles/org.apache.felix.commons.xml-apis-1.3.4-0002-SNAPSHOT.jar
[INFO] Copying jackrabbit-jcr-commons-1.5-SNAPSHOT.jar to /home/continuum/data/working-directory/349/target/org.apache.sling.launchpad.webapp-2.0.0-incubator-SNAPSHOT/WEB-INF/resources/bundles/jackrabbit-jcr-commons-1.5-SNAPSHOT.jar
[INFO] Copying org.apache.sling.adapter-2.0.0-incubator-SNAPSHOT.jar to /home/continuum/data/working-directory/349/target/org.apache.sling.launchpad.webapp-2.0.0-incubator-SNAPSHOT/WEB-INF/resources/bundles/org.apache.sling.adapter-2.0.0-incubator-SNAPSHOT.jar
[INFO] Copying org.apache.sling.api-2.0.0-incubator-SNAPSHOT.jar to /home/continuum/data/working-directory/349/target/org.apache.sling.launchpad.webapp-2.0.0-incubator-SNAPSHOT/WEB-INF/resources/bundles/org.apache.sling.api-2.0.0-incubator-SNAPSHOT.jar
[INFO] Copying org.apache.sling.commons.json-2.0.0-incubator-SNAPSHOT.jar to /home/continuum/data/working-directory/349/target/org.apache.sling.launchpad.webapp-2.0.0-incubator-SNAPSHOT/WEB-INF/resources/bundles/org.apache.sling.commons.json-2.0.0-incubator-SNAPSHOT.jar
[INFO] Copying org.apache.sling.commons.mime-2.0.0-incubator-SNAPSHOT.jar to /home/continuum/data/working-directory/349/target/org.apache.sling.launchpad.webapp-2.0.0-incubator-SNAPSHOT/WEB-INF/resources/bundles/org.apache.sling.commons.mime-2.0.0-incubator-SNAPSHOT.jar
[INFO] Copying org.apache.sling.core-2.0.0-incubator-SNAPSHOT.jar to /home/continuum/data/working-directory/349/target/org.apache.sling.launchpad.webapp-2.0.0-incubator-SNAPSHOT/WEB-INF/resources/bundles/org.apache.sling.core-2.0.0-incubator-SNAPSHOT.jar
[INFO] Copying org.apache.sling.jcr.api-2.0.0-incubator-SNAPSHOT.jar to /home/continuum/data/working-directory/349/target/org.apache.sling.launchpad.webapp-2.0.0-incubator-SNAPSHOT/WEB-INF/resources/bundles/org.apache.sling.jcr.api-2.0.0-incubator-SNAPSHOT.jar
[INFO] Copying org.apache.sling.jcr.classloader-2.0.0-incubator-SNAPSHOT.jar to /home/continuum/data/working-directory/349/target/org.apache.sling.launchpad.webapp-2.0.0-incubator-SNAPSHOT/WEB-INF/resources/bundles/org.apache.sling.jcr.classloader-2.0.0-incubator-SNAPSHOT.jar
[INFO] Copying org.apache.sling.jcr.jackrabbit.server-2.0.0-incubator-SNAPSHOT.jar to /home/continuum/data/working-directory/349/target/org.apache.sling.launchpad.webapp-2.0.0-incubator-SNAPSHOT/WEB-INF/resources/bundles/org.apache.sling.jcr.jackrabbit.server-2.0.0-incubator-SNAPSHOT.jar
[INFO] Copying org.apache.sling.jcr.ocm-2.0.0-incubator-SNAPSHOT.jar to /home/continuum/data/working-directory/349/target/org.apache.sling.launchpad.webapp-2.0.0-incubator-SNAPSHOT/WEB-INF/resources/bundles/org.apache.sling.jcr.ocm-2.0.0-incubator-SNAPSHOT.jar
[INFO] Copying org.apache.sling.jcr.resource-2.0.0-incubator-SNAPSHOT.jar to /home/continuum/data/working-directory/349/target/org.apache.sling.launchpad.webapp-2.0.0-incubator-SNAPSHOT/WEB-INF/resources/bundles/org.apache.sling.jcr.resource-2.0.0-incubator-SNAPSHOT.jar
[INFO] Copying org.apache.sling.jcr.webdav-2.0.0-incubator-SNAPSHOT.jar to /home/continuum/data/working-directory/349/target/org.apache.sling.launchpad.webapp-2.0.0-incubator-SNAPSHOT/WEB-INF/resources/bundles/org.apache.sling.jcr.webdav-2.0.0-incubator-SNAPSHOT.jar
[INFO] Copying org.apache.sling.launcher.webapp-2.0.0-incubator-SNAPSHOT.war to /home/continuum/data/working-directory/349/target/org.apache.sling.launchpad.webapp-2.0.0-incubator-SNAPSHOT/WEB-INF/resources/bundles/org.apache.sling.launcher.webapp-2.0.0-incubator-SNAPSHOT.war
[INFO] Copying org.apache.sling.launchpad.servlets-2.0.0-incubator-SNAPSHOT.jar to /home/continuum/data/working-directory/349/target/org.apache.sling.launchpad.webapp-2.0.0-incubator-SNAPSHOT/WEB-INF/resources/bundles/org.apache.sling.launchpad.servlets-2.0.0-incubator-SNAPSHOT.jar
[INFO] Copying org.apache.sling.osgi.commons-2.0.0-incubator-SNAPSHOT.jar to /home/continuum/data/working-directory/349/target/org.apache.sling.launchpad.webapp-2.0.0-incubator-SNAPSHOT/WEB-INF/resources/bundles/org.apache.sling.osgi.commons-2.0.0-incubator-SNAPSHOT.jar
[INFO] Copying org.apache.sling.scripting.api-2.0.0-incubator-SNAPSHOT.jar to /home/continuum/data/working-directory/349/target/org.apache.sling.launchpad.webapp-2.0.0-incubator-SNAPSHOT/WEB-INF/resources/bundles/org.apache.sling.scripting.api-2.0.0-incubator-SNAPSHOT.jar
[INFO] Copying org.apache.sling.scripting.javascript-2.0.0-incubator-SNAPSHOT.jar to /home/continuum/data/working-directory/349/target/org.apache.sling.launchpad.webapp-2.0.0-incubator-SNAPSHOT/WEB-INF/resources/bundles/org.apache.sling.scripting.javascript-2.0.0-incubator-SNAPSHOT.jar
[INFO] Copying org.apache.sling.scripting.jsp-2.0.0-incubator-SNAPSHOT.jar to /home/continuum/data/working-directory/349/target/org.apache.sling.launchpad.webapp-2.0.0-incubator-SNAPSHOT/WEB-INF/resources/bundles/org.apache.sling.scripting.jsp-2.0.0-incubator-SNAPSHOT.jar
[INFO] Copying org.apache.sling.scripting.jsp.taglib-2.0.0-incubator-SNAPSHOT.jar to /home/continuum/data/working-directory/349/target/org.apache.sling.launchpad.webapp-2.0.0-incubator-SNAPSHOT/WEB-INF/resources/bundles/org.apache.sling.scripting.jsp.taglib-2.0.0-incubator-SNAPSHOT.jar
[INFO] Copying org.apache.sling.scripting.resolver-2.0.0-incubator-SNAPSHOT.jar to /home/continuum/data/working-directory/349/target/org.apache.sling.launchpad.webapp-2.0.0-incubator-SNAPSHOT/WEB-INF/resources/bundles/org.apache.sling.scripting.resolver-2.0.0-incubator-SNAPSHOT.jar
[INFO] Copying org.apache.sling.servlet.resolver-2.0.0-incubator-SNAPSHOT.jar to /home/continuum/data/working-directory/349/target/org.apache.sling.launchpad.webapp-2.0.0-incubator-SNAPSHOT/WEB-INF/resources/bundles/org.apache.sling.servlet.resolver-2.0.0-incubator-SNAPSHOT.jar
[INFO] [resources:resources]
[INFO] Using default encoding to copy filtered resources.
[INFO] [compiler:compile]
[INFO] No sources to compile
[INFO] [resources:testResources]
[INFO] Using default encoding to copy filtered resources.
[INFO] [compiler:testCompile]
[INFO] Compiling 33 source files to /home/continuum/data/working-directory/349/target/test-classes
[INFO] [surefire:test]
[INFO] Surefire report directory: /home/continuum/data/working-directory/349/target/surefire-reports

-------------------------------------------------------
 T E S T S
-------------------------------------------------------
There are no tests to run.

Results :

Tests run: 0, Failures: 0, Errors: 0, Skipped: 0

[INFO] [war:war]
[INFO] Exploding webapp...
[INFO] Assembling webapp org.apache.sling.launchpad.webapp in /home/continuum/data/working-directory/349/target/org.apache.sling.launchpad.webapp-2.0.0-incubator-SNAPSHOT
[INFO] Copy webapp webResources to /home/continuum/data/working-directory/349/target/org.apache.sling.launchpad.webapp-2.0.0-incubator-SNAPSHOT
[INFO] Copy webapp webResources to /home/continuum/data/working-directory/349/target/org.apache.sling.launchpad.webapp-2.0.0-incubator-SNAPSHOT
[INFO] Copy webapp webResources to /home/continuum/data/working-directory/349/target/org.apache.sling.launchpad.webapp-2.0.0-incubator-SNAPSHOT
[INFO] Expanding: /home/continuum/.m2/repository/org/apache/sling/org.apache.sling.launcher.webapp/2.0.0-incubator-SNAPSHOT/org.apache.sling.launcher.webapp-2.0.0-incubator-SNAPSHOT.war
into /home/continuum/data/working-directory/349/target/war/work/org.apache.sling.launcher.webapp-2.0.0-incubator-SNAPSHOT
[INFO] Overlaying 1 war(s).
[INFO] Generating war /home/continuum/data/working-directory/349/target/org.apache.sling.launchpad.webapp-2.0.0-incubator-SNAPSHOT.war
[INFO] Building war: /home/continuum/data/working-directory/349/target/org.apache.sling.launchpad.webapp-2.0.0-incubator-SNAPSHOT.war
[INFO] Preparing source:jar
[WARNING] Removing: jar from forked lifecycle, to prevent recursive invocation.
[INFO] [enforcer:enforce {execution: enforce-java}]
[INFO] [source:jar {execution: attach-sources}]
[INFO] Building jar: /home/continuum/data/working-directory/349/target/org.apache.sling.launchpad.webapp-2.0.0-incubator-SNAPSHOT-sources.jar
[INFO] [cargo:start {execution: start-container}]
[INFO] [beddedLocalContainer] Jetty 6.x Embedded starting...
2008-02-18 05:51:50.367::INFO:  Logging to STDERR via org.mortbay.log.StdErrLog
2008-02-18 05:51:50.478::INFO:  jetty-6.1.1rc1
2008-02-18 05:51:51.910::INFO:  Extract jar:file:/home/continuum/data/working-directory/349/target/org.apache.sling.launchpad.webapp-2.0.0-incubator-SNAPSHOT.war!/
to /tmp/Jetty_0_0_0_0_8888_org.apache.sling.launchpad.webapp-2.0.0-incubator-SNAPSHOT.war__org_apache_sling_launchpad_webapp-2_0_0-incubator-SNAPSHOT__tvdn0n/webapp
2008-02-18 05:52:09.848:/org.apache.sling.launchpad.webapp-2.0.0-incubator-SNAPSHOT:INFO:
 sling: Servlet sling initialized
2008-02-18 05:52:09.858::INFO:  Extract jar:file:/tmp/cargo/conf/cargocpc.war!/ to /tmp/Jetty_0_0_0_0_8888_cargocpc.war__cargocpc__rw8xgv/webapp
2008-02-18 05:52:10.677::INFO:  Started SelectChannelConnector @ 0.0.0.0:8888
[INFO] [beddedLocalContainer] Jetty 6.x Embedded started on port [8888]
[INFO] [surefire:test {execution: surefire-integration-test}]
[INFO] Surefire report directory: /home/continuum/data/working-directory/349/target/surefire-reports

-------------------------------------------------------
 T E S T S
-------------------------------------------------------
Running org.apache.sling.launchpad.webapp.integrationtest.JavascriptWrappersTest
log4j:WARN No appenders could be found for logger (org.apache.commons.httpclient.HttpClient).
log4j:WARN Please initialize the log4j system properly.
Checking if the required Sling services are started...
(base URLs=http://localhost:8888/org.apache.sling.launchpad.webapp-2.0.0-incubator-SNAPSHOT
and http://localhost:8888/org.apache.sling.launchpad.webapp-2.0.0-incubator-SNAPSHOT/dav/default)
Server does not seem to be ready, after 10000 msec, got the following 17 Exceptions:java.io.IOException:
Expected status code 302 for POST, got 200, URL=http://localhost:8888/org.apache.sling.launchpad.webapp-2.0.0-incubator-SNAPSHOT/WaitForSlingStartup_1203342738068
java.io.IOException: Expected status code 302 for POST, got 200, URL=http://localhost:8888/org.apache.sling.launchpad.webapp-2.0.0-incubator-SNAPSHOT/WaitForSlingStartup_1203342738836
java.io.IOException: Expected status code 302 for POST, got 200, URL=http://localhost:8888/org.apache.sling.launchpad.webapp-2.0.0-incubator-SNAPSHOT/WaitForSlingStartup_1203342739376
java.io.IOException: Expected status code 302 for POST, got 200, URL=http://localhost:8888/org.apache.sling.launchpad.webapp-2.0.0-incubator-SNAPSHOT/WaitForSlingStartup_1203342739906
java.io.IOException: Expected status code 302 for POST, got 200, URL=http://localhost:8888/org.apache.sling.launchpad.webapp-2.0.0-incubator-SNAPSHOT/WaitForSlingStartup_1203342740436
java.io.IOException: Expected status code 302 for POST, got 200, URL=http://localhost:8888/org.apache.sling.launchpad.webapp-2.0.0-incubator-SNAPSHOT/WaitForSlingStartup_1203342740976
java.io.IOException: Expected status code 302 for POST, got 200, URL=http://localhost:8888/org.apache.sling.launchpad.webapp-2.0.0-incubator-SNAPSHOT/WaitForSlingStartup_1203342741516
java.io.IOException: Expected status code 302 for POST, got 200, URL=http://localhost:8888/org.apache.sling.launchpad.webapp-2.0.0-incubator-SNAPSHOT/WaitForSlingStartup_1203342742046
java.io.IOException: Expected status code 302 for POST, got 200, URL=http://localhost:8888/org.apache.sling.launchpad.webapp-2.0.0-incubator-SNAPSHOT/WaitForSlingStartup_1203342742576
java.io.IOException: Expected status code 302 for POST, got 200, URL=http://localhost:8888/org.apache.sling.launchpad.webapp-2.0.0-incubator-SNAPSHOT/WaitForSlingStartup_1203342743246
java.io.IOException: Expected status code 302 for POST, got 200, URL=http://localhost:8888/org.apache.sling.launchpad.webapp-2.0.0-incubator-SNAPSHOT/WaitForSlingStartup_1203342743786
java.io.IOException: Expected status code 302 for POST, got 200, URL=http://localhost:8888/org.apache.sling.launchpad.webapp-2.0.0-incubator-SNAPSHOT/WaitForSlingStartup_1203342744319
java.io.IOException: Expected status code 302 for POST, got 200, URL=http://localhost:8888/org.apache.sling.launchpad.webapp-2.0.0-incubator-SNAPSHOT/WaitForSlingStartup_1203342744856
java.io.IOException: Expected status code 302 for POST, got 200, URL=http://localhost:8888/org.apache.sling.launchpad.webapp-2.0.0-incubator-SNAPSHOT/WaitForSlingStartup_1203342745386
java.io.IOException: Expected status code 302 for POST, got 200, URL=http://localhost:8888/org.apache.sling.launchpad.webapp-2.0.0-incubator-SNAPSHOT/WaitForSlingStartup_1203342745916
java.io.IOException: Expected status code 302 for POST, got 200, URL=http://localhost:8888/org.apache.sling.launchpad.webapp-2.0.0-incubator-SNAPSHOT/WaitForSlingStartup_1203342746446
java.io.IOException: Expected status code 302 for POST, got 200, URL=http://localhost:8888/org.apache.sling.launchpad.webapp-2.0.0-incubator-SNAPSHOT/WaitForSlingStartup_1203342747026

Tests run: 1, Failures: 1, Errors: 0, Skipped: 0, Time elapsed: 11.177 sec <<< FAILURE!
Running org.apache.sling.launchpad.webapp.integrationtest.StaticContentTest
Tests run: 2, Failures: 2, Errors: 0, Skipped: 0, Time elapsed: 0.016 sec <<< FAILURE!
Running org.apache.sling.launchpad.webapp.integrationtest.ujax.PostServletMoveTest
Tests run: 3, Failures: 3, Errors: 0, Skipped: 0, Time elapsed: 0.014 sec <<< FAILURE!
Running org.apache.sling.launchpad.webapp.integrationtest.GeneratedNodeNameTest
Tests run: 4, Failures: 4, Errors: 0, Skipped: 0, Time elapsed: 0.014 sec <<< FAILURE!
Running org.apache.sling.launchpad.webapp.integrationtest.JsonRenderingTest
Tests run: 8, Failures: 8, Errors: 0, Skipped: 0, Time elapsed: 0.021 sec <<< FAILURE!
Running org.apache.sling.launchpad.webapp.integrationtest.UploadFileTest
Tests run: 3, Failures: 3, Errors: 0, Skipped: 0, Time elapsed: 0.009 sec <<< FAILURE!
Running org.apache.sling.launchpad.webapp.integrationtest.MkdirTest
Tests run: 2, Failures: 2, Errors: 0, Skipped: 0, Time elapsed: 0.016 sec <<< FAILURE!
Running org.apache.sling.launchpad.webapp.integrationtest.ujax.PostServletCreateTest
Tests run: 8, Failures: 8, Errors: 0, Skipped: 0, Time elapsed: 0.019 sec <<< FAILURE!
Running org.apache.sling.launchpad.webapp.integrationtest.ujax.UjaxDateValuesTest
Tests run: 1, Failures: 1, Errors: 0, Skipped: 0, Time elapsed: 0.003 sec <<< FAILURE!
Running org.apache.sling.launchpad.webapp.integrationtest.ujax.UjaxAutoPropertiesTest
Tests run: 3, Failures: 3, Errors: 0, Skipped: 0, Time elapsed: 0.009 sec <<< FAILURE!
Running org.apache.sling.launchpad.webapp.integrationtest.ValueFromTest
Tests run: 3, Failures: 3, Errors: 0, Skipped: 0, Time elapsed: 0.009 sec <<< FAILURE!
Running org.apache.sling.launchpad.webapp.integrationtest.ujax.PostServletUpdateTest
Tests run: 4, Failures: 4, Errors: 0, Skipped: 0, Time elapsed: 0.014 sec <<< FAILURE!
Running org.apache.sling.launchpad.webapp.integrationtest.GetWithSuffixTest
Tests run: 4, Failures: 4, Errors: 0, Skipped: 0, Time elapsed: 0.009 sec <<< FAILURE!
Running org.apache.sling.launchpad.webapp.integrationtest.IncludeTest
Tests run: 5, Failures: 5, Errors: 0, Skipped: 0, Time elapsed: 0.011 sec <<< FAILURE!
Running org.apache.sling.launchpad.webapp.integrationtest.JspScriptingTest
Tests run: 4, Failures: 4, Errors: 0, Skipped: 0, Time elapsed: 0.01 sec <<< FAILURE!
Running org.apache.sling.launchpad.webapp.integrationtest.NodetypeRenderingTest
Tests run: 6, Failures: 6, Errors: 0, Skipped: 0, Time elapsed: 0.017 sec <<< FAILURE!
Running org.apache.sling.launchpad.webapp.integrationtest.SlingResourceTypeRenderingTest
Tests run: 9, Failures: 9, Errors: 0, Skipped: 0, Time elapsed: 0.021 sec <<< FAILURE!
Running org.apache.sling.launchpad.webapp.integrationtest.PropertyRenderingTest
Tests run: 6, Failures: 6, Errors: 0, Skipped: 0, Time elapsed: 0.015 sec <<< FAILURE!
Running org.apache.sling.launchpad.webapp.integrationtest.CreateNodeTest
Tests run: 2, Failures: 2, Errors: 0, Skipped: 0, Time elapsed: 0.004 sec <<< FAILURE!
Running org.apache.sling.launchpad.webapp.integrationtest.ujax.PostServletOrderTest
Tests run: 3, Failures: 3, Errors: 0, Skipped: 0, Time elapsed: 0.007 sec <<< FAILURE!
Running org.apache.sling.launchpad.webapp.integrationtest.FileUploadTest
Tests run: 1, Failures: 1, Errors: 0, Skipped: 0, Time elapsed: 0.003 sec <<< FAILURE!
Running org.apache.sling.launchpad.webapp.integrationtest.ujax.PostServletDeleteTest
Tests run: 1, Failures: 1, Errors: 0, Skipped: 0, Time elapsed: 0.005 sec <<< FAILURE!
Running org.apache.sling.launchpad.webapp.integrationtest.ujax.UjaxSessionInfoTest
Tests run: 2, Failures: 2, Errors: 0, Skipped: 0, Time elapsed: 0.006 sec <<< FAILURE!
Running org.apache.sling.launchpad.webapp.integrationtest.ujax.UjaxDefaultValuesTest
Tests run: 4, Failures: 4, Errors: 0, Skipped: 0, Time elapsed: 0.008 sec <<< FAILURE!
Running org.apache.sling.launchpad.webapp.integrationtest.ScriptBuiltinObjectsTest
Tests run: 1, Failures: 1, Errors: 0, Skipped: 0, Time elapsed: 0.006 sec <<< FAILURE!
Running org.apache.sling.launchpad.webapp.integrationtest.SyntheticResourceTest
Tests run: 1, Failures: 1, Errors: 0, Skipped: 0, Time elapsed: 0.003 sec <<< FAILURE!
Running org.apache.sling.launchpad.webapp.integrationtest.StreamServletTest
Tests run: 4, Failures: 4, Errors: 0, Skipped: 0, Time elapsed: 0.011 sec <<< FAILURE!
Running org.apache.sling.launchpad.webapp.integrationtest.PostRedirectTest
Tests run: 6, Failures: 6, Errors: 0, Skipped: 0, Time elapsed: 0.012 sec <<< FAILURE!
Running org.apache.sling.launchpad.webapp.integrationtest.HttpPingTest
Tests run: 2, Failures: 2, Errors: 0, Skipped: 0, Time elapsed: 0.006 sec <<< FAILURE!

Results :

Failed tests: 
  testRecursiveDump(org.apache.sling.launchpad.webapp.integrationtest.JavascriptWrappersTest)
  testWebInfForbidden(org.apache.sling.launchpad.webapp.integrationtest.StaticContentTest)
  testMetaInfForbidden(org.apache.sling.launchpad.webapp.integrationtest.StaticContentTest)
  testMoveNodeAbsolute(org.apache.sling.launchpad.webapp.integrationtest.ujax.PostServletMoveTest)
  testMoveNodeRelative(org.apache.sling.launchpad.webapp.integrationtest.ujax.PostServletMoveTest)
  testMoveNodeNew(org.apache.sling.launchpad.webapp.integrationtest.ujax.PostServletMoveTest)
  testTitle(org.apache.sling.launchpad.webapp.integrationtest.GeneratedNodeNameTest)
  testTitleWithSavePrefix(org.apache.sling.launchpad.webapp.integrationtest.GeneratedNodeNameTest)
  testCollision(org.apache.sling.launchpad.webapp.integrationtest.GeneratedNodeNameTest)
  testNoParams(org.apache.sling.launchpad.webapp.integrationtest.GeneratedNodeNameTest)
  testAssertJavascript(org.apache.sling.launchpad.webapp.integrationtest.JsonRenderingTest)
  testNonRecursive(org.apache.sling.launchpad.webapp.integrationtest.JsonRenderingTest)
  testRecursiveOneLevel(org.apache.sling.launchpad.webapp.integrationtest.JsonRenderingTest)
  testRecursiveZeroLevels(org.apache.sling.launchpad.webapp.integrationtest.JsonRenderingTest)
  testRecursiveInfinity(org.apache.sling.launchpad.webapp.integrationtest.JsonRenderingTest)
  testInvalidLevel(org.apache.sling.launchpad.webapp.integrationtest.JsonRenderingTest)
  testEscapedStrings(org.apache.sling.launchpad.webapp.integrationtest.JsonRenderingTest)
  testAccentedStrings(org.apache.sling.launchpad.webapp.integrationtest.JsonRenderingTest)
  testDistinctResource(org.apache.sling.launchpad.webapp.integrationtest.UploadFileTest)
  testDistinctResourceWithType(org.apache.sling.launchpad.webapp.integrationtest.UploadFileTest)
  testDistinctFile(org.apache.sling.launchpad.webapp.integrationtest.UploadFileTest)
  testMkdir(org.apache.sling.launchpad.webapp.integrationtest.MkdirTest)
  testMkdirDeep(org.apache.sling.launchpad.webapp.integrationtest.MkdirTest)
  testCreateNode(org.apache.sling.launchpad.webapp.integrationtest.ujax.PostServletCreateTest)
  testPostPathIsUnique(org.apache.sling.launchpad.webapp.integrationtest.ujax.PostServletCreateTest)
  testCreateNodeAtSpecificUrl(org.apache.sling.launchpad.webapp.integrationtest.ujax.PostServletCreateTest)
  testCreateNodeAtDeepUrl(org.apache.sling.launchpad.webapp.integrationtest.ujax.PostServletCreateTest)
  testCreateWithData(org.apache.sling.launchpad.webapp.integrationtest.ujax.PostServletCreateTest)
  testCreateSubnodeProperty(org.apache.sling.launchpad.webapp.integrationtest.ujax.PostServletCreateTest)
  testDefaultSavePrefix(org.apache.sling.launchpad.webapp.integrationtest.ujax.PostServletCreateTest)
  testCustomSavePrefix(org.apache.sling.launchpad.webapp.integrationtest.ujax.PostServletCreateTest)
  testDateValues(org.apache.sling.launchpad.webapp.integrationtest.ujax.UjaxDateValuesTest)
  testPostPathIsUnique(org.apache.sling.launchpad.webapp.integrationtest.ujax.UjaxAutoPropertiesTest)
  testCreatedAndModified(org.apache.sling.launchpad.webapp.integrationtest.ujax.UjaxAutoPropertiesTest)
  testWithSpecificValues(org.apache.sling.launchpad.webapp.integrationtest.ujax.UjaxAutoPropertiesTest)
  testWithoutValueFrom(org.apache.sling.launchpad.webapp.integrationtest.ValueFromTest)
  testWithValueFrom(org.apache.sling.launchpad.webapp.integrationtest.ValueFromTest)
  testWithValueFromAndMissingField(org.apache.sling.launchpad.webapp.integrationtest.ValueFromTest)
  testPostPathIsUnique(org.apache.sling.launchpad.webapp.integrationtest.ujax.PostServletUpdateTest)
  testUpdateWithChanges(org.apache.sling.launchpad.webapp.integrationtest.ujax.PostServletUpdateTest)
  testUpdateNoChanges(org.apache.sling.launchpad.webapp.integrationtest.ujax.PostServletUpdateTest)
  testUpdateSomeChanges(org.apache.sling.launchpad.webapp.integrationtest.ujax.PostServletUpdateTest)
  testWithExactUrl(org.apache.sling.launchpad.webapp.integrationtest.GetWithSuffixTest)
  testGETScript(org.apache.sling.launchpad.webapp.integrationtest.GetWithSuffixTest)
  testWithExtraPathA(org.apache.sling.launchpad.webapp.integrationtest.GetWithSuffixTest)
  testWithExtraPathB(org.apache.sling.launchpad.webapp.integrationtest.GetWithSuffixTest)
  testWithoutInclude(org.apache.sling.launchpad.webapp.integrationtest.IncludeTest)
  testWithInclude(org.apache.sling.launchpad.webapp.integrationtest.IncludeTest)
  testWithIncludeAndExtension(org.apache.sling.launchpad.webapp.integrationtest.IncludeTest)
  testInfiniteLoopDetection(org.apache.sling.launchpad.webapp.integrationtest.IncludeTest)
  testForcedResourceType(org.apache.sling.launchpad.webapp.integrationtest.IncludeTest)
  testRtNoScript(org.apache.sling.launchpad.webapp.integrationtest.JspScriptingTest)
  testUnstructuredNoScript(org.apache.sling.launchpad.webapp.integrationtest.JspScriptingTest)
  testRtJsp(org.apache.sling.launchpad.webapp.integrationtest.JspScriptingTest)
  testUnstructuredJsp(org.apache.sling.launchpad.webapp.integrationtest.JspScriptingTest)
  testWithoutScriptTxt(org.apache.sling.launchpad.webapp.integrationtest.NodetypeRenderingTest)
  testWithoutScriptHtml(org.apache.sling.launchpad.webapp.integrationtest.NodetypeRenderingTest)
  testMiniScriptHtml(org.apache.sling.launchpad.webapp.integrationtest.NodetypeRenderingTest)
  testEspHtml(org.apache.sling.launchpad.webapp.integrationtest.NodetypeRenderingTest)
  testEspXml(org.apache.sling.launchpad.webapp.integrationtest.NodetypeRenderingTest)
  testEspPlain(org.apache.sling.launchpad.webapp.integrationtest.NodetypeRenderingTest)
  testWithoutScriptTxt(org.apache.sling.launchpad.webapp.integrationtest.SlingResourceTypeRenderingTest)
  testWithoutScriptHtml(org.apache.sling.launchpad.webapp.integrationtest.SlingResourceTypeRenderingTest)
  testEspHtml(org.apache.sling.launchpad.webapp.integrationtest.SlingResourceTypeRenderingTest)
  testEspXml(org.apache.sling.launchpad.webapp.integrationtest.SlingResourceTypeRenderingTest)
  testEspPlain(org.apache.sling.launchpad.webapp.integrationtest.SlingResourceTypeRenderingTest)
  testEspJavaCode(org.apache.sling.launchpad.webapp.integrationtest.SlingResourceTypeRenderingTest)
  testEspHtmlInAppsFolder(org.apache.sling.launchpad.webapp.integrationtest.SlingResourceTypeRenderingTest)
  testEspHtmlWithSelectors(org.apache.sling.launchpad.webapp.integrationtest.SlingResourceTypeRenderingTest)
  testEspJs(org.apache.sling.launchpad.webapp.integrationtest.SlingResourceTypeRenderingTest)
  testNodeAccess(org.apache.sling.launchpad.webapp.integrationtest.PropertyRenderingTest)
  testTextJson(org.apache.sling.launchpad.webapp.integrationtest.PropertyRenderingTest)
  testTextHtml(org.apache.sling.launchpad.webapp.integrationtest.PropertyRenderingTest)
  testTextTxt(org.apache.sling.launchpad.webapp.integrationtest.PropertyRenderingTest)
  testTextNoExt(org.apache.sling.launchpad.webapp.integrationtest.PropertyRenderingTest)
  testResourceTypeNoExt(org.apache.sling.launchpad.webapp.integrationtest.PropertyRenderingTest)
  testCreateNode(org.apache.sling.launchpad.webapp.integrationtest.CreateNodeTest)
  testCreateNodeMultipart(org.apache.sling.launchpad.webapp.integrationtest.CreateNodeTest)
  testPostPathIsUnique(org.apache.sling.launchpad.webapp.integrationtest.ujax.PostServletOrderTest)
  testStandardOrder(org.apache.sling.launchpad.webapp.integrationtest.ujax.PostServletOrderTest)
  testZeroOrder(org.apache.sling.launchpad.webapp.integrationtest.ujax.PostServletOrderTest)
  testUploadAndDelete(org.apache.sling.launchpad.webapp.integrationtest.FileUploadTest)
  testDelete(org.apache.sling.launchpad.webapp.integrationtest.ujax.PostServletDeleteTest)
  testSessionInfo(org.apache.sling.launchpad.webapp.integrationtest.ujax.UjaxSessionInfoTest)
  testNonexistentUjaxUrl(org.apache.sling.launchpad.webapp.integrationtest.ujax.UjaxSessionInfoTest)
  testDefaultBehaviour(org.apache.sling.launchpad.webapp.integrationtest.ujax.UjaxDefaultValuesTest)
  testWithSpecificDefault(org.apache.sling.launchpad.webapp.integrationtest.ujax.UjaxDefaultValuesTest)
  testWithIgnore(org.apache.sling.launchpad.webapp.integrationtest.ujax.UjaxDefaultValuesTest)
  testWithNull(org.apache.sling.launchpad.webapp.integrationtest.ujax.UjaxDefaultValuesTest)
  testEspBuiltinObjects(org.apache.sling.launchpad.webapp.integrationtest.ScriptBuiltinObjectsTest)
  testNoSyntheticResourceTest(org.apache.sling.launchpad.webapp.integrationtest.SyntheticResourceTest)
  testPlainTextFile(org.apache.sling.launchpad.webapp.integrationtest.StreamServletTest)
  testHtmlFile(org.apache.sling.launchpad.webapp.integrationtest.StreamServletTest)
  testJavascriptFile(org.apache.sling.launchpad.webapp.integrationtest.StreamServletTest)
  testJsonFile(org.apache.sling.launchpad.webapp.integrationtest.StreamServletTest)
  testForcedRedirect(org.apache.sling.launchpad.webapp.integrationtest.PostRedirectTest)
  testDefaultRedirect(org.apache.sling.launchpad.webapp.integrationtest.PostRedirectTest)
  testMagicStarRedirect(org.apache.sling.launchpad.webapp.integrationtest.PostRedirectTest)
  testMagicStarRedirectPrefix(org.apache.sling.launchpad.webapp.integrationtest.PostRedirectTest)
  testMagicStarRedirectSuffix(org.apache.sling.launchpad.webapp.integrationtest.PostRedirectTest)
  testMagicStarRedirectPrefixSuffix(org.apache.sling.launchpad.webapp.integrationtest.PostRedirectTest)
  testWebServerRoot(org.apache.sling.launchpad.webapp.integrationtest.HttpPingTest)
  test404(org.apache.sling.launchpad.webapp.integrationtest.HttpPingTest)

Tests run: 103, Failures: 103, Errors: 0, Skipped: 0

[INFO] ------------------------------------------------------------------------
[ERROR] BUILD FAILURE
[INFO] ------------------------------------------------------------------------
[INFO] There are test failures.
[INFO] ------------------------------------------------------------------------
[INFO] For more information, run Maven with the -e switch
[INFO] ------------------------------------------------------------------------
[INFO] Total time: 1 minute 46 seconds
[INFO] Finished at: Mon Feb 18 05:52:28 PST 2008
2008-02-18 05:52:29.038::INFO:  Shutdown hook executing
[INFO] Final Memory: 21M/42M
[INFO] ------------------------------------------------------------------------
2008-02-18 05:52:51.786::INFO:  Shutdown hook complete

****************************************************************************



Mime
View raw message