incubator-sling-commits mailing list archives

Site index · List index
Message view « Date » · « Thread »
Top « Date » · « Thread »
From Continuum VMBuild Server <contin...@apache.org>
Subject [continuum] BUILD FAILURE: Sling - Sling Management Console
Date Tue, 29 Jan 2008 08:24:42 GMT
Online report : http://vmbuild.apache.org/continuum/buildResult.action?buildId=43319&projectId=320

Build statistics:
  State: Failed
  Previous State: Ok
  Started at: Tue 29 Jan 2008 00:24:23 -0800
  Finished at: Tue 29 Jan 2008 00:24:35 -0800
  Total time: 12s
  Build Trigger: Schedule
  Build Number: 23
  Exit code: 1
  Building machine hostname: vmbuild.apache.org
  Operating system : Linux(unknown)
  Java Home version : 
          java version "1.6.0"
          Java(TM) SE Runtime Environment (build 1.6.0-b105)
          Java HotSpot(TM) Client VM (build 1.6.0-b105, mixed mode, sharing)
        
  Builder version :
          Maven version: 2.0.7
          Java version: 1.6.0
          OS name: "linux" version: "2.6.20-16-server" arch: "i386"
    
****************************************************************************
SCM Changes:
****************************************************************************
No files changed

****************************************************************************
Dependencies Changes:
****************************************************************************
org.apache.sling:org.apache.sling.osgi.assembly:2.0.0-incubator-SNAPSHOT

org.apache.sling:org.apache.sling.commons.json:2.0.0-incubator-SNAPSHOT

org.apache.sling:sling:1-incubator-SNAPSHOT


****************************************************************************
Build Defintion:
****************************************************************************
POM filename: pom.xml
Goals: clean install   
Arguments: --batch-mode --non-recursive
Build Fresh: false
Always Build: false
Default Build Definition: true
Schedule: DEFAULT_SCHEDULE
Description: 


****************************************************************************
Test Summary:
****************************************************************************
Tests: 0
Failures: 0
Total time: 0

****************************************************************************
Output:
****************************************************************************
[INFO] Scanning for projects...
WAGON_VERSION: 1.0-beta-1
[INFO] ----------------------------------------------------------------------------
[INFO] Building Sling - Sling Management Console
[INFO]    task-segment: [clean, install]
[INFO] ----------------------------------------------------------------------------
[INFO] snapshot org.apache.felix:maven-scr-plugin:1.0.3-SNAPSHOT: checking for updates from
apache Snapshots
[INFO] snapshot org.apache.felix:maven-scr-plugin:1.0.3-SNAPSHOT: checking for updates from
apache.snapshots
Downloading: http://people.apache.org/repo/m2-snapshot-repository/org/apache/felix/maven-scr-plugin/1.0.3-SNAPSHOT/maven-scr-plugin-1.0.3-20080129.035845-2.pom
2K downloaded
Downloading: http://people.apache.org/repo/m2-snapshot-repository/org/apache/felix/maven-scr-plugin/1.0.3-SNAPSHOT/maven-scr-plugin-1.0.3-20080129.035845-2.jar
70K downloaded
[INFO] [clean:clean]
[INFO] Deleting directory /home/continuum/data/working-directory/320/target
[INFO] Deleting directory /home/continuum/data/working-directory/320/target/classes
[INFO] Deleting directory /home/continuum/data/working-directory/320/target/test-classes
[INFO] Deleting directory /home/continuum/data/working-directory/320/target/site
[INFO] snapshot org.apache.sling:org.apache.sling.osgi.assembly:2.0.0-incubator-SNAPSHOT:
checking for updates from apache.snapshots
[INFO] snapshot org.apache.felix:org.apache.felix.scr:0.9.0-SNAPSHOT: checking for updates
from apache.snapshots
[INFO] snapshot org.apache.felix:felix:1.0.3-SNAPSHOT: checking for updates from apache.snapshots
Downloading: http://people.apache.org/repo/m2-snapshot-repository/org/apache/felix/felix/1.0.3-SNAPSHOT/felix-1.0.3-20080129.035845-2.pom
13K downloaded
[INFO] [enforcer:enforce {execution: enforce-java}]
[INFO] [resources:resources]
[INFO] Using default encoding to copy filtered resources.
[INFO] [compiler:compile]
[INFO] Compiling 36 source files to /home/continuum/data/working-directory/320/target/classes
[INFO] ------------------------------------------------------------------------
[ERROR] BUILD FAILURE
[INFO] ------------------------------------------------------------------------
[INFO] Compilation failure
/home/continuum/data/working-directory/320/src/main/java/org/apache/sling/osgi/console/web/internal/compendium/ConfigManagerBase.java:[204,26]
cannot find symbol
symbol  : method getLocale()
location: interface javax.servlet.http.HttpServletRequest



/home/continuum/data/working-directory/320/src/main/java/org/apache/sling/osgi/console/web/internal/compendium/ConfigManagerBase.java:[204,26]
cannot find symbol
symbol  : method getLocale()
location: interface javax.servlet.http.HttpServletRequest


[INFO] ------------------------------------------------------------------------
[INFO] For more information, run Maven with the -e switch
[INFO] ------------------------------------------------------------------------
[INFO] Total time: 7 seconds
[INFO] Finished at: Tue Jan 29 00:24:35 PST 2008
[INFO] Final Memory: 7M/25M
[INFO] ------------------------------------------------------------------------

****************************************************************************



Mime
View raw message