incubator-sling-commits mailing list archives

Site index · List index
Message view « Date » · « Thread »
Top « Date » · « Thread »
From Continuum VMBuild Server <contin...@apache.org>
Subject [continuum] BUILD FAILURE: Sling - Scripting - JSP Support
Date Wed, 23 Jan 2008 11:25:27 GMT
Online report : http://vmbuild.apache.org/continuum/buildResult.action?buildId=40755&projectId=308

Build statistics:
  State: Failed
  Previous State: Ok
  Started at: Wed 23 Jan 2008 03:24:59 -0800
  Finished at: Wed 23 Jan 2008 03:25:18 -0800
  Total time: 18s
  Build Trigger: Schedule
  Build Number: 35
  Exit code: 1
  Building machine hostname: vmbuild.apache.org
  Operating system : Linux(unknown)
  Java Home version : 
          java version "1.6.0"
          Java(TM) SE Runtime Environment (build 1.6.0-b105)
          Java HotSpot(TM) Client VM (build 1.6.0-b105, mixed mode, sharing)
        
  Builder version :
          Maven version: 2.0.7
          Java version: 1.6.0
          OS name: "linux" version: "2.6.20-16-server" arch: "i386"
    
****************************************************************************
SCM Changes:
****************************************************************************
No files changed

****************************************************************************
Dependencies Changes:
****************************************************************************
org.apache.sling:org.apache.sling.api:2.0.0-incubator-SNAPSHOT


****************************************************************************
Build Defintion:
****************************************************************************
POM filename: pom.xml
Goals: clean install   
Arguments: --batch-mode --non-recursive
Build Fresh: false
Always Build: false
Default Build Definition: true
Schedule: DEFAULT_SCHEDULE
Description: 


****************************************************************************
Test Summary:
****************************************************************************
Tests: 0
Failures: 0
Total time: 0

****************************************************************************
Output:
****************************************************************************
[INFO] Scanning for projects...
WAGON_VERSION: 1.0-beta-1
[INFO] ----------------------------------------------------------------------------
[INFO] Building Sling - Scripting - JSP Support
[INFO]    task-segment: [clean, install]
[INFO] ----------------------------------------------------------------------------
[INFO] [clean:clean]
[INFO] Deleting directory /home/continuum/data/working-directory/308/target
[INFO] Deleting directory /home/continuum/data/working-directory/308/target/classes
[INFO] Deleting directory /home/continuum/data/working-directory/308/target/test-classes
[INFO] Deleting directory /home/continuum/data/working-directory/308/target/site
[INFO] [enforcer:enforce {execution: enforce-java}]
[INFO] [resources:resources]
[INFO] Using default encoding to copy filtered resources.
[INFO] [compiler:compile]
[INFO] Compiling 119 source files to /home/continuum/data/working-directory/308/target/classes
[INFO] ------------------------------------------------------------------------
[ERROR] BUILD FAILURE
[INFO] ------------------------------------------------------------------------
[INFO] Compilation failure

/home/continuum/data/working-directory/308/src/main/java/org/apache/sling/scripting/jsp/JspServletWrapperAdapter.java:[57,18]
SlingException(java.lang.Throwable) has protected access in org.apache.sling.api.SlingException

/home/continuum/data/working-directory/308/src/main/java/org/apache/sling/scripting/jsp/JspServletWrapperAdapter.java:[102,14]
cannot find symbol
symbol  : constructor SlingException(java.lang.String)
location: class org.apache.sling.api.SlingException


[INFO] ------------------------------------------------------------------------
[INFO] For more information, run Maven with the -e switch
[INFO] ------------------------------------------------------------------------
[INFO] Total time: 11 seconds
[INFO] Finished at: Wed Jan 23 03:25:18 PST 2008
[INFO] Final Memory: 10M/30M
[INFO] ------------------------------------------------------------------------

****************************************************************************



Mime
View raw message