incubator-sling-commits mailing list archives

Site index · List index
Message view « Date » · « Thread »
Top « Date » · « Thread »
From Continuum VMBuild Server <contin...@apache.org>
Subject [continuum] BUILD FAILURE: Sling - Sling ServletResolver
Date Mon, 28 Jan 2008 09:22:39 GMT
Online report : http://vmbuild.apache.org/continuum/buildResult.action?buildId=42883&projectId=332

Build statistics:
  State: Failed
  Previous State: Failed
  Started at: Mon 28 Jan 2008 01:22:25 -0800
  Finished at: Mon 28 Jan 2008 01:22:35 -0800
  Total time: 10s
  Build Trigger: Schedule
  Build Number: 30
  Exit code: 1
  Building machine hostname: vmbuild.apache.org
  Operating system : Linux(unknown)
  Java Home version : 
          java version "1.6.0"
          Java(TM) SE Runtime Environment (build 1.6.0-b105)
          Java HotSpot(TM) Client VM (build 1.6.0-b105, mixed mode, sharing)
        
  Builder version :
          Maven version: 2.0.7
          Java version: 1.6.0
          OS name: "linux" version: "2.6.20-16-server" arch: "i386"
    
****************************************************************************
SCM Changes:
****************************************************************************
Changed: cziegeler @ Mon 28 Jan 2008 00:17:53 -0800
Comment: Use OSGi core and cmpendium jars from Felix project.
Files changed:
  /incubator/sling/trunk/commons/mime/pom.xml ( 615754 )
  /incubator/sling/trunk/jcr/api/pom.xml ( 615754 )
  /incubator/sling/trunk/jcr/classloader/pom.xml ( 615754 )
  /incubator/sling/trunk/jcr/jackrabbit-client/pom.xml ( 615754 )
  /incubator/sling/trunk/jcr/jackrabbit-server/pom.xml ( 615754 )
  /incubator/sling/trunk/jcr/ocm/pom.xml ( 615754 )
  /incubator/sling/trunk/jcr/resource/pom.xml ( 615754 )
  /incubator/sling/trunk/jcr/webdav/pom.xml ( 615754 )
  /incubator/sling/trunk/launchpad/launchpad-servlets/pom.xml ( 615754 )
  /incubator/sling/trunk/maven/maven-jspc-plugin/pom.xml ( 615754 )
  /incubator/sling/trunk/maven/maven-sling-plugin/pom.xml ( 615754 )
  /incubator/sling/trunk/osgi/assembly/pom.xml ( 615754 )
  /incubator/sling/trunk/osgi/commons/pom.xml ( 615754 )
  /incubator/sling/trunk/osgi/console-web/pom.xml ( 615754 )
  /incubator/sling/trunk/osgi/log/pom.xml ( 615754 )
  /incubator/sling/trunk/osgi/obr/pom.xml ( 615754 )
  /incubator/sling/trunk/parent/pom.xml ( 615754 )
  /incubator/sling/trunk/scripting/api/pom.xml ( 615754 )
  /incubator/sling/trunk/scripting/jsp/pom.xml ( 615754 )
  /incubator/sling/trunk/scripting/jsp-taglib/pom.xml ( 615754 )
  /incubator/sling/trunk/scripting/resolver/pom.xml ( 615754 )
  /incubator/sling/trunk/sling/adapter/pom.xml ( 615754 )
  /incubator/sling/trunk/sling/adapter/src/test/java/org/apache/sling/adapter/mock/MockBundle.java
( 615754 )
  /incubator/sling/trunk/sling/core/pom.xml ( 615754 )
  /incubator/sling/trunk/sling/event/pom.xml ( 615754 )
  /incubator/sling/trunk/sling/sample/pom.xml ( 615754 )
  /incubator/sling/trunk/sling/scheduler/pom.xml ( 615754 )
  /incubator/sling/trunk/sling/servlet-resolver/pom.xml ( 615754 )
  /incubator/sling/trunk/sling/servlets-standard/pom.xml ( 615754 )

****************************************************************************
Dependencies Changes:
****************************************************************************
org.apache.sling:org.apache.sling.api:2.0.0-incubator-SNAPSHOT

org.apache.sling:org.apache.sling.commons.json:2.0.0-incubator-SNAPSHOT

org.apache.sling:sling:1-incubator-SNAPSHOT


****************************************************************************
Build Defintion:
****************************************************************************
POM filename: pom.xml
Goals: clean install   
Arguments: --batch-mode --non-recursive
Build Fresh: false
Always Build: false
Default Build Definition: true
Schedule: DEFAULT_SCHEDULE
Description: 


****************************************************************************
Test Summary:
****************************************************************************
Tests: 0
Failures: 0
Total time: 0

****************************************************************************
Output:
****************************************************************************
[INFO] Scanning for projects...
WAGON_VERSION: 1.0-beta-1
[INFO] ----------------------------------------------------------------------------
[INFO] Building Sling - Sling ServletResolver
[INFO]    task-segment: [clean, install]
[INFO] ----------------------------------------------------------------------------
[INFO] [clean:clean]
[INFO] Deleting directory /home/continuum/data/working-directory/332/target
[INFO] Deleting directory /home/continuum/data/working-directory/332/target/classes
[INFO] Deleting directory /home/continuum/data/working-directory/332/target/test-classes
[INFO] Deleting directory /home/continuum/data/working-directory/332/target/site
[INFO] snapshot org.apache.sling:org.apache.sling.core:2.0.0-incubator-SNAPSHOT: checking
for updates from apache.snapshots
[WARNING] POM for 'org.apache.sling:org.apache.sling.core:pom:2.0.0-incubator-SNAPSHOT:compile'
is invalid. It will be ignored for artifact resolution. Reason: Failed to validate POM for
project org.apache.sling:org.apache.sling.core at Artifact [org.apache.sling:org.apache.sling.core:pom:2.0.0-incubator-SNAPSHOT:compile]
[INFO] [enforcer:enforce {execution: enforce-java}]
[WARNING] POM for 'org.apache.sling:org.apache.sling.core:pom:2.0.0-incubator-SNAPSHOT:compile'
is invalid. It will be ignored for artifact resolution. Reason: Failed to validate POM for
project org.apache.sling:org.apache.sling.core at Artifact [org.apache.sling:org.apache.sling.core:pom:2.0.0-incubator-SNAPSHOT:compile]
[INFO] [jcrocm:ocm {execution: generate-JCR-OCM-descriptor}]
[INFO] No Jackrabbit OCM Descriptors found in project
[INFO] [resources:resources]
[INFO] Using default encoding to copy filtered resources.
[WARNING] POM for 'org.apache.sling:org.apache.sling.core:pom:2.0.0-incubator-SNAPSHOT:compile'
is invalid. It will be ignored for artifact resolution. Reason: Failed to validate POM for
project org.apache.sling:org.apache.sling.core at Artifact [org.apache.sling:org.apache.sling.core:pom:2.0.0-incubator-SNAPSHOT:compile]
[INFO] [compiler:compile]
[INFO] Compiling 8 source files to /home/continuum/data/working-directory/332/target/classes
[INFO] ------------------------------------------------------------------------
[ERROR] BUILD FAILURE
[INFO] ------------------------------------------------------------------------
[INFO] Compilation failure

/home/continuum/data/working-directory/332/src/main/java/org/apache/sling/servlet/resolver/defaults/DefaultServlet.java:[32,16]
package javax.jcr does not exist

/home/continuum/data/working-directory/332/src/main/java/org/apache/sling/servlet/resolver/defaults/DefaultServlet.java:[33,16]
package javax.jcr does not exist

/home/continuum/data/working-directory/332/src/main/java/org/apache/sling/servlet/resolver/resource/ServletResource.java:[23,31]
package org.apache.sling.adapter does not exist

/home/continuum/data/working-directory/332/src/main/java/org/apache/sling/servlet/resolver/resource/ServletResource.java:[28,37]
cannot find symbol
symbol: class SlingAdaptable
public class ServletResource extends SlingAdaptable implements Resource {

/home/continuum/data/working-directory/332/src/main/java/org/apache/sling/servlet/resolver/resource/ServletResourceProvider.java:[38,36]
package org.apache.sling.osgi.commons does not exist

/home/continuum/data/working-directory/332/src/main/java/org/apache/sling/servlet/resolver/SlingServletResolver.java:[55,36]
package org.apache.sling.osgi.commons does not exist

/home/continuum/data/working-directory/332/src/main/java/org/apache/sling/servlet/resolver/defaults/DefaultServlet.java:[213,16]
cannot find symbol
symbol  : method setCharacterEncoding(java.lang.String)
location: interface org.apache.sling.api.SlingHttpServletResponse

/home/continuum/data/working-directory/332/src/main/java/org/apache/sling/servlet/resolver/defaults/DefaultServlet.java:[217,18]
cannot find symbol
symbol  : class Node
location: class org.apache.sling.servlet.resolver.defaults.DefaultServlet

/home/continuum/data/working-directory/332/src/main/java/org/apache/sling/servlet/resolver/defaults/DefaultServlet.java:[217,46]
cannot find symbol
symbol  : class Node
location: class org.apache.sling.servlet.resolver.defaults.DefaultServlet

/home/continuum/data/working-directory/332/src/main/java/org/apache/sling/servlet/resolver/defaults/DefaultServlet.java:[223,16]
cannot find symbol
symbol  : class RepositoryException
location: class org.apache.sling.servlet.resolver.defaults.DefaultServlet

/home/continuum/data/working-directory/332/src/main/java/org/apache/sling/servlet/resolver/defaults/DefaultServlet.java:[243,20]
cannot find symbol
symbol  : method setCharacterEncoding(java.lang.String)
location: interface javax.servlet.http.HttpServletResponse

/home/continuum/data/working-directory/332/src/main/java/org/apache/sling/servlet/resolver/resource/ServletResource.java:[71,15]
cannot find symbol
symbol  : variable super
location: class org.apache.sling.servlet.resolver.resource.ServletResource

/home/continuum/data/working-directory/332/src/main/java/org/apache/sling/servlet/resolver/resource/ServletResourceProvider.java:[44,24]
type parameter org.apache.sling.servlet.resolver.resource.ServletResource is not within its
bound

/home/continuum/data/working-directory/332/src/main/java/org/apache/sling/servlet/resolver/resource/ServletResourceProvider.java:[50,25]
cannot find symbol
symbol  : variable OsgiUtil
location: class org.apache.sling.servlet.resolver.resource.ServletResourceProvider

/home/continuum/data/working-directory/332/src/main/java/org/apache/sling/servlet/resolver/resource/ServletResourceProvider.java:[62,25]
cannot find symbol
symbol  : variable OsgiUtil
location: class org.apache.sling.servlet.resolver.resource.ServletResourceProvider

/home/continuum/data/working-directory/332/src/main/java/org/apache/sling/servlet/resolver/resource/ServletResourceProvider.java:[69,29]
cannot find symbol
symbol  : variable OsgiUtil
location: class org.apache.sling.servlet.resolver.resource.ServletResourceProvider

/home/continuum/data/working-directory/332/src/main/java/org/apache/sling/servlet/resolver/resource/ServletResourceProvider.java:[75,30]
cannot find symbol
symbol  : variable OsgiUtil
location: class org.apache.sling.servlet.resolver.resource.ServletResourceProvider

/home/continuum/data/working-directory/332/src/main/java/org/apache/sling/servlet/resolver/resource/ServletResourceProvider.java:[76,27]
cannot find symbol
symbol  : variable OsgiUtil
location: class org.apache.sling.servlet.resolver.resource.ServletResourceProvider

/home/continuum/data/working-directory/332/src/main/java/org/apache/sling/servlet/resolver/resource/ServletResourceProvider.java:[137,41]
type parameter org.apache.sling.servlet.resolver.resource.ServletResource is not within its
bound

/home/continuum/data/working-directory/332/src/main/java/org/apache/sling/servlet/resolver/resource/ServletResourceProvider.java:[149,29]
incompatible types
found   : org.apache.sling.servlet.resolver.resource.ServletResource
required: org.apache.sling.api.resource.Resource

/home/continuum/data/working-directory/332/src/main/java/org/apache/sling/servlet/resolver/SlingServletResolver.java:[79,7]
org.apache.sling.servlet.resolver.SlingServletResolver is not abstract and does not override
abstract method handleError(java.lang.Throwable,javax.servlet.http.HttpServletRequest,javax.servlet.http.HttpServletResponse)
in org.apache.sling.core.servlets.ErrorHandler

/home/continuum/data/working-directory/332/src/main/java/org/apache/sling/servlet/resolver/SlingServletResolver.java:[153,53]
cannot find symbol
symbol  : method getServletName()
location: interface javax.servlet.ServletConfig

/home/continuum/data/working-directory/332/src/main/java/org/apache/sling/servlet/resolver/SlingServletResolver.java:[390,47]
cannot find symbol
symbol  : method getServletName()
location: interface javax.servlet.ServletConfig

/home/continuum/data/working-directory/332/src/main/java/org/apache/sling/servlet/resolver/SlingServletResolver.java:[417,31]
cannot find symbol
symbol  : variable OsgiUtil
location: class org.apache.sling.servlet.resolver.SlingServletResolver

/home/continuum/data/working-directory/332/src/main/java/org/apache/sling/servlet/resolver/SlingServletResolver.java:[437,25]
cannot find symbol
symbol  : variable OsgiUtil
location: class org.apache.sling.servlet.resolver.SlingServletResolver

/home/continuum/data/working-directory/332/src/main/java/org/apache/sling/servlet/resolver/SlingServletResolver.java:[566,52]
cannot find symbol
symbol  : method getServletName()
location: interface javax.servlet.ServletConfig


[INFO] ------------------------------------------------------------------------
[INFO] For more information, run Maven with the -e switch
[INFO] ------------------------------------------------------------------------
[INFO] Total time: 6 seconds
[INFO] Finished at: Mon Jan 28 01:22:34 PST 2008
[INFO] Final Memory: 10M/18M
[INFO] ------------------------------------------------------------------------

****************************************************************************



Mime
View raw message