incubator-sling-commits mailing list archives

Site index · List index
Message view « Date » · « Thread »
Top « Date » · « Thread »
From Continuum VMBuild Server <contin...@apache.org>
Subject [continuum] BUILD FAILURE: Sling - Sling ServletResolver
Date Tue, 29 Jan 2008 07:23:43 GMT
Online report : http://vmbuild.apache.org/continuum/buildResult.action?buildId=43261&projectId=332

Build statistics:
  State: Failed
  Previous State: Failed
  Started at: Mon 28 Jan 2008 23:23:24 -0800
  Finished at: Mon 28 Jan 2008 23:23:36 -0800
  Total time: 11s
  Build Trigger: Forced
  Build Number: 30
  Exit code: 1
  Building machine hostname: vmbuild.apache.org
  Operating system : Linux(unknown)
  Java Home version : 
          java version "1.6.0"
          Java(TM) SE Runtime Environment (build 1.6.0-b105)
          Java HotSpot(TM) Client VM (build 1.6.0-b105, mixed mode, sharing)
        
  Builder version :
          Maven version: 2.0.7
          Java version: 1.6.0
          OS name: "linux" version: "2.6.20-16-server" arch: "i386"
    
****************************************************************************
SCM Changes:
****************************************************************************
No files changed

****************************************************************************
Dependencies Changes:
****************************************************************************
org.apache.sling:org.apache.sling.adapter:2.0.0-incubator-SNAPSHOT

org.apache.sling:org.apache.sling.osgi.commons:2.0.0-incubator-SNAPSHOT


****************************************************************************
Build Defintion:
****************************************************************************
POM filename: pom.xml
Goals: clean install   
Arguments: --batch-mode --non-recursive
Build Fresh: false
Always Build: false
Default Build Definition: true
Schedule: DEFAULT_SCHEDULE
Description: 


****************************************************************************
Test Summary:
****************************************************************************
Tests: 0
Failures: 0
Total time: 0

****************************************************************************
Output:
****************************************************************************
[INFO] Scanning for projects...
WAGON_VERSION: 1.0-beta-1
[INFO] ----------------------------------------------------------------------------
[INFO] Building Sling - Sling ServletResolver
[INFO]    task-segment: [clean, install]
[INFO] ----------------------------------------------------------------------------
[INFO] [clean:clean]
[INFO] Deleting directory /home/continuum/data/working-directory/332/target
[INFO] Deleting directory /home/continuum/data/working-directory/332/target/classes
[INFO] Deleting directory /home/continuum/data/working-directory/332/target/test-classes
[INFO] Deleting directory /home/continuum/data/working-directory/332/target/site
[WARNING] POM for 'org.apache.sling:org.apache.sling.core:pom:2.0.0-incubator-SNAPSHOT:compile'
is invalid. It will be ignored for artifact resolution. Reason: Failed to validate POM for
project org.apache.sling:org.apache.sling.core at Artifact [org.apache.sling:org.apache.sling.core:pom:2.0.0-incubator-SNAPSHOT:compile]
[INFO] [enforcer:enforce {execution: enforce-java}]
[WARNING] POM for 'org.apache.sling:org.apache.sling.core:pom:2.0.0-incubator-SNAPSHOT:compile'
is invalid. It will be ignored for artifact resolution. Reason: Failed to validate POM for
project org.apache.sling:org.apache.sling.core at Artifact [org.apache.sling:org.apache.sling.core:pom:2.0.0-incubator-SNAPSHOT:compile]
[INFO] [jcrocm:ocm {execution: generate-JCR-OCM-descriptor}]
[INFO] No Jackrabbit OCM Descriptors found in project
[INFO] [resources:resources]
[INFO] Using default encoding to copy filtered resources.
[WARNING] POM for 'org.apache.sling:org.apache.sling.core:pom:2.0.0-incubator-SNAPSHOT:compile'
is invalid. It will be ignored for artifact resolution. Reason: Failed to validate POM for
project org.apache.sling:org.apache.sling.core at Artifact [org.apache.sling:org.apache.sling.core:pom:2.0.0-incubator-SNAPSHOT:compile]
[INFO] [compiler:compile]
[INFO] Compiling 8 source files to /home/continuum/data/working-directory/332/target/classes
[INFO] ------------------------------------------------------------------------
[ERROR] BUILD FAILURE
[INFO] ------------------------------------------------------------------------
[INFO] Compilation failure
/home/continuum/data/working-directory/332/src/main/java/org/apache/sling/servlet/resolver/SlingServletResolver.java:[79,7]
org.apache.sling.servlet.resolver.SlingServletResolver is not abstract and does not override
abstract method handleError(java.lang.Throwable,javax.servlet.http.HttpServletRequest,javax.servlet.http.HttpServletResponse)
in org.apache.sling.core.servlets.ErrorHandler



/home/continuum/data/working-directory/332/src/main/java/org/apache/sling/servlet/resolver/SlingServletResolver.java:[79,7]
org.apache.sling.servlet.resolver.SlingServletResolver is not abstract and does not override
abstract method handleError(java.lang.Throwable,javax.servlet.http.HttpServletRequest,javax.servlet.http.HttpServletResponse)
in org.apache.sling.core.servlets.ErrorHandler


[INFO] ------------------------------------------------------------------------
[INFO] For more information, run Maven with the -e switch
[INFO] ------------------------------------------------------------------------
[INFO] Total time: 5 seconds
[INFO] Finished at: Mon Jan 28 23:23:35 PST 2008
[INFO] Final Memory: 9M/20M
[INFO] ------------------------------------------------------------------------

****************************************************************************



Mime
View raw message