incubator-sling-commits mailing list archives

Site index · List index
Message view « Date » · « Thread »
Top « Date » · « Thread »
From Continuum VMBuild Server <contin...@apache.org>
Subject [continuum] BUILD FAILURE: Sling - ScriptResolver implementation
Date Tue, 29 Jan 2008 14:20:08 GMT
Online report : http://vmbuild.apache.org/continuum/buildResult.action?buildId=43447&projectId=328

Build statistics:
  State: Failed
  Previous State: Ok
  Started at: Tue 29 Jan 2008 06:19:47 -0800
  Finished at: Tue 29 Jan 2008 06:20:00 -0800
  Total time: 12s
  Build Trigger: Schedule
  Build Number: 20
  Exit code: 1
  Building machine hostname: vmbuild.apache.org
  Operating system : Linux(unknown)
  Java Home version : 
          java version "1.6.0"
          Java(TM) SE Runtime Environment (build 1.6.0-b105)
          Java HotSpot(TM) Client VM (build 1.6.0-b105, mixed mode, sharing)
        
  Builder version :
          Maven version: 2.0.7
          Java version: 1.6.0
          OS name: "linux" version: "2.6.20-16-server" arch: "i386"
    
****************************************************************************
SCM Changes:
****************************************************************************
No files changed

****************************************************************************
Dependencies Changes:
****************************************************************************
org.apache.sling:org.apache.sling.api:2.0.0-incubator-SNAPSHOT

org.apache.sling:org.apache.sling.osgi.commons:2.0.0-incubator-SNAPSHOT


****************************************************************************
Build Defintion:
****************************************************************************
POM filename: pom.xml
Goals: clean install   
Arguments: --batch-mode --non-recursive
Build Fresh: false
Always Build: false
Default Build Definition: true
Schedule: DEFAULT_SCHEDULE
Description: 


****************************************************************************
Test Summary:
****************************************************************************
Tests: 0
Failures: 0
Total time: 0

****************************************************************************
Output:
****************************************************************************
[INFO] Scanning for projects...
WAGON_VERSION: 1.0-beta-1
[INFO] ----------------------------------------------------------------------------
[INFO] Building Sling - ScriptResolver implementation
[INFO]    task-segment: [clean, install]
[INFO] ----------------------------------------------------------------------------
[INFO] [clean:clean]
[INFO] Deleting directory /home/continuum/data/working-directory/328/target
[INFO] Deleting directory /home/continuum/data/working-directory/328/target/classes
[INFO] Deleting directory /home/continuum/data/working-directory/328/target/test-classes
[INFO] Deleting directory /home/continuum/data/working-directory/328/target/site
[INFO] [enforcer:enforce {execution: enforce-java}]
[INFO] [resources:resources]
[INFO] Using default encoding to copy filtered resources.
[INFO] [compiler:compile]
[INFO] Compiling 8 source files to /home/continuum/data/working-directory/328/target/classes
[INFO] ------------------------------------------------------------------------
[ERROR] BUILD FAILURE
[INFO] ------------------------------------------------------------------------
[INFO] Compilation failure

/home/continuum/data/working-directory/328/src/main/java/org/apache/sling/scripting/resolver/ScriptHelper.java:[87,51]
cannot find symbol
symbol  : method getRequestDispatcher(java.lang.String)
location: interface org.apache.sling.api.SlingHttpServletRequest

/home/continuum/data/working-directory/328/src/main/java/org/apache/sling/scripting/resolver/impl/DefaultSlingScript.java:[158,15]
cannot find symbol
symbol  : method setCharacterEncoding(java.lang.String)
location: interface javax.servlet.ServletResponse


[INFO] ------------------------------------------------------------------------
[INFO] For more information, run Maven with the -e switch
[INFO] ------------------------------------------------------------------------
[INFO] Total time: 5 seconds
[INFO] Finished at: Tue Jan 29 06:19:59 PST 2008
[INFO] Final Memory: 10M/18M
[INFO] ------------------------------------------------------------------------

****************************************************************************



Mime
View raw message