incubator-sling-commits mailing list archives

Site index · List index
Message view « Date » · « Thread »
Top « Date » · « Thread »
From Continuum VMBuild Server <contin...@apache.org>
Subject [continuum] BUILD FAILURE: Sling - Sling JSON Library
Date Fri, 25 Jan 2008 20:22:00 GMT
Online report : http://vmbuild.apache.org/continuum/buildResult.action?buildId=41771&projectId=287

Build statistics:
  State: Failed
  Previous State: Ok
  Started at: Fri 25 Jan 2008 12:21:32 -0800
  Finished at: Fri 25 Jan 2008 12:21:54 -0800
  Total time: 21s
  Build Trigger: Schedule
  Build Number: 13
  Exit code: 1
  Building machine hostname: vmbuild.apache.org
  Operating system : Linux(unknown)
  Java Home version : 
          java version "1.6.0"
          Java(TM) SE Runtime Environment (build 1.6.0-b105)
          Java HotSpot(TM) Client VM (build 1.6.0-b105, mixed mode, sharing)
        
  Builder version :
          Maven version: 2.0.7
          Java version: 1.6.0
          OS name: "linux" version: "2.6.20-16-server" arch: "i386"
    
****************************************************************************
SCM Changes:
****************************************************************************
Changed: bdelacretaz @ Fri 25 Jan 2008 08:47:26 -0800
Comment: SLING-201 - Move JsonItemWriter to o.a.s.commons.json
Files changed:
  /incubator/sling/trunk/commons/json/pom.xml ( 615265 )
  /incubator/sling/trunk/commons/json/src/main/java/org/apache/sling/commons/json/jcr ( 615265
)
  /incubator/sling/trunk/commons/json/src/main/java/org/apache/sling/commons/json/jcr/JsonItemWriter.java
(from /incubator/sling/trunk/sling/servlet-resolver/src/main/java/org/apache/sling/servlet/resolver/helper/JsonItemWriter.java:615211)
( 615265 )
  /incubator/sling/trunk/commons/json/src/test ( 615265 )
  /incubator/sling/trunk/commons/json/src/test/java ( 615265 )
  /incubator/sling/trunk/commons/json/src/test/java/org ( 615265 )
  /incubator/sling/trunk/commons/json/src/test/java/org/apache ( 615265 )
  /incubator/sling/trunk/commons/json/src/test/java/org/apache/sling ( 615265 )
  /incubator/sling/trunk/commons/json/src/test/java/org/apache/sling/commons ( 615265 )
  /incubator/sling/trunk/commons/json/src/test/java/org/apache/sling/commons/json ( 615265
)
  /incubator/sling/trunk/commons/json/src/test/java/org/apache/sling/commons/json/jcr ( 615265
)
  /incubator/sling/trunk/commons/json/src/test/java/org/apache/sling/commons/json/jcr/JsonItemWriterTest.java
( 615265 )
  /incubator/sling/trunk/commons/testing/src/main/java/org/apache/sling/commons/testing/jcr/MockNode.java
( 615265 )
  /incubator/sling/trunk/commons/testing/src/main/java/org/apache/sling/commons/testing/jcr/MockProperty.java
( 615265 )
  /incubator/sling/trunk/commons/testing/src/main/java/org/apache/sling/commons/testing/jcr/MockPropertyDefinition.java
( 615265 )
  /incubator/sling/trunk/commons/testing/src/main/java/org/apache/sling/commons/testing/jcr/MockPropertyIterator.java
( 615265 )
  /incubator/sling/trunk/commons/testing/src/main/java/org/apache/sling/commons/testing/jcr/MockValue.java
( 615265 )
  /incubator/sling/trunk/launchpad/launchpad-servlets/src/main/java/org/apache/sling/launchpad/renderers/JsonItemWriter.java
( 615265 )
  /incubator/sling/trunk/launchpad/launchpad-servlets/src/main/java/org/apache/sling/launchpad/renderers/JsonRendererServlet.java
( 615265 )
  /incubator/sling/trunk/sling/servlet-resolver/src/main/java/org/apache/sling/servlet/resolver/defaults/DefaultServlet.java
( 615265 )
  /incubator/sling/trunk/sling/servlet-resolver/src/main/java/org/apache/sling/servlet/resolver/helper/JsonItemWriter.java
( 615265 )

****************************************************************************
Dependencies Changes:
****************************************************************************
No dependencies changed


****************************************************************************
Build Defintion:
****************************************************************************
POM filename: pom.xml
Goals: clean install   
Arguments: --batch-mode --non-recursive
Build Fresh: false
Always Build: false
Default Build Definition: true
Schedule: DEFAULT_SCHEDULE
Description: 


****************************************************************************
Test Summary:
****************************************************************************
Tests: 2
Failures: 2
Total time: 53

****************************************************************************
Output:
****************************************************************************
[INFO] Scanning for projects...
WAGON_VERSION: 1.0-beta-1
[INFO] ----------------------------------------------------------------------------
[INFO] Building Sling - Sling JSON Library
[INFO]    task-segment: [clean, install]
[INFO] ----------------------------------------------------------------------------
[INFO] [clean:clean]
[INFO] Deleting directory /home/continuum/data/working-directory/287/target
[INFO] Deleting directory /home/continuum/data/working-directory/287/target/classes
[INFO] Deleting directory /home/continuum/data/working-directory/287/target/test-classes
[INFO] Deleting directory /home/continuum/data/working-directory/287/target/site
[INFO] snapshot org.apache.sling:org.apache.sling.commons.testing:2.0.0-incubator-SNAPSHOT:
checking for updates from apache.snapshots
[INFO] [enforcer:enforce {execution: enforce-java}]
[INFO] [resources:resources]
[INFO] Using default encoding to copy filtered resources.
[INFO] [compiler:compile]
[INFO] Compiling 15 source files to /home/continuum/data/working-directory/287/target/classes
[INFO] [resources:testResources]
[INFO] Using default encoding to copy filtered resources.
[INFO] [compiler:testCompile]
[INFO] Compiling 1 source file to /home/continuum/data/working-directory/287/target/test-classes
[INFO] [surefire:test]
[INFO] Surefire report directory: /home/continuum/data/working-directory/287/target/surefire-reports

-------------------------------------------------------
 T E S T S
-------------------------------------------------------
Running org.apache.sling.commons.json.jcr.JsonItemWriterTest
Tests run: 2, Failures: 0, Errors: 2, Skipped: 0, Time elapsed: 0.071 sec <<< FAILURE!

Results :

Tests in error: 
  testBasicJson(org.apache.sling.commons.json.jcr.JsonItemWriterTest)
  testMultivalued(org.apache.sling.commons.json.jcr.JsonItemWriterTest)

Tests run: 2, Failures: 0, Errors: 2, Skipped: 0

[INFO] ------------------------------------------------------------------------
[ERROR] BUILD FAILURE
[INFO] ------------------------------------------------------------------------
[INFO] There are test failures.
[INFO] ------------------------------------------------------------------------
[INFO] For more information, run Maven with the -e switch
[INFO] ------------------------------------------------------------------------
[INFO] Total time: 15 seconds
[INFO] Finished at: Fri Jan 25 12:21:54 PST 2008
[INFO] Final Memory: 8M/18M
[INFO] ------------------------------------------------------------------------

****************************************************************************



Mime
View raw message