incubator-sling-commits mailing list archives

Site index · List index
Message view « Date » · « Thread »
Top « Date » · « Thread »
From Continuum VMBuild Server <contin...@apache.org>
Subject [continuum] BUILD FAILURE: Sling - Scheduler Support
Date Wed, 23 Jan 2008 11:23:27 GMT
Online report : http://vmbuild.apache.org/continuum/buildResult.action?buildId=40753&projectId=304

Build statistics:
  State: Failed
  Previous State: Ok
  Started at: Wed 23 Jan 2008 03:23:06 -0800
  Finished at: Wed 23 Jan 2008 03:23:18 -0800
  Total time: 12s
  Build Trigger: Schedule
  Build Number: 24
  Exit code: 1
  Building machine hostname: vmbuild.apache.org
  Operating system : Linux(unknown)
  Java Home version : 
          java version "1.6.0"
          Java(TM) SE Runtime Environment (build 1.6.0-b105)
          Java HotSpot(TM) Client VM (build 1.6.0-b105, mixed mode, sharing)
        
  Builder version :
          Maven version: 2.0.7
          Java version: 1.6.0
          OS name: "linux" version: "2.6.20-16-server" arch: "i386"
    
****************************************************************************
SCM Changes:
****************************************************************************
No files changed

****************************************************************************
Dependencies Changes:
****************************************************************************
org.apache.sling:org.apache.sling.api:2.0.0-incubator-SNAPSHOT


****************************************************************************
Build Defintion:
****************************************************************************
POM filename: pom.xml
Goals: clean install   
Arguments: --batch-mode --non-recursive
Build Fresh: false
Always Build: false
Default Build Definition: true
Schedule: DEFAULT_SCHEDULE
Description: 


****************************************************************************
Test Summary:
****************************************************************************
Tests: 0
Failures: 0
Total time: 0

****************************************************************************
Output:
****************************************************************************
[INFO] Scanning for projects...
WAGON_VERSION: 1.0-beta-1
[INFO] ----------------------------------------------------------------------------
[INFO] Building Sling - Scheduler Support
[INFO]    task-segment: [clean, install]
[INFO] ----------------------------------------------------------------------------
[INFO] [clean:clean]
[INFO] Deleting directory /home/continuum/data/working-directory/304/target
[INFO] Deleting directory /home/continuum/data/working-directory/304/target/classes
[INFO] Deleting directory /home/continuum/data/working-directory/304/target/test-classes
[INFO] Deleting directory /home/continuum/data/working-directory/304/target/site
[INFO] [enforcer:enforce {execution: enforce-java}]
[INFO] [resources:resources]
[INFO] Using default encoding to copy filtered resources.
[INFO] [compiler:compile]
[INFO] Compiling 6 source files to /home/continuum/data/working-directory/304/target/classes
[INFO] ------------------------------------------------------------------------
[ERROR] BUILD FAILURE
[INFO] ------------------------------------------------------------------------
[INFO] Compilation failure

/home/continuum/data/working-directory/304/src/main/java/org/apache/sling/scheduler/impl/ServiceLocatorImpl.java:[29,36]
cannot find symbol
symbol  : class ServiceNotAvailableException
location: package org.apache.sling.api.services

/home/continuum/data/working-directory/304/src/main/java/org/apache/sling/scheduler/impl/ServiceLocatorImpl.java:[59,19]
cannot find symbol
symbol  : class ServiceNotAvailableException
location: class org.apache.sling.scheduler.impl.ServiceLocatorImpl

/home/continuum/data/working-directory/304/src/main/java/org/apache/sling/scheduler/impl/ServiceLocatorImpl.java:[62,22]
cannot find symbol
symbol  : class ServiceNotAvailableException
location: class org.apache.sling.scheduler.impl.ServiceLocatorImpl

/home/continuum/data/working-directory/304/src/main/java/org/apache/sling/scheduler/impl/ServiceLocatorImpl.java:[112,18]
cannot find symbol
symbol  : constructor InvalidServiceFilterSyntaxException(java.lang.String,org.osgi.framework.InvalidSyntaxException)
location: class org.apache.sling.api.services.InvalidServiceFilterSyntaxException


[INFO] ------------------------------------------------------------------------
[INFO] For more information, run Maven with the -e switch
[INFO] ------------------------------------------------------------------------
[INFO] Total time: 5 seconds
[INFO] Finished at: Wed Jan 23 03:23:18 PST 2008
[INFO] Final Memory: 9M/17M
[INFO] ------------------------------------------------------------------------

****************************************************************************



Mime
View raw message