incubator-sling-commits mailing list archives

Site index · List index
Message view « Date » · « Thread »
Top « Date » · « Thread »
From Continuum VMBuild Server <contin...@apache.org>
Subject [continuum] BUILD FAILURE: Sling - Scripting - JSP Support
Date Mon, 17 Dec 2007 16:26:52 GMT
Online report : http://vmbuild.apache.org/continuum/buildResult.action?buildId=28798&projectId=308

Build statistics:
  State: Failed
  Previous State: Ok
  Started at: Mon 17 Dec 2007 08:24:59 -0800
  Finished at: Mon 17 Dec 2007 08:25:25 -0800
  Total time: 25s
  Build Trigger: Schedule
  Build Number: 8
  Exit code: 1
  Building machine hostname: vmbuild.apache.org
  Operating system : Linux(unknown)
  Java Home version : 
          java version "1.6.0"
          Java(TM) SE Runtime Environment (build 1.6.0-b105)
          Java HotSpot(TM) Client VM (build 1.6.0-b105, mixed mode, sharing)
        
  Builder version :
          Maven version: 2.0.7
          Java version: 1.6.0
          OS name: "linux" version: "2.6.20-16-server" arch: "i386"
    
****************************************************************************
SCM Changes:
****************************************************************************
No files changed

****************************************************************************
Dependencies Changes:
****************************************************************************
org.apache.sling:org.apache.sling.api:2.0.0-incubator-SNAPSHOT

org.apache.sling:org.apache.sling.core:2.0.0-incubator-SNAPSHOT


****************************************************************************
Build Defintion:
****************************************************************************
POM filename: pom.xml
Goals: clean install   
Arguments: --batch-mode --non-recursive
Build Fresh: false
Always Build: false
Default Build Definition: true
Schedule: DEFAULT_SCHEDULE
Description: 


****************************************************************************
Test Summary:
****************************************************************************
Tests: 0
Failures: 0
Total time: 0

****************************************************************************
Output:
****************************************************************************
[INFO] Scanning for projects...
WAGON_VERSION: 1.0-beta-1
[INFO] ----------------------------------------------------------------------------
[INFO] Building Sling - Scripting - JSP Support
[INFO]    task-segment: [clean, install]
[INFO] ----------------------------------------------------------------------------
[INFO] [clean:clean]
[INFO] Deleting directory /home/continuum/data/working-directory/308/target
[INFO] Deleting directory /home/continuum/data/working-directory/308/target/classes
[INFO] Deleting directory /home/continuum/data/working-directory/308/target/test-classes
[INFO] Deleting directory /home/continuum/data/working-directory/308/target/site
[INFO] [enforcer:enforce {execution: enforce-java}]
[INFO] [resources:resources]
[INFO] Using default encoding to copy filtered resources.
[INFO] [compiler:compile]
[INFO] Compiling 119 source files to /home/continuum/data/working-directory/308/target/classes
[INFO] ------------------------------------------------------------------------
[ERROR] BUILD FAILURE
[INFO] ------------------------------------------------------------------------
[INFO] Compilation failure

/home/continuum/data/working-directory/308/src/main/java/org/apache/sling/scripting/jsp/JspScriptHandler.java:[28,37]
cannot find symbol
symbol  : class SlingScriptEngine
location: package org.apache.sling.api.scripting

/home/continuum/data/working-directory/308/src/main/java/org/apache/sling/scripting/jsp/JspScriptHandler.java:[63,41]
cannot find symbol
symbol: class SlingScriptEngine
public class JspScriptHandler implements SlingScriptEngine {

/home/continuum/data/working-directory/308/src/main/java/org/apache/sling/scripting/jsp/JspScriptHandler.java:[115,62]
cannot find symbol
symbol  : variable SLING
location: class org.apache.sling.scripting.jsp.JspScriptHandler


[INFO] ------------------------------------------------------------------------
[INFO] For more information, run Maven with the -e switch
[INFO] ------------------------------------------------------------------------
[INFO] Total time: 17 seconds
[INFO] Finished at: Mon Dec 17 08:25:23 PST 2007
[INFO] Final Memory: 9M/28M
[INFO] ------------------------------------------------------------------------

****************************************************************************



Mime
View raw message