incubator-sling-commits mailing list archives

Site index · List index
Message view « Date » · « Thread »
Top « Date » · « Thread »
From Continuum VMBuild Server <contin...@apache.org>
Subject [continuum] BUILD FAILURE: Sling - Resource Loading and Mapping Management
Date Mon, 17 Dec 2007 18:20:48 GMT
Online report : http://vmbuild.apache.org/continuum/buildResult.action?buildId=28824&projectId=298

Build statistics:
  State: Failed
  Previous State: Error
  Started at: Mon 17 Dec 2007 10:18:19 -0800
  Finished at: Mon 17 Dec 2007 10:20:39 -0800
  Total time: 2m 20s
  Build Trigger: Schedule
  Build Number: 7
  Exit code: 1
  Building machine hostname: vmbuild.apache.org
  Operating system : Linux(unknown)
  Java Home version : 
          java version "1.6.0"
          Java(TM) SE Runtime Environment (build 1.6.0-b105)
          Java HotSpot(TM) Client VM (build 1.6.0-b105, mixed mode, sharing)
        
  Builder version :
          Maven version: 2.0.7
          Java version: 1.6.0
          OS name: "linux" version: "2.6.20-16-server" arch: "i386"
    
****************************************************************************
SCM Changes:
****************************************************************************
No files changed

****************************************************************************
Dependencies Changes:
****************************************************************************
org.apache.sling:org.apache.sling.commons.json:2.0.0-incubator-SNAPSHOT


****************************************************************************
Build Defintion:
****************************************************************************
POM filename: pom.xml
Goals: clean install   
Arguments: --batch-mode --non-recursive
Build Fresh: false
Always Build: false
Default Build Definition: true
Schedule: DEFAULT_SCHEDULE
Description: 


****************************************************************************
Test Summary:
****************************************************************************
Tests: 39
Failures: 19
Total time: 112622

****************************************************************************
Output:
****************************************************************************
[INFO] Scanning for projects...
WAGON_VERSION: 1.0-beta-1
[INFO] ----------------------------------------------------------------------------
[INFO] Building Sling - Resource Loading and Mapping Management
[INFO]    task-segment: [clean, install]
[INFO] ----------------------------------------------------------------------------
[INFO] [clean:clean]
[INFO] Deleting directory /home/continuum/data/working-directory/298/target
[INFO] Deleting directory /home/continuum/data/working-directory/298/target/classes
[INFO] Deleting directory /home/continuum/data/working-directory/298/target/test-classes
[INFO] Deleting directory /home/continuum/data/working-directory/298/target/site
[INFO] [enforcer:enforce {execution: enforce-java}]
[INFO] [jcrocm:ocm {execution: generate-JCR-OCM-descriptor}]
[INFO] Generating 2 OCM Mapping Descriptors to /home/continuum/data/working-directory/298/target/sling-generated/SLING-INF/mappings.xml
[INFO] [resources:resources]
[INFO] Using default encoding to copy filtered resources.
[INFO] [compiler:compile]
[INFO] Compiling 39 source files to /home/continuum/data/working-directory/298/target/classes
[INFO] [scr:scr {execution: generate-scr-scrdescriptor}]
[INFO] Generating 2 MetaType Descriptors to /home/continuum/data/working-directory/298/target/scr-plugin-generated/OSGI-INF/metatype/metatype.xml
[INFO] Generating 1 Service Component Descriptors to /home/continuum/data/working-directory/298/target/scr-plugin-generated/OSGI-INF/serviceComponents.xml
[INFO] [resources:testResources]
[INFO] Using default encoding to copy filtered resources.
[INFO] [compiler:testCompile]
[INFO] Compiling 10 source files to /home/continuum/data/working-directory/298/target/test-classes
[INFO] [surefire:test]
[INFO] Surefire report directory: /home/continuum/data/working-directory/298/target/surefire-reports

-------------------------------------------------------
 T E S T S
-------------------------------------------------------
Running org.apache.sling.jcr.resource.internal.helper.ResourcePathIteratorTest
Tests run: 8, Failures: 0, Errors: 0, Skipped: 0, Time elapsed: 0.071 sec
Running org.apache.sling.jcr.resource.internal.JcrResourceManagerTest
481 [main] INFO org.apache.jackrabbit.core.RepositoryImpl - Starting repository...
821 [main] INFO org.apache.jackrabbit.core.fs.local.LocalFileSystem - LocalFileSystem initialized
at path target/repository/repository
1075 [main] INFO org.apache.jackrabbit.core.nodetype.NodeTypeRegistry - no custom node type
definitions found
1113 [main] INFO org.apache.jackrabbit.core.fs.local.LocalFileSystem - LocalFileSystem initialized
at path target/repository/version
69549 [main] INFO org.apache.jackrabbit.core.fs.local.LocalFileSystem - LocalFileSystem initialized
at path target/repository/version/blobs
70120 [main] INFO org.apache.jackrabbit.core.RepositoryImpl - initializing workspace 'default'...
70120 [main] INFO org.apache.jackrabbit.core.fs.local.LocalFileSystem - LocalFileSystem initialized
at path target/repository/workspaces/default
97720 [main] INFO org.apache.jackrabbit.core.fs.local.LocalFileSystem - LocalFileSystem initialized
at path target/repository/workspaces/default/blobs
97804 [main] INFO org.apache.jackrabbit.core.RepositoryImpl - workspace 'default' initialized
98292 [main] INFO org.apache.jackrabbit.core.fs.local.LocalFileSystem - LocalFileSystem initialized
at path target/repository/repository/index
98427 [main] INFO org.apache.jackrabbit.core.state.CacheManager - resizeAll size=4
99850 [main] INFO org.apache.jackrabbit.core.state.CacheManager - resizeAll size=4
100549 [main] INFO org.apache.jackrabbit.core.query.lucene.SearchIndex - Index initialized:
target/repository/repository/index
100549 [main] INFO org.apache.jackrabbit.core.fs.local.LocalFileSystem - LocalFileSystem initialized
at path target/repository/workspaces/default/index
100558 [main] INFO org.apache.jackrabbit.core.query.lucene.SearchIndex - Index initialized:
target/repository/workspaces/default/index
100559 [main] INFO org.apache.jackrabbit.core.RepositoryImpl - Repository started
102491 [main] INFO org.apache.sling.jcr.resource.internal.JcrResourceManagerFactoryImpl -
getResource: Found JCR Node Resource at path '/test1197915629201'
102527 [main] INFO org.apache.jackrabbit.core.RepositoryImpl - Shutting down repository...
102528 [IndexMerger] INFO org.apache.jackrabbit.core.query.lucene.IndexMerger - IndexMerger
terminated
103174 [main] INFO org.apache.jackrabbit.core.query.lucene.SearchIndex - Index closed: target/repository/repository/index
103174 [main] INFO org.apache.jackrabbit.core.RepositoryImpl - shutting down workspace 'default'...
103175 [main] INFO org.apache.jackrabbit.core.observation.ObservationDispatcher - Notification
of EventListeners stopped.
103175 [IndexMerger] INFO org.apache.jackrabbit.core.query.lucene.IndexMerger - IndexMerger
terminated
103182 [main] INFO org.apache.jackrabbit.core.query.lucene.SearchIndex - Index closed: target/repository/workspaces/default/index
103399 [main] INFO org.apache.jackrabbit.core.persistence.db.DerbyPersistenceManager - Database
'target/repository/workspaces/default/db' shutdown.
103399 [main] INFO org.apache.jackrabbit.core.RepositoryImpl - workspace 'default' has been
shutdown
103585 [main] INFO org.apache.jackrabbit.core.persistence.db.DerbyPersistenceManager - Database
'target/repository/version/db' shutdown.
103586 [main] INFO org.apache.jackrabbit.core.RepositoryImpl - Repository has been shutdown
103595 [main] INFO org.apache.jackrabbit.core.RepositoryImpl - Starting repository...
103596 [main] INFO org.apache.jackrabbit.core.fs.local.LocalFileSystem - LocalFileSystem initialized
at path target/repository/repository
103634 [main] INFO org.apache.jackrabbit.core.nodetype.NodeTypeRegistry - no custom node type
definitions found
103635 [main] INFO org.apache.jackrabbit.core.fs.local.LocalFileSystem - LocalFileSystem initialized
at path target/repository/version
104106 [main] INFO org.apache.jackrabbit.core.fs.local.LocalFileSystem - LocalFileSystem initialized
at path target/repository/version/blobs
104107 [main] INFO org.apache.jackrabbit.core.RepositoryImpl - initializing workspace 'default'...
104108 [main] INFO org.apache.jackrabbit.core.fs.local.LocalFileSystem - LocalFileSystem initialized
at path target/repository/workspaces/default
104430 [main] INFO org.apache.jackrabbit.core.fs.local.LocalFileSystem - LocalFileSystem initialized
at path target/repository/workspaces/default/blobs
104500 [main] INFO org.apache.jackrabbit.core.RepositoryImpl - workspace 'default' initialized
104510 [main] INFO org.apache.jackrabbit.core.fs.local.LocalFileSystem - LocalFileSystem initialized
at path target/repository/repository/index
104529 [main] INFO org.apache.jackrabbit.core.query.lucene.SearchIndex - Index initialized:
target/repository/repository/index
104533 [main] INFO org.apache.jackrabbit.core.fs.local.LocalFileSystem - LocalFileSystem initialized
at path target/repository/workspaces/default/index
104535 [main] INFO org.apache.jackrabbit.core.query.lucene.SearchIndex - Index initialized:
target/repository/workspaces/default/index
104535 [main] INFO org.apache.jackrabbit.core.RepositoryImpl - Repository started
106551 [main] INFO org.apache.sling.jcr.resource.internal.JcrResourceManagerFactoryImpl -
getResource: Found JCR Node Resource at path '/test1197915631375'
106552 [main] INFO org.apache.sling.jcr.resource.internal.JcrResourceManagerFactoryImpl -
getResource: Found JCR Node Resource at path '/test1197915631375'
106553 [main] INFO org.apache.sling.jcr.resource.internal.JcrResourceManagerFactoryImpl -
getResource: Found JCR Node Resource at path '/test1197915631375'
106553 [main] INFO org.apache.sling.jcr.resource.internal.JcrResourceManager - Could not resolve
URL /test11979156313751197915633391 to a Resource
107730 [main] INFO org.apache.jackrabbit.core.RepositoryImpl - Shutting down repository...
107731 [IndexMerger] INFO org.apache.jackrabbit.core.query.lucene.IndexMerger - IndexMerger
terminated
107734 [main] INFO org.apache.jackrabbit.core.query.lucene.SearchIndex - Index closed: target/repository/repository/index
107735 [main] INFO org.apache.jackrabbit.core.RepositoryImpl - shutting down workspace 'default'...
107735 [main] INFO org.apache.jackrabbit.core.observation.ObservationDispatcher - Notification
of EventListeners stopped.
107736 [IndexMerger] INFO org.apache.jackrabbit.core.query.lucene.IndexMerger - IndexMerger
terminated
107737 [main] INFO org.apache.jackrabbit.core.query.lucene.SearchIndex - Index closed: target/repository/workspaces/default/index
112120 [main] INFO org.apache.jackrabbit.core.persistence.db.DerbyPersistenceManager - Database
'target/repository/workspaces/default/db' shutdown.
112121 [main] INFO org.apache.jackrabbit.core.RepositoryImpl - workspace 'default' has been
shutdown
112298 [main] INFO org.apache.jackrabbit.core.persistence.db.DerbyPersistenceManager - Database
'target/repository/version/db' shutdown.
112300 [main] INFO org.apache.jackrabbit.core.RepositoryImpl - Repository has been shutdown
Tests run: 2, Failures: 0, Errors: 0, Skipped: 0, Time elapsed: 112.413 sec
Running org.apache.sling.jcr.resource.internal.helper.JcrNodeResourceIteratorTest
Tests run: 3, Failures: 0, Errors: 0, Skipped: 0, Time elapsed: 0.014 sec
Running org.apache.sling.jcr.resource.internal.helper.ResourceProviderEntryTest
Tests run: 5, Failures: 0, Errors: 0, Skipped: 0, Time elapsed: 0.006 sec
Running org.apache.sling.jcr.resource.internal.loader.JsonReaderTest
Tests run: 19, Failures: 0, Errors: 19, Skipped: 0, Time elapsed: 0.146 sec <<< FAILURE!
Running org.apache.sling.jcr.resource.JcrResourceUtilTest
112473 [main] ERROR org.apache.sling.jcr.resource.JcrResourceUtil - normalize: Path '/..'
cannot be resolved
112473 [main] ERROR org.apache.sling.jcr.resource.JcrResourceUtil - normalize: Path '/..'
cannot be resolved
112473 [main] ERROR org.apache.sling.jcr.resource.JcrResourceUtil - normalize: Path '/a/b/../../..'
cannot be resolved
112473 [main] ERROR org.apache.sling.jcr.resource.JcrResourceUtil - normalize: Path '/..'
cannot be resolved
112473 [main] ERROR org.apache.sling.jcr.resource.JcrResourceUtil - normalize: Path '/..'
cannot be resolved
112474 [main] ERROR org.apache.sling.jcr.resource.JcrResourceUtil - normalize: Path '/az/bz/../../..'
cannot be resolved
112474 [main] ERROR org.apache.sling.jcr.resource.JcrResourceUtil - normalize: Path '/a/b/../../../c'
cannot be resolved
112474 [main] ERROR org.apache.sling.jcr.resource.JcrResourceUtil - normalize: Path '/az/bz/../../../cz'
cannot be resolved
112475 [main] ERROR org.apache.sling.jcr.resource.JcrResourceUtil - normalize: Path 'a/b/../../../c'
cannot be resolved
112475 [main] ERROR org.apache.sling.jcr.resource.JcrResourceUtil - normalize: Not modifying
empty path
Tests run: 2, Failures: 0, Errors: 0, Skipped: 0, Time elapsed: 0.006 sec

Results :

Tests in error: 
  testEmpty(org.apache.sling.jcr.resource.internal.loader.JsonReaderTest)
  testEmptyObject(org.apache.sling.jcr.resource.internal.loader.JsonReaderTest)
  testDefaultPrimaryNodeType(org.apache.sling.jcr.resource.internal.loader.JsonReaderTest)
  testDefaultPrimaryNodeTypeWithSurroundWhitespace(org.apache.sling.jcr.resource.internal.loader.JsonReaderTest)
  testDefaultPrimaryNodeTypeWithoutEnclosingBraces(org.apache.sling.jcr.resource.internal.loader.JsonReaderTest)
  testDefaultPrimaryNodeTypeWithoutEnclosingBracesWithSurroundWhitespace(org.apache.sling.jcr.resource.internal.loader.JsonReaderTest)
  testExplicitePrimaryNodeType(org.apache.sling.jcr.resource.internal.loader.JsonReaderTest)
  testMixinNodeTypes1(org.apache.sling.jcr.resource.internal.loader.JsonReaderTest)
  testMixinNodeTypes2(org.apache.sling.jcr.resource.internal.loader.JsonReaderTest)
  testPropertiesNone(org.apache.sling.jcr.resource.internal.loader.JsonReaderTest)
  testPropertiesSingleValue(org.apache.sling.jcr.resource.internal.loader.JsonReaderTest)
  testPropertiesTwoSingleValue(org.apache.sling.jcr.resource.internal.loader.JsonReaderTest)
  testPropertiesMultiValue(org.apache.sling.jcr.resource.internal.loader.JsonReaderTest)
  testPropertiesMultiValueEmpty(org.apache.sling.jcr.resource.internal.loader.JsonReaderTest)
  testChildrenNone(org.apache.sling.jcr.resource.internal.loader.JsonReaderTest)
  testChild(org.apache.sling.jcr.resource.internal.loader.JsonReaderTest)
  testChildWithMixin(org.apache.sling.jcr.resource.internal.loader.JsonReaderTest)
  testTwoChildren(org.apache.sling.jcr.resource.internal.loader.JsonReaderTest)
  testChildWithProperty(org.apache.sling.jcr.resource.internal.loader.JsonReaderTest)

Tests run: 39, Failures: 0, Errors: 19, Skipped: 0

[INFO] ------------------------------------------------------------------------
[ERROR] BUILD FAILURE
[INFO] ------------------------------------------------------------------------
[INFO] There are test failures.
[INFO] ------------------------------------------------------------------------
[INFO] For more information, run Maven with the -e switch
[INFO] ------------------------------------------------------------------------
[INFO] Total time: 2 minutes 14 seconds
[INFO] Finished at: Mon Dec 17 10:20:39 PST 2007
[INFO] Final Memory: 15M/27M
[INFO] ------------------------------------------------------------------------

****************************************************************************



Mime
View raw message