incubator-s4-user mailing list archives

Site index · List index
Message view « Date » · « Thread »
Top « Date » · « Thread »
From Matthieu Morel <mmo...@apache.org>
Subject Re: 'failed to build myApp in s4 piper walkthrough '
Date Thu, 30 May 2013 13:48:50 GMT
Can you please try with S4 0.6.0?

Thanks,

Matthieu


On May 30, 2013, at 15:40 , Aboubakr Benabbas wrote:

> besides, this is the first part of the log :
> 
> BUILD FAILED
> 
> Total time: 2.105 secs
> 14:59:22.809 [main] ERROR org.apache.s4.tools.Package - Cannot deploy app
> org.gradle.tooling.BuildException: Could not execute build using Gradle distribution
'http://services.gradle.org/distributions/gradle-1.0-bin.zip'.
>     at org.gradle.tooling.internal.consumer.ResultHandlerAdapter.onFailure(ResultHandlerAdapter.java:53)
~[gradle-tooling-api-1.0.jar:1.0]
>     at org.gradle.tooling.internal.consumer.async.DefaultAsyncConnection$3.run(DefaultAsyncConnection.java:81)
~[gradle-tooling-api-1.0.jar:1.0]
>     at org.gradle.messaging.concurrent.DefaultExecutorFactory$StoppableExecutorImpl$1.run(DefaultExecutorFactory.java:66)
~[gradle-core-1.0.jar:1.0]
>     at java.util.concurrent.ThreadPoolExecutor.runWorker(ThreadPoolExecutor.java:1146)
~[na:1.6.0_27]
>     at java.util.concurrent.ThreadPoolExecutor$Worker.run(ThreadPoolExecutor.java:615)
~[na:1.6.0_27]
>     at java.lang.Thread.run(Thread.java:679) ~[na:1.6.0_27]
> Caused by: org.gradle.api.internal.LocationAwareException: Could not resolve all dependencies
for configuration ':compile'.
>     at org.gradle.initialization.DefaultExceptionAnalyser.transform(DefaultExceptionAnalyser.java:85)
~[gradle-core-1.0.jar:1.0]
>     at org.gradle.initialization.DefaultGradleLauncher.doBuild(DefaultGradleLauncher.java:112)
~[gradle-core-1.0.jar:1.0]
>     at org.gradle.initialization.DefaultGradleLauncher.run(DefaultGradleLauncher.java:78)
~[gradle-core-1.0.jar:1.0]
>     at org.gradle.tooling.internal.provider.ExecuteBuildAction.run(ExecuteBuildAction.java:31)
~[na:na]
>     at org.gradle.tooling.internal.provider.ConfiguringBuildAction.run(ConfiguringBuildAction.java:94)
~[na:na]
>     at org.gradle.launcher.daemon.protocol.Build.run(Build.java:68) ~[na:na]
>     at org.gradle.launcher.daemon.protocol.Build.run(Build.java:64) ~[na:na]
>     at org.gradle.launcher.daemon.server.exec.ExecuteBuild.doBuild(ExecuteBuild.java:45)
~[na:na]
>     at org.gradle.launcher.daemon.server.exec.BuildCommandOnly.execute(BuildCommandOnly.java:34)
~[na:na]
>     at org.gradle.launcher.daemon.server.exec.DaemonCommandExecution.proceed(DaemonCommandExecution.java:122)
~[na:na]
>     at org.gradle.launcher.daemon.server.exec.WatchForDisconnection.execute(WatchForDisconnection.java:45)
~[na:na]
>     at org.gradle.launcher.daemon.server.exec.DaemonCommandExecution.proceed(DaemonCommandExecution.java:122)
~[na:na]
>     at org.gradle.launcher.daemon.server.exec.ResetDeprecationLogger.execute(ResetDeprecationLogger.java:24)
~[na:na]
>     at org.gradle.launcher.daemon.server.exec.DaemonCommandExecution.proceed(DaemonCommandExecution.java:122)
~[na:na]
>     at org.gradle.launcher.daemon.server.exec.StartStopIfBuildAndStop.execute(StartStopIfBuildAndStop.java:28)
~[na:na]
>     at org.gradle.launcher.daemon.server.exec.DaemonCommandExecution.proceed(DaemonCommandExecution.java:122)
~[na:na]
>     at org.gradle.launcher.daemon.server.exec.ReturnResult.execute(ReturnResult.java:34)
~[na:na]
>     at org.gradle.launcher.daemon.server.exec.DaemonCommandExecution.proceed(DaemonCommandExecution.java:122)
~[na:na]
>     at org.gradle.launcher.daemon.server.exec.ForwardClientInput$4.call(ForwardClientInput.java:116)
~[na:na]
>     at org.gradle.launcher.daemon.server.exec.ForwardClientInput$4.call(ForwardClientInput.java:114)
~[na:na]
>     at org.gradle.util.Swapper.swap(Swapper.java:38) ~[gradle-core-1.0.jar:1.0]
>     at org.gradle.launcher.daemon.server.exec.ForwardClientInput.execute(ForwardClientInput.java:114)
~[na:na]
>     at org.gradle.launcher.daemon.server.exec.DaemonCommandExecution.proceed(DaemonCommandExecution.java:122)
~[na:na]
>     at org.gradle.launcher.daemon.server.exec.LogToClient.doBuild(LogToClient.java:60)
~[na:na]
>     at org.gradle.launcher.daemon.server.exec.BuildCommandOnly.execute(BuildCommandOnly.java:34)
~[na:na]
>     at org.gradle.launcher.daemon.server.exec.DaemonCommandExecution.proceed(DaemonCommandExecution.java:122)
~[na:na]
>     at org.gradle.launcher.daemon.server.exec.EstablishBuildEnvironment.doBuild(EstablishBuildEnvironment.java:61)
~[na:na]
>     at org.gradle.launcher.daemon.server.exec.BuildCommandOnly.execute(BuildCommandOnly.java:34)
~[na:na]
>     at org.gradle.launcher.daemon.server.exec.DaemonCommandExecution.proceed(DaemonCommandExecution.java:122)
~[na:na]
>     at org.gradle.launcher.daemon.server.exec.StartBuildOrRespondWithBusy.doBuild(StartBuildOrRespondWithBusy.java:49)
~[na:na]
>     at org.gradle.launcher.daemon.server.exec.BuildCommandOnly.execute(BuildCommandOnly.java:34)
~[na:na]
>     at org.gradle.launcher.daemon.server.exec.DaemonCommandExecution.proceed(DaemonCommandExecution.java:122)
~[na:na]
>     at org.gradle.launcher.daemon.server.exec.HandleStop.execute(HandleStop.java:34)
~[na:na]
>     at org.gradle.launcher.daemon.server.exec.DaemonCommandExecution.proceed(DaemonCommandExecution.java:122)
~[na:na]
>     at org.gradle.launcher.daemon.server.exec.CatchAndForwardDaemonFailure.execute(CatchAndForwardDaemonFailure.java:32)
~[na:na]
>     at org.gradle.launcher.daemon.server.exec.DaemonCommandExecution.proceed(DaemonCommandExecution.java:122)
~[na:na]
>     at org.gradle.launcher.daemon.server.exec.HandleClientDisconnectBeforeSendingCommand.execute(HandleClientDisconnectBeforeSendingCommand.java:21)
~[na:na]
>     at org.gradle.launcher.daemon.server.exec.DaemonCommandExecution.proceed(DaemonCommandExecution.java:122)
~[na:na]
>     at org.gradle.launcher.daemon.server.exec.StopConnectionAfterExecution.execute(StopConnectionAfterExecution.java:27)
~[na:na]
>     at org.gradle.launcher.daemon.server.exec.DaemonCommandExecution.proceed(DaemonCommandExecution.java:122)
~[na:na]
>     at org.gradle.launcher.daemon.server.exec.DefaultDaemonCommandExecuter.executeCommand(DefaultDaemonCommandExecuter.java:55)
~[na:na]
>     at org.gradle.launcher.daemon.server.Daemon$1$1.run(Daemon.java:123) ~[na:na]
>     ... 4 common frames omitted
> org.gradle.messaging.remote.internal.PlaceholderException: Could not resolve all dependencies
for configuration ':compile'.
>     at org.gradle.api.internal.artifacts.ivyservice.ErrorHandlingArtifactDependencyResolver.wrapException(ErrorHandlingArtifactDependencyResolver.java:47)
~[na:na]
>     at org.gradle.api.internal.artifacts.ivyservice.ErrorHandlingArtifactDependencyResolver.access$000(ErrorHandlingArtifactDependencyResolver.java:26)
~[na:na]
>     at org.gradle.api.internal.artifacts.ivyservice.ErrorHandlingArtifactDependencyResolver$ErrorHandlingResolvedConfiguration.getFiles(ErrorHandlingArtifactDependencyResolver.java:80)
~[na:na]
>     at org.gradle.api.internal.artifacts.configurations.DefaultConfiguration$ConfigurationFileCollection.getFiles(DefaultConfiguration.java:460)
~[gradle-core-1.0.jar:1.0]
>     at org.gradle.api.internal.artifacts.configurations.DefaultConfiguration.getFiles(DefaultConfiguration.java:203)
~[gradle-core-1.0.jar:1.0]
>     at org.gradle.api.internal.artifacts.configurations.DefaultConfiguration_Decorated.getFiles(Unknown
Source) ~[na:na]
>     at org.gradle.api.internal.file.collections.DefaultFileCollectionResolveContext$FileTreeConverter.convertInto(DefaultFileCollectionResolveContext.java:191)
~[gradle-core-1.0.jar:1.0]
>     at org.gradle.api.internal.file.collections.DefaultFileCollectionResolveContext.doResolve(DefaultFileCollectionResolveContext.java:103)
~[gradle-core-1.0.jar:1.0]
>     at org.gradle.api.internal.file.collections.DefaultFileCollectionResolveContext.resolveAsFileTrees(DefaultFileCollectionResolveContext.java:75)
~[gradle-core-1.0.jar:1.0]
>     at org.gradle.api.internal.file.collections.DefaultFileCollectionResolveContext$FileTreeConverter.convertInto(DefaultFileCollectionResolveContext.java:182)
~[gradle-core-1.0.jar:1.0]
>     at org.gradle.api.internal.file.collections.DefaultFileCollectionResolveContext.doResolve(DefaultFileCollectionResolveContext.java:98)
~[gradle-core-1.0.jar:1.0]
>     at org.gradle.api.internal.file.collections.DefaultFileCollectionResolveContext.resolveAsFileTrees(DefaultFileCollectionResolveContext.java:75)
~[gradle-core-1.0.jar:1.0]
>     at org.gradle.api.internal.file.CompositeFileCollection$1.resolve(CompositeFileCollection.java:88)
~[gradle-core-1.0.jar:1.0]
>     at org.gradle.api.internal.file.CompositeFileCollection.getSourceCollections(CompositeFileCollection.java:143)
~[gradle-core-1.0.jar:1.0]
>     at org.gradle.api.internal.file.CompositeFileTree.getSourceCollections(CompositeFileTree.java:30)
~[gradle-core-1.0.jar:1.0]
>     at org.gradle.api.internal.file.CompositeFileCollection.getFiles(CompositeFileCollection.java:38)
~[gradle-core-1.0.jar:1.0]
>     at org.gradle.api.internal.file.AbstractFileCollection.iterator(AbstractFileCollection.java:60)
~[gradle-core-1.0.jar:1.0]
>     at org.gradle.api.internal.changedetection.DefaultFileSnapshotter.snapshot(DefaultFileSnapshotter.java:42)
~[gradle-core-1.0.jar:1.0]
>     at org.gradle.api.internal.changedetection.InputFilesChangedUpToDateRule.create(InputFilesChangedUpToDateRule.java:35)
~[gradle-core-1.0.jar:1.0]
>     at org.gradle.api.internal.changedetection.CompositeUpToDateRule.create(CompositeUpToDateRule.java:35)
~[gradle-core-1.0.jar:1.0]
>     at org.gradle.api.internal.changedetection.DefaultTaskArtifactStateRepository$HistoricExecution.calcCurrentState(DefaultTaskArtifactStateRepository.java:80)
~[gradle-core-1.0.jar:1.0]
>     at org.gradle.api.internal.changedetection.DefaultTaskArtifactStateRepository$HistoricExecution.isUpToDate(DefaultTaskArtifactStateRepository.java:88)
~[gradle-core-1.0.jar:1.0]
>     at org.gradle.api.internal.changedetection.DefaultTaskArtifactStateRepository$TaskArtifactStateImpl.isUpToDate(DefaultTaskArtifactStateRepository.java:128)
~[gradle-core-1.0.jar:1.0]
>     at org.gradle.api.internal.changedetection.ShortCircuitTaskArtifactStateRepository$ShortCircuitArtifactState.isUpToDate(ShortCircuitTaskArtifactStateRepository.java:77)
~[gradle-core-1.0.jar:1.0]
>     at org.gradle.api.internal.changedetection.FileCacheBroadcastTaskArtifactStateRepository$1.isUpToDate(FileCacheBroadcastTaskArtifactStateRepository.java:37)
~[gradle-core-1.0.jar:1.0]
>     at org.gradle.api.internal.tasks.execution.SkipUpToDateTaskExecuter.execute(SkipUpToDateTaskExecuter.java:44)
~[gradle-core-1.0.jar:1.0]
>     at org.gradle.api.internal.tasks.execution.ValidatingTaskExecuter.execute(ValidatingTaskExecuter.java:57)
~[gradle-core-1.0.jar:1.0]
>     at org.gradle.api.internal.tasks.execution.SkipEmptySourceFilesTaskExecuter.execute(SkipEmptySourceFilesTaskExecuter.java:41)
~[gradle-core-1.0.jar:1.0]
>     at org.gradle.api.internal.tasks.execution.SkipTaskWithNoActionsExecuter.execute(SkipTaskWithNoActionsExecuter.java:51)
~[gradle-core-1.0.jar:1.0]
>     at org.gradle.api.internal.tasks.execution.SkipOnlyIfTaskExecuter.execute(SkipOnlyIfTaskExecuter.java:52)
~[gradle-core-1.0.jar:1.0]
>     at org.gradle.api.internal.tasks.execution.ExecuteAtMostOnceTaskExecuter.execute(ExecuteAtMostOnceTaskExecuter.java:42)
~[gradle-core-1.0.jar:1.0]
>     at org.gradle.api.internal.AbstractTask.executeWithoutThrowingTaskFailure(AbstractTask.java:247)
~[gradle-core-1.0.jar:1.0]
>     at org.gradle.execution.DefaultTaskGraphExecuter.executeTask(DefaultTaskGraphExecuter.java:192)
~[gradle-core-1.0.jar:1.0]
>     at org.gradle.execution.DefaultTaskGraphExecuter.doExecute(DefaultTaskGraphExecuter.java:177)
~[gradle-core-1.0.jar:1.0]
>     at org.gradle.execution.DefaultTaskGraphExecuter.execute(DefaultTaskGraphExecuter.java:83)
~[gradle-core-1.0.jar:1.0]
>     at org.gradle.execution.SelectedTaskExecutionAction.execute(SelectedTaskExecutionAction.java:36)
~[gradle-core-1.0.jar:1.0]
>     at org.gradle.execution.DefaultBuildExecuter.execute(DefaultBuildExecuter.java:61)
~[gradle-core-1.0.jar:1.0]
>     at org.gradle.execution.DefaultBuildExecuter.access$200(DefaultBuildExecuter.java:23)
~[gradle-core-1.0.jar:1.0]
>     at org.gradle.execution.DefaultBuildExecuter$2.proceed(DefaultBuildExecuter.java:67)
~[gradle-core-1.0.jar:1.0]
>     at org.gradle.api.internal.changedetection.TaskCacheLockHandlingBuildExecuter$1.run(TaskCacheLockHandlingBuildExecuter.java:31)
~[gradle-core-1.0.jar:1.0]
>     at org.gradle.cache.internal.DefaultCacheAccess$1.create(DefaultCacheAccess.java:111)
~[gradle-core-1.0.jar:1.0]
>     at org.gradle.cache.internal.DefaultCacheAccess.useCache(DefaultCacheAccess.java:126)
~[gradle-core-1.0.jar:1.0]
>     at org.gradle.cache.internal.DefaultCacheAccess.useCache(DefaultCacheAccess.java:109)
~[gradle-core-1.0.jar:1.0]
>     at org.gradle.cache.internal.DefaultPersistentDirectoryStore.useCache(DefaultPersistentDirectoryStore.java:103)
~[gradle-core-1.0.jar:1.0]
>     at org.gradle.api.internal.changedetection.DefaultTaskArtifactStateCacheAccess.useCache(DefaultTaskArtifactStateCacheAccess.java:79)
~[gradle-core-1.0.jar:1.0]
>     at org.gradle.api.internal.changedetection.TaskCacheLockHandlingBuildExecuter.execute(TaskCacheLockHandlingBuildExecuter.java:29)
~[gradle-core-1.0.jar:1.0]
>     at org.gradle.execution.DefaultBuildExecuter.execute(DefaultBuildExecuter.java:61)
~[gradle-core-1.0.jar:1.0]
>     at org.gradle.execution.DefaultBuildExecuter.access$200(DefaultBuildExecuter.java:23)
~[gradle-core-1.0.jar:1.0]
>     at org.gradle.execution.DefaultBuildExecuter$2.proceed(DefaultBuildExecuter.java:67)
~[gradle-core-1.0.jar:1.0]
>     at org.gradle.execution.DryRunBuildExecutionAction.execute(DryRunBuildExecutionAction.java:32)
~[gradle-core-1.0.jar:1.0]
>     at org.gradle.execution.DefaultBuildExecuter.execute(DefaultBuildExecuter.java:61)
~[gradle-core-1.0.jar:1.0]
>     at org.gradle.execution.DefaultBuildExecuter.execute(DefaultBuildExecuter.java:54)
~[gradle-core-1.0.jar:1.0]
>     at org.gradle.initialization.DefaultGradleLauncher.doBuildStages(DefaultGradleLauncher.java:155)
~[gradle-core-1.0.jar:1.0]
>     at org.gradle.initialization.DefaultGradleLauncher.doBuild(DefaultGradleLauncher.java:110)
~[gradle-core-1.0.jar:1.0]
>     at org.gradle.initialization.DefaultGradleLauncher.run(DefaultGradleLauncher.java:78)
~[gradle-core-1.0.jar:1.0]
>     at org.gradle.tooling.internal.provider.ExecuteBuildAction.run(ExecuteBuildAction.java:31)
~[na:na]
>     at org.gradle.tooling.internal.provider.ConfiguringBuildAction.run(ConfiguringBuildAction.java:94)
~[na:na]
>     at org.gradle.launcher.daemon.protocol.Build.run(Build.java:68) ~[na:na]
>     at org.gradle.launcher.daemon.protocol.Build.run(Build.java:64) ~[na:na]
>     at org.gradle.launcher.daemon.server.exec.ExecuteBuild.doBuild(ExecuteBuild.java:45)
~[na:na]
>     at org.gradle.launcher.daemon.server.exec.BuildCommandOnly.execute(BuildCommandOnly.java:34)
~[na:na]
>     at org.gradle.launcher.daemon.server.exec.DaemonCommandExecution.proceed(DaemonCommandExecution.java:122)
~[na:na]
>     at org.gradle.launcher.daemon.server.exec.WatchForDisconnection.execute(WatchForDisconnection.java:45)
~[na:na]
>     at org.gradle.launcher.daemon.server.exec.DaemonCommandExecution.proceed(DaemonCommandExecution.java:122)
~[na:na]
>     at org.gradle.launcher.daemon.server.exec.ResetDeprecationLogger.execute(ResetDeprecationLogger.java:24)
~[na:na]
>     at org.gradle.launcher.daemon.server.exec.DaemonCommandExecution.proceed(DaemonCommandExecution.java:122)
~[na:na]
>     at org.gradle.launcher.daemon.server.exec.StartStopIfBuildAndStop.execute(StartStopIfBuildAndStop.java:28)
~[na:na]
>     at org.gradle.launcher.daemon.server.exec.DaemonCommandExecution.proceed(DaemonCommandExecution.java:122)
~[na:na]
>     at org.gradle.launcher.daemon.server.exec.ReturnResult.execute(ReturnResult.java:34)
~[na:na]
>     at org.gradle.launcher.daemon.server.exec.DaemonCommandExecution.proceed(DaemonCommandExecution.java:122)
~[na:na]
>     at org.gradle.launcher.daemon.server.exec.ForwardClientInput$4.call(ForwardClientInput.java:116)
~[na:na]
>     at org.gradle.launcher.daemon.server.exec.ForwardClientInput$4.call(ForwardClientInput.java:114)
~[na:na]
>     at org.gradle.util.Swapper.swap(Swapper.java:38) ~[gradle-core-1.0.jar:1.0]
>     at org.gradle.launcher.daemon.server.exec.ForwardClientInput.execute(ForwardClientInput.java:114)
~[na:na]
>     at org.gradle.launcher.daemon.server.exec.DaemonCommandExecution.proceed(DaemonCommandExecution.java:122)
~[na:na]
>     at org.gradle.launcher.daemon.server.exec.LogToClient.doBuild(LogToClient.java:60)
~[na:na]
>     at org.gradle.launcher.daemon.server.exec.BuildCommandOnly.execute(BuildCommandOnly.java:34)
~[na:na]
>     at org.gradle.launcher.daemon.server.exec.DaemonCommandExecution.proceed(DaemonCommandExecution.java:122)
~[na:na]
>     at org.gradle.launcher.daemon.server.exec.EstablishBuildEnvironment.doBuild(EstablishBuildEnvironment.java:61)
~[na:na]
>     at org.gradle.launcher.daemon.server.exec.BuildCommandOnly.execute(BuildCommandOnly.java:34)
~[na:na]
>     at org.gradle.launcher.daemon.server.exec.DaemonCommandExecution.proceed(DaemonCommandExecution.java:122)
~[na:na]
>     at org.gradle.launcher.daemon.server.exec.StartBuildOrRespondWithBusy.doBuild(StartBuildOrRespondWithBusy.java:49)
~[na:na]
>     at org.gradle.launcher.daemon.server.exec.BuildCommandOnly.execute(BuildCommandOnly.java:34)
~[na:na]
>     at org.gradle.launcher.daemon.server.exec.DaemonCommandExecution.proceed(DaemonCommandExecution.java:122)
~[na:na]
>     at org.gradle.launcher.daemon.server.exec.HandleStop.execute(HandleStop.java:34)
~[na:na]
>     at org.gradle.launcher.daemon.server.exec.DaemonCommandExecution.proceed(DaemonCommandExecution.java:122)
~[na:na]
>     at org.gradle.launcher.daemon.server.exec.CatchAndForwardDaemonFailure.execute(CatchAndForwardDaemonFailure.java:32)
~[na:na]
>     at org.gradle.launcher.daemon.server.exec.DaemonCommandExecution.proceed(DaemonCommandExecution.java:122)
~[na:na]
>     at org.gradle.launcher.daemon.server.exec.HandleClientDisconnectBeforeSendingCommand.execute(HandleClientDisconnectBeforeSendingCommand.java:21)
~[na:na]
>     at org.gradle.launcher.daemon.server.exec.DaemonCommandExecution.proceed(DaemonCommandExecution.java:122)
~[na:na]
>     at org.gradle.launcher.daemon.server.exec.StopConnectionAfterExecution.execute(StopConnectionAfterExecution.java:27)
~[na:na]
>     at org.gradle.launcher.daemon.server.exec.DaemonCommandExecution.proceed(DaemonCommandExecution.java:122)
~[na:na]
>     at org.gradle.launcher.daemon.server.exec.DefaultDaemonCommandExecuter.executeCommand(DefaultDaemonCommandExecuter.java:55)
~[na:na]
>     at org.gradle.launcher.daemon.server.Daemon$1$1.run(Daemon.java:123) ~[na:na]
>     at org.gradle.messaging.concurrent.DefaultExecutorFactory$StoppableExecutorImpl$1.run(DefaultExecutorFactory.java:66)
~[gradle-core-1.0.jar:1.0]
> Caused by: org.gradle.messaging.remote.internal.PlaceholderException: Artifact 'commons-logging:commons-logging:1.1.1@jar'
not found.
>     at org.gradle.api.internal.artifacts.ivyservice.ivyresolve.UserResolverChain$ModuleVersionRepositoryBackedArtifactResolver.resolve(UserResolverChain.java:168)
~[na:na]
>     at org.gradle.api.internal.artifacts.ivyservice.ivyresolve.LazyDependencyToModuleResolver$ErrorHandlingArtifactResolver.resolve(LazyDependencyToModuleResolver.java:59)
~[na:na]
>     at org.gradle.api.internal.artifacts.ivyservice.ResolvedArtifactFactory$1$1.create(ResolvedArtifactFactory.java:39)
~[na:na]
>     at org.gradle.api.internal.artifacts.ivyservice.ResolvedArtifactFactory$1$1.create(ResolvedArtifactFactory.java:37)
~[na:na]
>     at org.gradle.cache.internal.DefaultCacheAccess.useCache(DefaultCacheAccess.java:126)
~[gradle-core-1.0.jar:1.0]
>     at org.gradle.cache.internal.DefaultPersistentDirectoryStore.useCache(DefaultPersistentDirectoryStore.java:99)
~[gradle-core-1.0.jar:1.0]
>     at org.gradle.api.internal.artifacts.ivyservice.DefaultCacheLockingManager.useCache(DefaultCacheLockingManager.java:49)
~[na:na]
>     at org.gradle.api.internal.artifacts.ivyservice.ResolvedArtifactFactory$1.get(ResolvedArtifactFactory.java:37)
~[na:na]
>     at org.gradle.api.internal.artifacts.DefaultResolvedArtifact.getFile(DefaultResolvedArtifact.java:107)
~[na:na]
>     at org.gradle.api.internal.artifacts.ivyservice.DefaultLenientConfiguration$ArtifactFileResolver.getFile(DefaultLenientConfiguration.java:137)
~[na:na]
>     at org.gradle.api.internal.artifacts.ivyservice.DefaultLenientConfiguration.getFiles(DefaultLenientConfiguration.java:115)
~[na:na]
>     at org.gradle.api.internal.artifacts.ivyservice.DefaultLenientConfiguration.getFilesStrict(DefaultLenientConfiguration.java:98)
~[na:na]
>     at org.gradle.api.internal.artifacts.ivyservice.DefaultResolvedConfiguration.getFiles(DefaultResolvedConfiguration.java:45)
~[na:na]
>     at org.gradle.api.internal.artifacts.ivyservice.SelfResolvingDependencyResolver$1.getFiles(SelfResolvingDependencyResolver.java:56)
~[na:na]
>     at org.gradle.api.internal.artifacts.ivyservice.ErrorHandlingArtifactDependencyResolver$ErrorHandlingResolvedConfiguration.getFiles(ErrorHandlingArtifactDependencyResolver.java:78)
~[na:na]
>     ... 92 common frames omitted
> 
> Aboubakr Benabbas <aboubakr.benabbas@tu-ilmenau.de> schrieb:
> 
>> hi,
>> 
>> I actually tried it, but i got the same result
>> 
>>  
>> baojian Zhou schrieb:
>> 
>> i think that is caused by 'commons-logging:commons-logging:1.1.1@jar' not found,
it maybe means that your maven have something wrong,
>> you can try this, may can help you:
>> http://mail-archives.apache.org/mod_mbox/incubator-s4-user/201208.mbox/%3CF4DF62C8CDB9C746BE2BEFDB55D5E4760E97B854@PALLENE.office.hd%3E
>> 
>> 
>> 2013/5/30 Aboubakr Benabbas <aboubakr.benabbas@tu-ilmenau.de>
>> hi,
>> 
>> after building s4, i wanted to try it through the example in the s4 piper walkthrough
 page, when i reached the step to build "myApp", i got the following error after running :
>> 
>> ./s4 deploy -appName=myApp -c=cluster1 -b=`pwd`/build.gradle -a=hello.HelloApp
>> 
>>     at org.gradle.launcher.daemon.server.exec.BuildCommandOnly.execute(BuildCommandOnly.java:34)
~[na:na]
>>         at org.gradle.launcher.daemon.server.exec.DaemonCommandExecution.proceed(DaemonCommandExecution.java:122)
~[na:na]
>> 
>>         at org.gradle.launcher.daemon.server.exec.HandleStop.execute(HandleStop.java:34)
~[na:na]
>>         at org.gradle.launcher.daemon.server.exec.DaemonCommandExecution.proceed(DaemonCommandExecution.java:122)
~[na:na]
>> 
>>         at org.gradle.launcher.daemon.server.exec.CatchAndForwardDaemonFailure.execute(CatchAndForwardDaemonFailure.java:32)
~[na:na]
>>         at org.gradle.launcher.daemon.server.exec.DaemonCommandExecution.proceed(DaemonCommandExecution.java:122)
~[na:na]
>> 
>>         at org.gradle.launcher.daemon.server.exec.HandleClientDisconnectBeforeSendingCommand.execute(HandleClientDisconnectBeforeSendingCommand.java:21)
~[na:na]
>>         at org.gradle.launcher.daemon.server.exec.DaemonCommandExecution.proceed(DaemonCommandExecution.java:122)
~[na:na]
>> 
>>         at org.gradle.launcher.daemon.server.exec.StopConnectionAfterExecution.execute(StopConnectionAfterExecution.java:27)
~[na:na]
>>         at org.gradle.launcher.daemon.server.exec.DaemonCommandExecution.proceed(DaemonCommandExecution.java:122)
~[na:na]
>> 
>>         at org.gradle.launcher.daemon.server.exec.DefaultDaemonCommandExecuter.executeCommand(DefaultDaemonCommandExecuter.java:55)
~[na:na]
>>         at org.gradle.launcher.daemon.server.Daemon$1$1.run(Daemon.java:123) ~[na:na]
>> 
>>         at org.gradle.messaging.concurrent.DefaultExecutorFactory$StoppableExecutorImpl$1.run(DefaultExecutorFactory.java:66)
~[gradle-core-1.0.jar:1.0]
>> Caused by: org.gradle.messaging.remote.internal.PlaceholderException: Artifact 'commons-logging:commons-logging:1.1.1@jar'
not found.
>> 
>>         at org.gradle.api.internal.artifacts.ivyservice.ivyresolve.UserResolverChain$ModuleVersionRepositoryBackedArtifactResolver.resolve(UserResolverChain.java:168)
~[na:na]
>>         at org.gradle.api.internal.artifacts.ivyservice.ivyresolve.LazyDependencyToModuleResolver$ErrorHandlingArtifactResolver.resolve(LazyDependencyToModuleResolver.java:59)
~[na:na]
>> 
>>         at org.gradle.api.internal.artifacts.ivyservice.ResolvedArtifactFactory$1$1.create(ResolvedArtifactFactory.java:39)
~[na:na]
>>         at org.gradle.api.internal.artifacts.ivyservice.ResolvedArtifactFactory$1$1.create(ResolvedArtifactFactory.java:37)
~[na:na]
>> 
>>         at org.gradle.cache.internal.DefaultCacheAccess.useCache(DefaultCacheAccess.java:126)
~[gradle-core-1.0.jar:1.0]
>>         at org.gradle.cache.internal.DefaultPersistentDirectoryStore.useCache(DefaultPersistentDirectoryStore.java:99)
~[gradle-core-1.0.jar:1.0]
>> 
>>         at org.gradle.api.internal.artifacts.ivyservice.DefaultCacheLockingManager.useCache(DefaultCacheLockingManager.java:49)
~[na:na]
>>         at org.gradle.api.internal.artifacts.ivyservice.ResolvedArtifactFactory$1.get(ResolvedArtifactFactory.java:37)
~[na:na]
>> 
>>         at org.gradle.api.internal.artifacts.DefaultResolvedArtifact.getFile(DefaultResolvedArtifact.java:107)
~[na:na]
>>         at org.gradle.api.internal.artifacts.ivyservice.DefaultLenientConfiguration$ArtifactFileResolver.getFile(DefaultLenientConfiguration.java:137)
~[na:na]
>> 
>>         at org.gradle.api.internal.artifacts.ivyservice.DefaultLenientConfiguration.getFiles(DefaultLenientConfiguration.java:115)
~[na:na]
>>         at org.gradle.api.internal.artifacts.ivyservice.DefaultLenientConfiguration.getFilesStrict(DefaultLenientConfiguration.java:98)
~[na:na]
>> 
>>         at org.gradle.api.internal.artifacts.ivyservice.DefaultResolvedConfiguration.getFiles(DefaultResolvedConfiguration.java:45)
~[na:na]
>>         at org.gradle.api.internal.artifacts.ivyservice.SelfResolvingDependencyResolver$1.getFiles(SelfResolvingDependencyResolver.java:56)
~[na:na]
>> 
>>         at org.gradle.api.internal.artifacts.ivyservice.ErrorHandlingArtifactDependencyResolver$ErrorHandlingResolvedConfiguration.getFiles(ErrorHandlingArtifactDependencyResolver.java:78)
~[na:na]
>>         ... 92 common frames omitted
>> 
>> and it does not build, what is wrong ?
>>  
>  


Mime
View raw message