incubator-s4-dev mailing list archives

Site index · List index
Message view « Date » · « Thread »
Top « Date » · « Thread »
From "Oleg Tikhonov (JIRA)" <j...@apache.org>
Subject [jira] [Created] (S4-144) 0.6.0 tests failure
Date Sun, 15 Sep 2013 15:47:51 GMT
Oleg Tikhonov created S4-144:
--------------------------------

             Summary: 0.6.0 tests failure
                 Key: S4-144
                 URL: https://issues.apache.org/jira/browse/S4-144
             Project: Apache S4
          Issue Type: Bug
         Environment: Windows 7 x64, Ubuntu 13 x64.
            Reporter: Oleg Tikhonov
            Priority: Minor


I ran gradle build and got following:

"
org.apache.s4.comm.tcp.TCPBasicTest > testSingleMessage FAILED
    java.lang.RuntimeException

org.apache.s4.comm.topology.AssignmentsFromZKTest1 > testAssignmentFor1Cluster FAILED
    java.lang.RuntimeException

org.apache.s4.comm.topology.AssignmentsFromZKTest2 > testAssignmentFor2Clusters FAILED
    java.lang.RuntimeException

org.apache.s4.comm.topology.ClustersFromZKTest > testAssignmentFor2Topologies FAILED
    java.lang.RuntimeException

org.apache.s4.comm.udp.UDPBasicTest > testSingleMessage FAILED
    java.lang.RuntimeException

7 tests completed, 5 failed, 1 skipped
:s4-comm:test FAILED
"

Should we fix them or @Ignore? 


--
This message is automatically generated by JIRA.
If you think it was sent incorrectly, please contact your JIRA administrators
For more information on JIRA, see: http://www.atlassian.com/software/jira

Mime
View raw message