incubator-openmeetings-dev mailing list archives

Site index · List index
Message view « Date » · « Thread »
Top « Date » · « Thread »
From Apache Jenkins Server <jenk...@builds.apache.org>
Subject Build failed in Jenkins: Openmeetings #300
Date Thu, 06 Dec 2012 23:04:22 GMT
See <https://builds.apache.org/job/openmeetings/300/changes>

Changes:

[solomax] OPENMEETINGS-451 is fixed;
FillLabels test is updated: copy/paste removed, path concatenations are removed, ability to
pass base folder is added.
typos are fixed

[solomax] OPENMEETINGS-451 is partially fixed

[solomax] Compilation warnings are eliminated

[solomax] Possible Primary Key violation while adding MeetMe room is fixed

[solomax] Simple-xml library version is bumped; Red5 version is bumped

[solomax] OPENMEETINGS-448 import is tested on "real life" backup file
Simple library is updated

------------------------------------------
[...truncated 2320 lines...]
[ivy:resolve] ..................................................................................................................................................................................................................................................................................................................................................................
(2522kB)
[ivy:resolve] .. (0kB)
[ivy:resolve] 	[SUCCESSFUL ] org.apache.tomcat.embed#tomcat-embed-core;7.0.32!tomcat-embed-core.jar
(437ms)
[ivy:resolve] downloading http://repo1.maven.org/maven2/org/apache/tomcat/embed/tomcat-embed-jasper/7.0.32/tomcat-embed-jasper-7.0.32.jar
...
[ivy:resolve] .............................................................................
(770kB)
[ivy:resolve] .. (0kB)
[ivy:resolve] 	[SUCCESSFUL ] org.apache.tomcat.embed#tomcat-embed-jasper;7.0.32!tomcat-embed-jasper.jar
(243ms)
[ivy:resolve] downloading http://repo1.maven.org/maven2/org/apache/tomcat/embed/tomcat-embed-logging-juli/7.0.32/tomcat-embed-logging-juli-7.0.32.jar
...
[ivy:resolve] ...... (37kB)
[ivy:resolve] .. (0kB)
[ivy:resolve] 	[SUCCESSFUL ] org.apache.tomcat.embed#tomcat-embed-logging-juli;7.0.32!tomcat-embed-logging-juli.jar
(276ms)
[ivy:resolve] downloading http://repo1.maven.org/maven2/org/apache/tomcat/embed/tomcat-embed-logging-log4j/7.0.32/tomcat-embed-logging-log4j-7.0.32.jar
...
[ivy:resolve] ................ (81kB)
[ivy:resolve] .. (0kB)
[ivy:resolve] 	[SUCCESSFUL ] org.apache.tomcat.embed#tomcat-embed-logging-log4j;7.0.32!tomcat-embed-logging-log4j.jar
(239ms)
[ivy:resolve] downloading http://openlaszlo-openmeetings-integration.googlecode.com/svn/repository/tomcatplugin-1.4.jar
...
[ivy:resolve] ..... (43kB)
[ivy:resolve] 	[SUCCESSFUL ] tomcatplugin#tomcatplugin;1.4!tomcatplugin.jar (195ms)
[ivy:resolve] :: resolution report :: resolve 7876ms :: artifacts dl 1396ms
	---------------------------------------------------------------------
	|                  |            modules            ||   artifacts   |
	|       conf       | number| search|dwnlded|evicted|| number|dwnlded|
	---------------------------------------------------------------------
	|      tomcat7     |   5   |   5   |   4   |   0   ||   5   |   5   |
	---------------------------------------------------------------------
[ivy:retrieve] :: retrieving :: apache#openmeetings
[ivy:retrieve] 	confs: [tomcat7]
[ivy:retrieve] 	5 artifacts copied, 0 already retrieved (3455kB/16ms)

-library.check:
     [echo] Java: java.home is /x1/jenkins/tools/java/jdk1.6.0_32-32/jre and the target version
is 1.6
     [echo] Ant: ant.home is /home/jenkins/jenkins-slave/tools/Ant/ant-1.8.3 and the target
version is Apache Ant(TM) version 1.8.3 compiled on February 26 2012

-java6.check:
     [echo] Using Java 1.6 specification: 1.6

prepare:
    [mkdir] Created dir: /x1/jenkins/jenkins-slave/workspace/openmeetings/singlewebapp/build/red5/server/bin
    [mkdir] Created dir: /x1/jenkins/jenkins-slave/workspace/openmeetings/singlewebapp/build/red5/server/log
    [mkdir] Created dir: /x1/jenkins/jenkins-slave/workspace/openmeetings/singlewebapp/build/red5/server/dist/log
    [mkdir] Created dir: /x1/jenkins/jenkins-slave/workspace/openmeetings/singlewebapp/build/red5/server/bin/testcases/classes
    [mkdir] Created dir: /x1/jenkins/jenkins-slave/workspace/openmeetings/singlewebapp/build/red5/server/bin/testcases/testreports

compile:
     [echo] javac version: 1.6
     [echo] Not using the Eclipse IDE
     [echo] Compiler adapter name: modern

compile-core:

retrieve:
     [echo] Ivy conf name: java6
[ivy:resolve] :: Apache Ivy 2.3.0-rc1 - 20120416000235 :: http://ant.apache.org/ivy/ ::
[ivy:resolve] :: loading settings :: file = /x1/jenkins/jenkins-slave/workspace/openmeetings/singlewebapp/build/red5/server/ivysettings.xml
[ivy:resolve] :: resolving dependencies :: red5#server;working@hemera [not transitive]
[ivy:resolve] 	confs: [java6]
[ivy:resolve] 	found javax#javaee-api;5.1.2 in googlecode
[ivy:resolve] 	found org.springframework#spring-aop;3.1.1.RELEASE in central
[ivy:resolve] 	found org.springframework#spring-asm;3.1.1.RELEASE in central
[ivy:resolve] 	found org.springframework#spring-beans;3.1.1.RELEASE in central
[ivy:resolve] 	found org.springframework#spring-context;3.1.1.RELEASE in central
[ivy:resolve] 	found org.springframework#spring-context-support;3.1.1.RELEASE in central
[ivy:resolve] 	found org.springframework#spring-core;3.1.1.RELEASE in central
[ivy:resolve] 	found org.springframework#spring-expression;3.1.1.RELEASE in central
[ivy:resolve] 	found org.springframework#spring-web;3.1.1.RELEASE in central
[ivy:resolve] 	found org.slf4j#slf4j-api;1.6.6 in central
[ivy:resolve] 	found org.slf4j#jul-to-slf4j;1.6.6 in central
[ivy:resolve] 	found org.slf4j#log4j-over-slf4j;1.6.6 in central
[ivy:resolve] 	found org.slf4j#jcl-over-slf4j;1.6.6 in central
[ivy:resolve] 	found ch.qos.logback#logback-classic;1.0.3 in central
[ivy:resolve] 	found ch.qos.logback#logback-core;1.0.3 in central
[ivy:resolve] 	found red5#sysout-over-slf4j;1.0.2 in googlecode
[ivy:resolve] 	found org.apache.commons#commons-beanutils;1.8.3 in sonatype
[ivy:resolve] 	found org.apache.commons#commons-codec;1.6 in apache
[ivy:resolve] 	found org.apache.commons#commons-collections;3.2.1 in sonatype
[ivy:resolve] 	found org.apache.httpcomponents#httpcore;4.2.1 in central
[ivy:resolve] 	found org.apache.httpcomponents#httpclient;4.2 in central
[ivy:resolve] 	found org.apache.commons#commons-lang3;3.1 in central
[ivy:resolve] 	found org.apache.commons#commons-modeler;2.0.1 in sonatype
[ivy:resolve] 	found org.apache.commons#commons-pool;1.5.6 in apache
[ivy:resolve] 	found org.quartz-scheduler#quartz;1.8.5 in central
[ivy:resolve] 	found net.sf.ehcache#ehcache-core;2.5.0 in central
[ivy:resolve] 	found org.apache.xerces#com.springsource.org.apache.xerces;2.9.1 in springsource-external
[ivy:resolve] 	found red5#xmlrpc;2.0.1 in sonatype
[ivy:resolve] 	found org.objectweb.asm#com.springsource.org.objectweb.asm;3.2.0 in springsource-external
[ivy:resolve] 	found org.objectweb.asm#com.springsource.org.objectweb.asm.commons;3.2.0 in
springsource-external
[ivy:resolve] 	found org.antlr#com.springsource.org.antlr;3.1.3 in springsource-external
[ivy:resolve] 	found org.codehaus.groovy#com.springsource.org.codehaus.groovy;1.7.0 in springsource-external
[ivy:resolve] 	found org.jruby#jruby;1.6.7.2 in central
[ivy:resolve] 	found org.python#jython-standalone;2.5.2 in central
[ivy:resolve] 	found org.mozilla.javascript#com.springsource.org.mozilla.javascript;1.7.0.R2
in springsource-external
[ivy:resolve] 	found javax.xml.stream#com.springsource.javax.xml.stream;1.0.1 in springsource-external
[ivy:resolve] 	found org.bouncycastle#bcprov-jdk15on;1.47 in central
[ivy:resolve] 	found red5#jaudiotagger;2.0.4-SNAPSHOT in googlecode
[ivy:resolve] 	found net.sourceforge.cglib#com.springsource.net.sf.cglib;2.2.0 in springsource-external
[ivy:resolve] 	found org.aopalliance#com.springsource.org.aopalliance;1.0.0 in springsource-external
[ivy:resolve] 	found org.apache.mina#mina-integration-beans;2.0.5 in central
[ivy:resolve] 	found org.apache.mina#mina-integration-jmx;2.0.5 in central
[ivy:resolve] 	found org.apache.mina#mina-core;2.0.5 in central
[ivy:resolve] downloading http://oss.sonatype.org/content/repositories/central/commons-modeler/commons-modeler/2.0.1/commons-modeler-2.0.1.jar
...
[ivy:resolve] ................ (109kB)
[ivy:resolve] downloading http://repository.springsource.com/maven/bundles/external/org/apache/xerces/com.springsource.org.apache.xerces/2.9.1/com.springsource.org.apache.xerces-2.9.1.jar
...
[ivy:resolve] ..................................................................................................................................................................
(1215kB)
[ivy:resolve] .. (0kB)
[ivy:resolve] 	[SUCCESSFUL ] org.apache.xerces#com.springsource.org.apache.xerces;2.9.1!com.springsource.org.apache.xerces.jar
(1509ms)
[ivy:resolve] downloading http://oss.sonatype.org/content/repositories/central/xmlrpc/xmlrpc/2.0.1/xmlrpc-2.0.1.jar
...
[ivy:resolve] ................. (113kB)
[ivy:resolve] .. (0kB)
[ivy:resolve] 	[SUCCESSFUL ] red5#xmlrpc;2.0.1!xmlrpc.jar (889ms)
[ivy:resolve] downloading http://repository.springsource.com/maven/bundles/external/org/objectweb/asm/com.springsource.org.objectweb.asm/3.2.0/com.springsource.org.objectweb.asm-3.2.0.jar
...
[ivy:resolve] ........ (42kB)
[ivy:resolve] downloading http://repository.springsource.com/maven/bundles/external/org/objectweb/asm/com.springsource.org.objectweb.asm.commons/3.2.0/com.springsource.org.objectweb.asm.commons-3.2.0.jar
...
[ivy:resolve] ......... (37kB)
[ivy:resolve] .. (0kB)
[ivy:resolve] 	[SUCCESSFUL ] org.objectweb.asm#com.springsource.org.objectweb.asm.commons;3.2.0!com.springsource.org.objectweb.asm.commons.jar
(517ms)
[ivy:resolve] downloading http://repository.springsource.com/maven/bundles/external/org/antlr/com.springsource.org.antlr/3.1.3/com.springsource.org.antlr-3.1.3.jar
...
[ivy:resolve] ..........................................................................................................................................................................................................
(1629kB)
[ivy:resolve] downloading http://repository.springsource.com/maven/bundles/external/org/codehaus/groovy/com.springsource.org.codehaus.groovy/1.7.0/com.springsource.org.codehaus.groovy-1.7.0.jar
...
[ivy:resolve] ..................................................................................................................................................................................................................................................................................................................................................................................................
[ivy:resolve] ...........................................................................................
(4367kB)
[ivy:resolve] .. (0kB)
[ivy:resolve] 	[SUCCESSFUL ] org.codehaus.groovy#com.springsource.org.codehaus.groovy;1.7.0!com.springsource.org.codehaus.groovy.jar
(2331ms)
[ivy:resolve] downloading http://repo1.maven.org/maven2/org/jruby/jruby/1.6.7.2/jruby-1.6.7.2.jar
...
[ivy:resolve] .................................................................................................................................................................................................................................................................................................................................................................................................................................................................................................................................................................................................................................................................................................................................................................................................................................................................................................................................................................................................................................................................................................................................................................................................................................................................................................................................................................................................................................................................................................................................................................................................................................................................................................................................................................................................................................................................................................................................................................
(9782kB)
[ivy:resolve] .. (0kB)
[ivy:resolve] 	[SUCCESSFUL ] org.jruby#jruby;1.6.7.2!jruby.jar (437ms)
[ivy:resolve] downloading http://repo1.maven.org/maven2/org/python/jython-standalone/2.5.2/jython-standalone-2.5.2.jar
...
[ivy:resolve] ..............................................................................................................................................................................................................................................................................................................................................................................................................................................................................................................................................................................................................................................................................................................................................................................................................................................................................................................................................................................................................................................................................................................................................................................................................................................................................................................................................................................................................................................................................................................................................................................................................................................................................................................................................................................................................................................................................................................................................................................................................
(10040kB)
[ivy:resolve] .. (0kB)
[ivy:resolve] downloading http://repository.springsource.com/maven/bundles/external/org/mozilla/javascript/com.springsource.org.mozilla.javascript/1.7.0.R2/com.springsource.org.mozilla.javascript-1.7.0.R2.jar
...
[ivy:resolve] .....................................................................................................
(856kB)
[ivy:resolve] .. (0kB)
[ivy:resolve] 	[SUCCESSFUL ] org.mozilla.javascript#com.springsource.org.mozilla.javascript;1.7.0.R2!com.springsource.org.mozilla.javascript.jar
(1322ms)
[ivy:resolve] downloading http://repository.springsource.com/maven/bundles/external/javax/xml/stream/com.springsource.javax.xml.stream/1.0.1/com.springsource.javax.xml.stream-1.0.1.jar
...
[ivy:resolve] ...... (26kB)
[ivy:resolve] .. (0kB)
[ivy:resolve] 	[SUCCESSFUL ] javax.xml.stream#com.springsource.javax.xml.stream;1.0.1!com.springsource.javax.xml.stream.jar
(504ms)
[ivy:resolve] downloading http://repo1.maven.org/maven2/org/bouncycastle/bcprov-jdk15on/1.47/bcprov-jdk15on-1.47.jar
...
[ivy:resolve] ...........................................................................................................................................................................................................
(1950kB)
[ivy:resolve] .. (0kB)
[ivy:resolve] downloading http://red5.googlecode.com/svn/repository/jaudiotagger-2.0.4-SNAPSHOT.jar
...
[ivy:resolve] ............................................................. (849kB)
[ivy:resolve] 	[SUCCESSFUL ] red5#jaudiotagger;2.0.4-SNAPSHOT!jaudiotagger.jar (318ms)
[ivy:resolve] downloading http://repository.springsource.com/maven/bundles/external/net/sourceforge/cglib/com.springsource.net.sf.cglib/2.2.0/com.springsource.net.sf.cglib-2.2.0.jar
...
[ivy:resolve] ............................................... (319kB)
[ivy:resolve] .. (0kB)
[ivy:resolve] downloading http://repository.springsource.com/maven/bundles/external/org/aopalliance/com.springsource.org.aopalliance/1.0.0/com.springsource.org.aopalliance-1.0.0.jar
...
[ivy:resolve] ... (4kB)
[ivy:resolve] .. (0kB)
[ivy:resolve] downloading http://repo1.maven.org/maven2/org/apache/mina/mina-integration-beans/2.0.5/mina-integration-beans-2.0.5.jar
...
[ivy:resolve] ..... (39kB)
[ivy:resolve] .. (0kB)
[ivy:resolve] 	[SUCCESSFUL ] org.apache.mina#mina-integration-beans;2.0.5!mina-integration-beans.jar(bundle)
(212ms)
[ivy:resolve] downloading http://repo1.maven.org/maven2/org/apache/mina/mina-integration-beans/2.0.5/mina-integration-beans-2.0.5-sources.jar
...
[ivy:resolve] ..... (37kB)
[ivy:resolve] .. (0kB)
[ivy:resolve] 	[SUCCESSFUL ] org.apache.mina#mina-integration-beans;2.0.5!mina-integration-beans.jar(source)
(217ms)
[ivy:resolve] downloading http://repo1.maven.org/maven2/org/apache/mina/mina-integration-beans/2.0.5/mina-integration-beans-2.0.5-javadoc.jar
...
[ivy:resolve] ................. (161kB)
[ivy:resolve] .. (0kB)
[ivy:resolve] 	[SUCCESSFUL ] org.apache.mina#mina-integration-beans;2.0.5!mina-integration-beans.jar(javadoc)
(204ms)
[ivy:resolve] downloading http://repo1.maven.org/maven2/org/apache/mina/mina-integration-jmx/2.0.5/mina-integration-jmx-2.0.5.jar
...
[ivy:resolve] ... (27kB)
[ivy:resolve] .. (0kB)
[ivy:resolve] 	[SUCCESSFUL ] org.apache.mina#mina-integration-jmx;2.0.5!mina-integration-jmx.jar(bundle)
(227ms)
[ivy:resolve] downloading http://repo1.maven.org/maven2/org/apache/mina/mina-integration-jmx/2.0.5/mina-integration-jmx-2.0.5-sources.jar
...
[ivy:resolve] .. (18kB)
[ivy:resolve] .. (0kB)
[ivy:resolve] 	[SUCCESSFUL ] org.apache.mina#mina-integration-jmx;2.0.5!mina-integration-jmx.jar(source)
(217ms)
[ivy:resolve] downloading http://repo1.maven.org/maven2/org/apache/mina/mina-integration-jmx/2.0.5/mina-integration-jmx-2.0.5-javadoc.jar
...
[ivy:resolve] ..... (49kB)
[ivy:resolve] .. (0kB)
[ivy:resolve] 	[SUCCESSFUL ] org.apache.mina#mina-integration-jmx;2.0.5!mina-integration-jmx.jar(javadoc)
(197ms)
[ivy:resolve] downloading http://repo1.maven.org/maven2/org/apache/mina/mina-core/2.0.5/mina-core-2.0.5.jar
...
[ivy:resolve] ............................................................ (630kB)
[ivy:resolve] .. (0kB)
[ivy:resolve] 	[SUCCESSFUL ] org.apache.mina#mina-core;2.0.5!mina-core.jar(bundle) (119ms)
[ivy:resolve] downloading http://repo1.maven.org/maven2/org/apache/mina/mina-core/2.0.5/mina-core-2.0.5-sources.jar
...
[ivy:resolve] ........................................................................................
(561kB)
[ivy:resolve] .. (0kB)
[ivy:resolve] 	[SUCCESSFUL ] org.apache.mina#mina-core;2.0.5!mina-core.jar(source) (264ms)
[ivy:resolve] downloading http://repo1.maven.org/maven2/org/apache/mina/mina-core/2.0.5/mina-core-2.0.5-javadoc.jar
...
[ivy:resolve] ..................................................................................................................................................................................................................................................
(2195kB)
[ivy:resolve] .. (0kB)
[ivy:resolve] 	[SUCCESSFUL ] org.apache.mina#mina-core;2.0.5!mina-core.jar(javadoc) (334ms)
[ivy:resolve] :: resolution report :: resolve 3876ms :: artifacts dl 14427ms
	---------------------------------------------------------------------
	|                  |            modules            ||   artifacts   |
	|       conf       | number| search|dwnlded|evicted|| number|dwnlded|
	---------------------------------------------------------------------
	|       java6      |   43  |   3   |   3   |   0   ||   49  |   17  |
	---------------------------------------------------------------------
[ivy:resolve] 
[ivy:resolve] :: problems summary ::
[ivy:resolve] :::: WARNINGS
[ivy:resolve] 		[FAILED     ] org.apache.commons#commons-modeler;2.0.1!commons-modeler.jar:
Downloaded file size doesn't match expected Content Length for http://oss.sonatype.org/content/repositories/central/commons-modeler/commons-modeler/2.0.1/commons-modeler-2.0.1.jar.
Please retry. (729ms)
[ivy:resolve] 		[FAILED     ] org.apache.commons#commons-modeler;2.0.1!commons-modeler.jar:
Downloaded file size doesn't match expected Content Length for http://oss.sonatype.org/content/repositories/central/commons-modeler/commons-modeler/2.0.1/commons-modeler-2.0.1.jar.
Please retry. (729ms)
[ivy:resolve] 	==== sonatype: tried
[ivy:resolve] 	  http://oss.sonatype.org/content/repositories/sourceforge-releases/org.apache.commons/commons-modeler-2.0.1.jar
[ivy:resolve] 	  http://oss.sonatype.org/content/repositories/central/commons-modeler/commons-modeler/2.0.1/commons-modeler-2.0.1.jar
[ivy:resolve] 		[FAILED     ] org.objectweb.asm#com.springsource.org.objectweb.asm;3.2.0!com.springsource.org.objectweb.asm.jar:
Downloaded file size doesn't match expected Content Length for http://repository.springsource.com/maven/bundles/external/org/objectweb/asm/com.springsource.org.objectweb.asm/3.2.0/com.springsource.org.objectweb.asm-3.2.0.jar.
Please retry. (600ms)
[ivy:resolve] 		[FAILED     ] org.objectweb.asm#com.springsource.org.objectweb.asm;3.2.0!com.springsource.org.objectweb.asm.jar:
Downloaded file size doesn't match expected Content Length for http://repository.springsource.com/maven/bundles/external/org/objectweb/asm/com.springsource.org.objectweb.asm/3.2.0/com.springsource.org.objectweb.asm-3.2.0.jar.
Please retry. (600ms)
[ivy:resolve] 	==== springsource-external: tried
[ivy:resolve] 	  http://repository.springsource.com/maven/bundles/external/org/objectweb/asm/com.springsource.org.objectweb.asm/3.2.0/com.springsource.org.objectweb.asm-3.2.0.jar
[ivy:resolve] 		[FAILED     ] org.antlr#com.springsource.org.antlr;3.1.3!com.springsource.org.antlr.jar:
Downloaded file size doesn't match expected Content Length for http://repository.springsource.com/maven/bundles/external/org/antlr/com.springsource.org.antlr/3.1.3/com.springsource.org.antlr-3.1.3.jar.
Please retry. (1290ms)
[ivy:resolve] 		[FAILED     ] org.antlr#com.springsource.org.antlr;3.1.3!com.springsource.org.antlr.jar:
Downloaded file size doesn't match expected Content Length for http://repository.springsource.com/maven/bundles/external/org/antlr/com.springsource.org.antlr/3.1.3/com.springsource.org.antlr-3.1.3.jar.
Please retry. (1290ms)
[ivy:resolve] 	==== springsource-external: tried
[ivy:resolve] 	  http://repository.springsource.com/maven/bundles/external/org/antlr/com.springsource.org.antlr/3.1.3/com.springsource.org.antlr-3.1.3.jar
[ivy:resolve] 		[FAILED     ] org.python#jython-standalone;2.5.2!jython-standalone.jar: impossible
to move part file to definitive one: /home/jenkins/.ivy2/cache/org.python/jython-standalone/jars/jython-standalone-2.5.2.jar.part
-> /home/jenkins/.ivy2/cache/org.python/jython-standalone/jars/jython-standalone-2.5.2.jar
(428ms)
[ivy:resolve] 		[FAILED     ] org.python#jython-standalone;2.5.2!jython-standalone.jar: impossible
to move part file to definitive one: /home/jenkins/.ivy2/cache/org.python/jython-standalone/jars/jython-standalone-2.5.2.jar.part
-> /home/jenkins/.ivy2/cache/org.python/jython-standalone/jars/jython-standalone-2.5.2.jar
(428ms)
[ivy:resolve] 	==== central: tried
[ivy:resolve] 	  http://repo1.maven.org/maven2/org/python/jython-standalone/2.5.2/jython-standalone-2.5.2.jar
[ivy:resolve] 		[FAILED     ] org.bouncycastle#bcprov-jdk15on;1.47!bcprov-jdk15on.jar: invalid
sha1: expected=b6f5d9926b0afbde9f4dbe3db88c5247be7794bb computed=148944d10eb610cad04f5169df68e1a9e2238705
(139ms)
[ivy:resolve] 		[FAILED     ] org.bouncycastle#bcprov-jdk15on;1.47!bcprov-jdk15on.jar: invalid
sha1: expected=b6f5d9926b0afbde9f4dbe3db88c5247be7794bb computed=148944d10eb610cad04f5169df68e1a9e2238705
(139ms)
[ivy:resolve] 	==== central: tried
[ivy:resolve] 	  http://repo1.maven.org/maven2/org/bouncycastle/bcprov-jdk15on/1.47/bcprov-jdk15on-1.47.jar
[ivy:resolve] 		[FAILED     ] net.sourceforge.cglib#com.springsource.net.sf.cglib;2.2.0!com.springsource.net.sf.cglib.jar:
/home/jenkins/.ivy2/cache/net.sourceforge.cglib/com.springsource.net.sf.cglib/jars/com.springsource.net.sf.cglib-2.2.0.jar.part
(No such file or directory) (1031ms)
[ivy:resolve] 		[FAILED     ] net.sourceforge.cglib#com.springsource.net.sf.cglib;2.2.0!com.springsource.net.sf.cglib.jar:
/home/jenkins/.ivy2/cache/net.sourceforge.cglib/com.springsource.net.sf.cglib/jars/com.springsource.net.sf.cglib-2.2.0.jar.part
(No such file or directory) (1031ms)
[ivy:resolve] 	==== springsource-external: tried
[ivy:resolve] 	  http://repository.springsource.com/maven/bundles/external/net/sourceforge/cglib/com.springsource.net.sf.cglib/2.2.0/com.springsource.net.sf.cglib-2.2.0.jar
[ivy:resolve] 		[FAILED     ] org.aopalliance#com.springsource.org.aopalliance;1.0.0!com.springsource.org.aopalliance.jar:
/home/jenkins/.ivy2/cache/org.aopalliance/com.springsource.org.aopalliance/jars/com.springsource.org.aopalliance-1.0.0.jar.part
(No such file or directory) (355ms)
[ivy:resolve] 		[FAILED     ] org.aopalliance#com.springsource.org.aopalliance;1.0.0!com.springsource.org.aopalliance.jar:
/home/jenkins/.ivy2/cache/org.aopalliance/com.springsource.org.aopalliance/jars/com.springsource.org.aopalliance-1.0.0.jar.part
(No such file or directory) (355ms)
[ivy:resolve] 	==== springsource-external: tried
[ivy:resolve] 	  http://repository.springsource.com/maven/bundles/external/org/aopalliance/com.springsource.org.aopalliance/1.0.0/com.springsource.org.aopalliance-1.0.0.jar
[ivy:resolve] 		::::::::::::::::::::::::::::::::::::::::::::::
[ivy:resolve] 		::              FAILED DOWNLOADS            ::
[ivy:resolve] 		:: ^ see resolution messages for details  ^ ::
[ivy:resolve] 		::::::::::::::::::::::::::::::::::::::::::::::
[ivy:resolve] 		:: org.apache.commons#commons-modeler;2.0.1!commons-modeler.jar
[ivy:resolve] 		:: org.objectweb.asm#com.springsource.org.objectweb.asm;3.2.0!com.springsource.org.objectweb.asm.jar
[ivy:resolve] 		:: org.antlr#com.springsource.org.antlr;3.1.3!com.springsource.org.antlr.jar
[ivy:resolve] 		:: org.python#jython-standalone;2.5.2!jython-standalone.jar
[ivy:resolve] 		:: org.bouncycastle#bcprov-jdk15on;1.47!bcprov-jdk15on.jar
[ivy:resolve] 		:: net.sourceforge.cglib#com.springsource.net.sf.cglib;2.2.0!com.springsource.net.sf.cglib.jar
[ivy:resolve] 		:: org.aopalliance#com.springsource.org.aopalliance;1.0.0!com.springsource.org.aopalliance.jar
[ivy:resolve] 		::::::::::::::::::::::::::::::::::::::::::::::
[ivy:resolve] 
[ivy:resolve] :: USE VERBOSE OR DEBUG MESSAGE LEVEL FOR MORE DETAILS

BUILD FAILED
/x1/jenkins/jenkins-slave/workspace/openmeetings/singlewebapp/build.xml:867: The following
error occurred while executing this line:
/x1/jenkins/jenkins-slave/workspace/openmeetings/singlewebapp/build/red5/server/build.xml:205:
The following error occurred while executing this line:
/x1/jenkins/jenkins-slave/workspace/openmeetings/singlewebapp/build/red5/server/build.xml:219:
The following error occurred while executing this line:
/x1/jenkins/jenkins-slave/workspace/openmeetings/singlewebapp/build/red5/server/build.xml:170:
impossible to resolve dependencies:
	resolve failed - see output for details

Total time: 50 seconds
Build step 'Invoke Ant' marked build as failure
Archiving artifacts

Mime
View raw message